European Parliament committee meeting
type: Concept
type: ActivityType
created: 2023-10-31
deprecated: false
broader: Meeting activity
definition: Parliamentary committee meeting.
in scheme: EP taxonomy on activities.
preferred label: Riunione della commissione del Parlamento europeo @it
preferred label: Laqgħa tal-kumitat tal-Parlament Ewropew @mt
preferred label: Európai Parlament bizottsági ülés @hu
preferred label: Reuniune a unei comisii a Parlamentului European @ro
preferred label: Schůze výboru Evropského parlamentu @cs
preferred label: Cruinniú coiste de Pharlaimint na hEorpa @ga
preferred label: Reunión de comisión del Parlamento Europeo @es
preferred label: Europos Parlamento komiteto posėdis @lt
preferred label: Eiropas Parlamenta komitejas sanāksme @lv
preferred label: Ausschusssitzung des Europäischen Parlaments @de
preferred label: Заседание на комисия на Европейския парламент @bg
preferred label: Schôdza výboru Európskeho parlamentu: @sk
preferred label: Euroopa Parlamendi komisjoni koosolek @et
preferred label: Réunion de commission du Parlement européen @fr
preferred label: Vergadering van een commissie van het Europees Parlement @nl
preferred label: Posiedzenie komisji Parlamentu Europejskiego @pl
preferred label: Europa-Parlamentets udvalgsmøde @da
preferred label: Seja odbora Evropskega parlamenta @sl
preferred label: Reunião de comissão do Parlamento Europeu @pt
preferred label: Euroopan parlamentin valiokunnan kokous @fi
preferred label: Utskottssammanträde i Europaparlamentet @sv
preferred label: Sjednica odbora Europskog parlamenta @hr
preferred label: Συνεδρίαση επιτροπής του Ευρωπαϊκού Κοινοβουλίου @el

Request for roll call vote
type: Concept
type: ActivityType
created: 2023-10-31
deprecated: false
broader: Proceeding activity
definition: Request for a vote to happen in roll call mode.
in scheme: EP taxonomy on activities.
preferred label: Žiadosť o hlasovanie podľa mien @sk
preferred label: Nimelise hääletuse taotlus @et
preferred label: Nimenhuutoäänestystä koskeva pyyntö @fi
preferred label: Begäran om omröstning med namnupprop @sv
preferred label: Demande de vote par appel nominal @fr
preferred label: Richiesta di votazione per appello nominale @it
preferred label: Talba għal votazzjoni b’sejħa tal-ismijiet @mt
preferred label: Wniosek o głosowanie imienne @pl
preferred label: Zahtjev za poimenično glasovanje @hr
preferred label: Név szerinti szavazás iránti kérelem @hu
preferred label: Αίτηση για ψηφοφορία με ονομαστική κλήση @el
preferred label: Solicitud de votación nominal @es
preferred label: Cerere de vot prin apel nominal @ro
preferred label: Antrag auf namentliche Abstimmung @de
preferred label: Vardinio balsavimo prašymas @lt
preferred label: Zahteva za poimensko glasovanje @sl
preferred label: Iarraidh ar vótáil le glaoch rolla @ga
preferred label: Verzoek om hoofdelijke stemming @nl
preferred label: Žádost o jmenovité hlasování @cs
preferred label: Pieprasījums balsot pēc saraksta @lv
preferred label: Anmodning om afstemning ved navneopråb @da
preferred label: Искане за поименно гласуване @bg
preferred label: Pedido de votação nominal @pt

Tabling of a document to European Parliament plenary sitting
type: Concept
type: ActivityType
created: 2023-10-31
deprecated: false
broader: Plenary activity
definition: Tabling a text for its further consideration by the plenary of the European Parliament.
in scheme: EP taxonomy on activities.
preferred label: Κατάθεση εγγράφου στη συνεδρίαση της ολομέλειας του Ευρωπαϊκού Κοινοβουλίου @el
preferred label: Předložení dokumentu na plenárním zasedání Evropského parlamentu @cs
preferred label: Внасяне на документ на пленарно заседание на Европейския парламент @bg
preferred label: Apresentação de um documento ao plenário do Parlamento Europeu @pt
preferred label: Podnošenje dokumenta za plenarnu sjednicu Europskog parlamenta @hr
preferred label: Dépôt d’un document à la session plénière du Parlement européen @fr
preferred label: Dokumentum előterjesztése az Európai Parlament plenáris ülésére @hu
preferred label: Indiening van een document in de plenaire vergadering van het Europees Parlement @nl
preferred label: Einreichung eines Dokuments für die Plenartagung des Europäischen Parlaments @de
preferred label: Asiakirja jätetty käsiteltäväksi Euroopan parlamentin täysistunnossa @fi
preferred label: Dokumento pateikimas svarstyti Europos Parlamento plenariniame posėdyje @lt
preferred label: Predloženie dokumentu na plenárnej schôdzi Európskeho parlamentu @sk
preferred label: Framläggande av ett dokument till Europaparlamentets plenarsammanträde @sv
preferred label: Presentación de un documento en la sesión plenaria del Parlamento Europeo @es
preferred label: Przedłożenie dokumentu na posiedzeniu plenarnym Parlamentu Europejskiego @pl
preferred label: Depunerea unui document în plenul Parlamentului European @ro
preferred label: Dokumendi esitamine Euroopa Parlamendi täiskogu istungile @et
preferred label: Tressiq ta’ dokument quddiem is-seduta plenarja tal-Parlament Ewropew @mt
preferred label: Predložitev dokumenta na plenarnem zasedanju Evropskega parlamenta @sl
preferred label: Dokumenta iesniegšana Eiropas Parlamenta plenārsēdē @lv
preferred label: Doiciméad a chur síos do shuí iomlánach Pharlaimint na hEorpa @ga
preferred label: Presentazione di un documento alla seduta plenaria del Parlamento europeo @it
preferred label: Forelæggelse af et dokument til Europa-Parlamentets plenarmøde @da

Proposal referred to plenary
type: Concept
type: ActivityType
created: 2023-10-31
deprecated: false
broader: Proceeding activity
definition: Proposal is referred to plenary.
in scheme: EP taxonomy on activities.
narrow match: START byEP
preferred label: Priekšlikums nodots izskatīšanai plenārsēdē @lv
preferred label: Predlog predložen na plenarnem zasedanju @sl
preferred label: Propuesta remitida al Pleno @es
preferred label: Forslag henvist til plenarforsamlingen @da
preferred label: Ettepanek edastati täiskogule @et
preferred label: Pasiūlymas perduotas plenarinei sesijai @lt
preferred label: Proposta deferita alla plenaria @it
preferred label: Proposta submetida ao plenário @pt
preferred label: Propunere supusă atenției plenului @ro
preferred label: Voorstel voorgelegd aan de plenaire vergadering @nl
preferred label: Propozycja przekazana na posiedzeniu plenarnym @pl
preferred label: Vorlage des Vorschlags an das Plenum @de
preferred label: Förslag som hänskjutits till kammaren @sv
preferred label: A javaslat továbbítása a plenáris üléshez @hu
preferred label: Proposta riferuta lill-plenarja @mt
preferred label: Proposition soumise à la plénière @fr
preferred label: Návrh odovzdaný plenárnemu zasadnutiu @sk
preferred label: Предложение, отнесено за разглеждане на пленарно заседание @bg
preferred label: Ehdotus siirretään täysistunnon käsiteltäväksi @fi
preferred label: Prijedlog upućen na plenarnu sjednicu @hr
preferred label: Η πρόταση παραπέμπεται στην ολομέλεια @el
preferred label: Návrh postoupen plenárnímu zasedání @cs
preferred label: Togra arna tharchur chuig an suí iomlánach @ga

Announcement of Council position at 1st reading in the EP plenary
type: Concept
created: 2023-10-31
deprecated: false
broader: Proceeding activity
definition: Council's position is announced in plenary.
in scheme: EP taxonomy on activities.
preferred label: A Tanács első olvasatban elfogadott álláspontjának bejelentése az Európai Parlament plenáris ülésén @hu
preferred label: Anunțarea poziției Consiliului în prima lectură în plenul PE @ro
preferred label: Communication de la position du Conseil en première lecture en séance plénière du PE @fr
preferred label: Oznámení postoje Rady v prvním čtení na plenárním zasedání EP @cs
preferred label: Nõukogu seisukoha teatavakstegemine esimesel lugemisel Euroopa Parlamendi täiskogu istungil @et
preferred label: Ανακοίνωση της θέσης του Συμβουλίου σε 1η ανάγνωση στην ολομέλεια του ΕΚ @el
preferred label: Annuncio della posizione del Consiglio in prima lettura nella plenaria del PE @it
preferred label: Anuncio de la posición del Consejo en primera lectura en el pleno del PE @es
preferred label: Fógra maidir le seasamh ón gComhairle ar an gcéad léamh i seisiún iomlánach Pharlaimint na hEorpa @ga
preferred label: Anúncio da posição do Conselho em 1.ª leitura na sessão plenária do PE @pt
preferred label: Обявяване на позицията на Съвета на 1-во четене на пленарното заседание на ЕП @bg
preferred label: Ogłoszenie stanowiska Rady w pierwszym czytaniu na posiedzeniu plenarnym PE @pl
preferred label: Oznámenie pozície Rady v prvom čítaní na plenárnom zasadnutí EP @sk
preferred label: Razglasitev stališča Sveta na prvi obravnavi na plenarnem zasedanju EP @sl
preferred label: Tħabbir tal-pożizzjoni tal-Kunsill fl-1 qari fil-plenarja tal-PE @mt
preferred label: Bekanntgabe des Standpunkts des Rates in 1. Lesung in der Plenarsitzung des EP @de
preferred label: Bekendmaking van het standpunt van de Raad in eerste lezing in de plenaire vergadering van het EP @nl
preferred label: Neuvoston ensimmäisen käsittelyn kannasta ilmoitettu Euroopan parlamentin täysistunnossa @fi
preferred label: Objava stajališta Vijeća u prvom čitanju na plenarnoj sjednici EP-a @hr
preferred label: Tillkännagivande i kammaren av rådets ståndpunkt vid Europaparlamentets första behandling @sv
preferred label: Paziņojums par Padomes nostāju 1. lasījumā EP plenārsēdē @lv
preferred label: Meddelelse om Rådets holdning ved førstebehandling på Europa-Parlamentets plenarforsamling @da
preferred label: Per pirmąjį svarstymą priimtos Tarybos pozicijos paskelbimas EP plenariniame posėdyje @lt

Resumption of a meeting
type: Concept
created: 2024-07-01
deprecated: false
alternative label: Reluarea ședinței @ro
alternative label: Znovuzahájení zasedání @cs
alternative label: Reprise d'une session @fr
alternative label: Återupptagande av ett sammanträde @sv
alternative label: Resumption of a sitting
alternative label: Atosú an tsuí @ga
alternative label: Nastavak sjednice @hr
alternative label: Pokračovanie rokovania @sk
alternative label: Tkomplija ta’ seduta @mt
alternative label: Wiederaufnahme einer Sitzung @de
alternative label: Ripresa di una seduta @it
alternative label: Istunnon jatkaminen @fi
alternative label: Reanudación de la sesión @es
alternative label: Sēdes atsākšana @lv
alternative label: Istungi jätkamine @et
alternative label: Reinício da sessão @pt
broader: Meeting activity
definition: Resuming of a meeting or a sitting after a break.
in scheme: EP taxonomy on activities.
preferred label: Hervatting van een vergadering @nl
preferred label: Wznowienie posiedzenia @pl
preferred label: Obnovení schůze @cs
preferred label: Nadaljevanje seje @sl
preferred label: Atosú cruinnithe @ga
preferred label: Återupptagande av ett möte @sv
preferred label: Επανάληψη συνεδρίασης @el
preferred label: Wiederaufnahme einer Versammlung @de
preferred label: Kokouksen jatkaminen @fi
preferred label: Възобновяване на заседанието @bg
preferred label: Reanudación de una reunión @es
preferred label: Tkomplija ta’ laqgħa @mt
preferred label: Ripresa di una riunione @it
preferred label: Reluarea unei reuniuni @ro
preferred label: Sanāksmes atsākšana @lv
preferred label: Az ülés folytatása @hu
preferred label: Posėdžio atnaujinimas @lt
preferred label: Pokračovanie schôdze @sk
preferred label: Reprise d'une réunion @fr
preferred label: Reinício de uma reunião @pt
preferred label: Koosoleku jätkamine @et
preferred label: Genoptagelse af et møde @da
preferred label: Nastavak sastanka @hr

Interinstitutional negotiation
type: ActivityType
type: Concept
created: 2023-10-31
deprecated: false
broader: Proceeding activity
definition: Interinstitutional negotiations.
in scheme: EP taxonomy on activities.
preferred label: Διοργανική διαπραγμάτευση @el
preferred label: Interinstitucionální jednání @cs
preferred label: Institutsioonidevahelised läbirääkimised @et
preferred label: Medziinštitucionálne rokovania @sk
preferred label: Negozjati interistituzzjonali @mt
preferred label: Iestāžu sarunas @lv
preferred label: Medinstitucionalno pogajanje @sl
preferred label: Interinstitutionelle Verhandlungen @de
preferred label: Caibidlíocht idirinstitiúideach @ga
preferred label: Tarpinstitucinės derybos @lt
preferred label: Interinstitutionell förhandling @sv
preferred label: Междуинституционални преговори @bg
preferred label: Toimielinten väliset neuvottelut @fi
preferred label: Međuinstitucijski pregovori @hr
preferred label: Négociation interinstitutionnelle @fr
preferred label: Negociación interinstitucional @es
preferred label: Interinstitutionelle forhandlinger @da
preferred label: Intézményközi tárgyalás @hu
preferred label: Interinstitutionele onderhandeling @nl
preferred label: Negoziato interistituzionale @it
preferred label: Negociere interinstituțională @ro
preferred label: Negocjacje międzyinstytucjonalne @pl
preferred label: Negociação interinstitucional @pt

Voting meeting part
type: Concept
created: 2023-10-31
deprecated: false
broader: Meeting activity
definition: Voting part of a meeting.
in scheme: EP taxonomy on activities.
preferred label: Partie de vote de la réunion @fr
preferred label: Част от заседанието за гласуване @bg
preferred label: Teil der Abstimmungssitzung @de
preferred label: Ședința de votare @ro
preferred label: Balsavimo dalis @lt
preferred label: An chuid den chruinniú vótála @ga
preferred label: Część głosowania @pl
preferred label: Parte da reunião de votação @pt
preferred label: Omröstningsdelen @sv
preferred label: Dio za glasovanje @hr
preferred label: Afstemningsdel @da
preferred label: Balsošanas sanāksmes daļa @lv
preferred label: Μέρος της ψηφοφορίας @el
preferred label: Hääletuskoosoleku osa @et
preferred label: Deel van de stemvergadering @nl
preferred label: Äänestyskokousosa @fi
preferred label: Parti tal-laqgħa tal-votazzjoni @mt
preferred label: Parte de la reunión de votación @es
preferred label: Szavazási rész @hu
preferred label: Časť hlasovania @sk
preferred label: Část schůze s hlasováním @cs
preferred label: Del za glasovanje @sl
preferred label: Parte di voto della riunione @it

Approval of the Council’s position by the EP at 2nd reading (adoption of the legislative act)
type: ActivityType
type: Concept
created: 2023-10-31
deprecated: false
broader: Plenary activity
definition: This concept is used in accordance with the Treaty: ‘Second reading — If, within 3 months of such communication, the European Parliament: (a) approves the Council’s position at first reading or has not taken a decision, the act concerned shall be deemed to have been adopted in the wording which corresponds to the position of the Council.’
in scheme: EP taxonomy on activities.
preferred label: Aprobación por el PE en segunda lectura de la posición del Consejo (adopción del acto legislativo) @es
preferred label: Parlamentets godkendelse af Rådets holdning ved andenbehandling (vedtagelse af retsakten) @da
preferred label: Europaparlamentets godkännande av rådets ståndpunkt vid andra behandlingen (antagande av lagstiftningsakten) @sv
preferred label: Nõukogu seisukoha heakskiitmine Euroopa Parlamendi poolt teisel lugemisel (seadusandliku akti vastuvõtmine) @et
preferred label: Schválení postoje Rady v EP ve 2. čtení (přijetí legislativního aktu) @cs
preferred label: Aprovação da posição do Conselho pelo PE em segunda leitura (adoção do ato legislativo) @pt
preferred label: Euroopan parlamentti hyväksynyt neuvoston kannan toisessa käsittelyssä (säädös annettu) @fi
preferred label: Schválenie pozície Rady zo strany EP v druhom čítaní (prijatie legislatívneho aktu) @sk
preferred label: Goedkeuring van het standpunt van de Raad door het EP in 2e lezing (vaststelling van de wetgevingshandeling) @nl
preferred label: Aprobarea poziției Consiliului de către PE în a doua lectură (adoptarea actului legislativ) @ro
preferred label: Billigung des Standpunkts des Rates durch das EP in 2. Lesung @de
preferred label: Padomes nostājas apstiprinājums Eiropas Parlamentā 2. lasījumā (tiesību akta pieņemšana) @lv
preferred label: Zatwierdzenie stanowiska Rady przez PE w drugim czytaniu (przyjęcie aktu ustawodawczego) @pl
preferred label: Formheas sheasamh na Comhairle ag PE ar an 2ú léamh (glacadh an ghnímh reachtaigh) @ga
preferred label: Έγκριση της θέσης του Συμβουλίου από το ΕΚ σε δεύτερη ανάγνωση (έγκριση της νομοθετικής πράξης) @el
preferred label: Approvazione della posizione del Consiglio da parte del PE in seconda lettura (adozione dell'atto legislativo) @it
preferred label: A Tanács álláspontjának jóváhagyása az Európai Parlament által második olvasatban (a jogalkotási aktus elfogadása) @hu
preferred label: Odobritev stališča Sveta s strani EP v drugi obravnavi (sprejetje zakonodajnega akta) @sl
preferred label: EP odobrava stajalište Vijeća u drugom čitanju (donošenje zakonodavnog akta) @hr
preferred label: Приемане на позицията на Съвета от ЕП на второ четене (приемане на законодателния акт) @bg
preferred label: Tarybos pozicijos patvirtinimas EP antruoju svarstymu (teisėkūros procedūra priimamo akto priėmimas) @lt
preferred label: Approbation de la position du Conseil par le PE en deuxième lecture (adoption de l’acte législatif) @fr
preferred label: Approvazzjoni tal-pożizzjoni tal-Kunsill mill-PE fit-2 qari (adozzjoni tal-att leġiżlattiv) @mt

Request for separate vote
type: ActivityType
type: Concept
created: 2023-10-31
deprecated: false
broader: Proceeding activity
definition: Request for a vote to be separated.
in scheme: EP taxonomy on activities.
preferred label: Vótáil ar leithligh a iarraidh @ga
preferred label: Žádost o oddělené hlasování @cs
preferred label: Pieprasījums balsot atsevišķi @lv
preferred label: Verzoek om aparte stemming @nl
preferred label: Begäran om särskild omröstning @sv
preferred label: Zahteva za ločeno glasovanje @sl
preferred label: Antrag auf gesonderte Abstimmung @de
preferred label: Solicitud de votación por separado @es
preferred label: Eraldi hääletuse taotlus @et
preferred label: Pedido de votação em separado @pt
preferred label: Žiadosť o oddelené hlasovanie @sk
preferred label: Demande de vote séparé @fr
preferred label: Talba għal votazzjoni separata @mt
preferred label: Αίτηση για χωριστή ψηφοφορία @el
preferred label: Richiesta di votazione distinta @it
preferred label: Erillistä äänestystä koskeva pyyntö @fi
preferred label: Zahtjev za odvojeno glasovanje @hr
preferred label: Wniosek o głosowanie odrębne @pl
preferred label: Cerere de vot separat @ro
preferred label: Prašymas dėl atskiro balsavimo @lt
preferred label: Искане за отделно гласуване @bg
preferred label: Külön szavazásra irányuló kérelem @hu
preferred label: Anmodning om særskilt afstemning @da

European Parliament meeting part
type: Concept
type: ActivityType
created: 2023-10-31
deprecated: false
broader: Meeting activity
definition: The European Parliament meeting part is a subdivision of a sitting or a meeting.
in scheme: EP taxonomy on activities.
preferred label: Parti tal-laqgħa tal-Parlament Ewropew @mt
preferred label: Euroopan parlamentin kokouksen osa @fi
preferred label: Parte della riunione del Parlamento europeo @it
preferred label: Európai parlamenti ülés része @hu
preferred label: Euroopa Parlamendi koosoleku osa @et
preferred label: Teil der Sitzung des Europäischen Parlaments @de
preferred label: Část schůze Evropského parlamentu @cs
preferred label: Część posiedzenia Parlamentu Europejskiego @pl
preferred label: Partie de réunion du Parlement européen @fr
preferred label: Parte a unei reuniuni a Parlamentului European @ro
preferred label: Cuid de chruinniú Pharlaimint na hEorpa @ga
preferred label: Časť schôdze Európskeho parlamentu @sk
preferred label: Del seje Evropskega parlamenta @sl
preferred label: Del av sammanträde i Europaparlamentet @sv
preferred label: Parte de la reunión del Parlamento Europeo @es
preferred label: Μέρος της συνεδρίασης του Ευρωπαϊκού Κοινοβουλίου @el
preferred label: Europos Parlamento posėdžio dalis @lt
preferred label: Del af Europa-Parlamentets møde @da
preferred label: Deel van een vergadering van het Europees Parlement @nl
preferred label: Eiropas Parlamenta sanāksmes daļa @lv
preferred label: Parte de reunião do Parlamento Europeu @pt
preferred label: Част от заседание на Европейския парламент @bg
preferred label: Dio sastanka Europskog parlamenta @hr

Signature
type: Concept
type: ActivityType
created: 2023-10-31
deprecated: false
broader: Proceeding activity
definition: Signature of a document or an act.
in scheme: EP taxonomy on activities.
narrow match: SIGN PAR byEP CONSIL
narrow match: SIGN byEP CONSIL
narrow match: SIGN BUD byEP
preferred label: Υπογραφή @el
preferred label: Allekirjoitus @fi
preferred label: Sottoscrizione @it
preferred label: Подпис @bg
preferred label: Podpisanie @pl
preferred label: Assinatura @pt
preferred label: Potpis @hr
preferred label: Síniú @ga
preferred label: Allakirjutamine @et
preferred label: Semnătura @ro
preferred label: Podpis @cs
preferred label: Signatur @da
preferred label: Parašas @lt
preferred label: Underskrift @sv
preferred label: Aláírás @hu
preferred label: Firma @es
preferred label: Paraksts @lv
preferred label: Il-firma @mt
preferred label: Unterzeichnung @de
preferred label: Ondertekening @nl

Vote in European Parliament plenary sitting
type: Concept
type: ActivityType
created: 2023-10-31
deprecated: false
broader: Plenary activity
definition: Vote in the curse of a plenary sitting of the European Parliament.
in scheme: EP taxonomy on activities.
preferred label: Votazione in seduta plenaria del Parlamento europeo @it
preferred label: Głosowanie na posiedzeniu plenarnym Parlamentu Europejskiego @pl
preferred label: Hääletus Euroopa Parlamendi täiskogu istungil @et
preferred label: Гласуване на пленарно заседание на Европейския парламент @bg
preferred label: Abstimmung im Plenum des Europäischen Parlaments @de
preferred label: Glasovanje na plenarnoj sjednici Europskog parlamenta @hr
preferred label: Votación en el Pleno del Parlamento Europeo @es
preferred label: Stemming in de plenaire vergadering van het Europees Parlement @nl
preferred label: Ψηφοφορία στην ολομέλεια του Ευρωπαϊκού Κοινοβουλίου @el
preferred label: Vótáil i suí iomlánach Pharlaimint na hEorpa @ga
preferred label: Szavazás az Európai Parlament plenáris ülésén @hu
preferred label: Balsavimas Europos Parlamento plenariniame posėdyje @lt
preferred label: Glasovanje na plenarnem zasedanju Evropskega parlamenta @sl
preferred label: Vote en séance plénière du Parlement européen @fr
preferred label: Balsojums Eiropas Parlamenta plenārsēdē @lv
preferred label: Afstemning på Europa-Parlamentets plenarmøde @da
preferred label: Hlasování na plenárním zasedání Evropského parlamentu @cs
preferred label: Votazzjoni fis-seduta plenarja tal-Parlament Ewropew @mt
preferred label: Äänestys Euroopan parlamentin täysistunnossa @fi
preferred label: Omröstning vid Europaparlamentets plenarsammanträde @sv
preferred label: Hlasovanie na plenárnej schôdzi Európskeho parlamentu @sk
preferred label: Votação na sessão plenária do Parlamento Europeu @pt
preferred label: Vot în ședința plenară a Parlamentului European @ro

Referral by EP plenary of the matter back to the EP committee responsible for reconsideration
type: ActivityType
type: Concept
created: 2025-01-31
deprecated: false
broader: Plenary activity
definition: Plenary refer back the matter to parliamentary responsible committee for reconsideration.
in scheme: EP taxonomy on activities.
preferred label: An t-ábhar arna tharchur ar ais ag seisiún iomlánach Pharlaimint na hEorpa chuig an gcoiste freagrach de chuid Pharlaimint na hEorpa lena athbhreithniú @ga
preferred label: Klausimo grąžinimas nagrinėti atsakingam EP komitetui EP plenariniame posėdyje @lt
preferred label: Predložitev zadeve na plenarnem zasedanju EP nazaj pristojnemu odboru EP v ponovno obravnavo @sl
preferred label: EP plenārsēdē nodots jautājums atkārtotai izskatīšanai atbildīgajā EP komitejā @lv
preferred label: Retrimiterea chestiunii de către plenul PE comisiei PE competente spre reexaminare @ro
preferred label: Przekazanie na posiedzeniu plenarnym PE sprawy z powrotem do właściwej komisji PE do ponownego rozpatrzenia @pl
preferred label: Zurücküberweisung der Angelegenheit zur erneuten Prüfung an den zuständigen Ausschuss des EP durch das EP-Plenum @de
preferred label: Remisión del asunto a la comisión del PE competente para un nuevo examen por el pleno del PE @es
preferred label: Vrácení věci výboru EP odpovědnému za přezkoumání rozhodnutí na plenárním zasedání EP @cs
preferred label: Renvoi de la question par l’assemblée plénière du PE à la commission compétente du PE pour réexamen @fr
preferred label: Upućivanje predmeta nadležnom odboru EP-a na ponovno razmatranje na plenarnoj sjednici EP-a @hr
preferred label: Riferiment tal-kwistjoni lill-kumitat tal-PE responsabbli għar-rikonsiderazzjoni mill-plenarja tal-PE @mt
preferred label: Rinvio della questione alla commissione del PE competente per il riesame da parte della plenaria del PE @it
preferred label: Henvisning af sagen til fornyet behandling i det ansvarlige EP-udvalg @da
preferred label: Terugverwijzing van de zaak door de plenaire vergadering van het EP naar de verantwoordelijke EP-commissie voor heroverweging @nl
preferred label: Az ügynek az illetékes parlamenti bizottsághoz való visszautalása ismételt vizsgálat céljából az Európai Parlament plenáris ülése által @hu
preferred label: Euroopan parlamentin täysistunto palauttanut asian asiasta vastaavaan Euroopan parlamentin valiokuntaan uudelleentarkasteltavaksi @fi
preferred label: Vrátenie veci gestorskému výboru EP na prehodnotenie plénom EP @sk
preferred label: Отнасяне на въпроса до компетентната комисия, за да го разгледа отново, на пленарното заседание на ЕП @bg
preferred label: Αναπομπή του θέματος στην αρμόδια για επανεξέταση επιτροπή του ΕΚ από την ολομέλεια του ΕΚ @el
preferred label: Devolução do assunto pelo plenário do PE à comissão competente do PE para reapreciação @pt
preferred label: Kammarens återförvisning av ärendet till det ansvariga utskottet för ny behandling @sv
preferred label: Euroopa Parlamendi täiskogu on saatnud küsimuse tagasi vastutavale Euroopa Parlamendi komiteele uuesti läbivaatamiseks @et

Submission of a contribution by a national chamber
type: ActivityType
type: Concept
created: 2025-01-31
deprecated: false
broader: National chamber activity
definition: National chambers can issue contributions to the drafting of EU law.
in scheme: EP taxonomy on activities.
preferred label: Nacionalinių rūmų nuomonės pateikimas @lt
preferred label: Seisukoha esitamine liikmesriigi koja poolt @et
preferred label: Podnošenje doprinosa od strane nacionalne komore @hr
preferred label: Predloženie príspevku národnej komory @sk
preferred label: Sottomissjoni ta’ kontribuzzjoni minn kamra nazzjonali @mt
preferred label: A nemzeti kamarák hozzájárulásának benyújtása @hu
preferred label: Aighneacht ó sheomra tionóil náisiúnta a chur isteach @ga
preferred label: Presentación de una contribución por una cámara nacional @es
preferred label: Kansallisen kamarin kannanotto @fi
preferred label: Indgivelse af et bidrag fra et nationalt kammer @da
preferred label: Apresentação de uma contribuição por uma câmara nacional @pt
preferred label: Predložitev prispevka s strani nacionalnega doma @sl
preferred label: Předložení příspěvku vnitrostátní komorou @cs
preferred label: Atbildes iesniegšana, ko veic valsts palāta @lv
preferred label: Przedstawienie uwag przez izbę krajową @pl
preferred label: Indiening van een bijdrage door een nationale kamer @nl
preferred label: Inlämning av ett bidrag från en nationell kammare @sv
preferred label: Soumission d'une contribution par une chambre nationale @fr
preferred label: Представяне на становище от национална камара @bg
preferred label: Einreichung eines Beitrags durch eine nationale Kammer @de
preferred label: Depunerea unei contribuții de către o cameră națională @ro
preferred label: Presentazione di un contributo da parte di una camera nazionale @it
preferred label: Υποβολή εισηγήσεων από εθνικό επιμελητήριο @el

Meeting for interinstitutional negotiations
type: Concept
created: 2023-10-31
deprecated: false
broader: Meeting activity
definition: Meeting for interinstitutional negotiations.
in scheme: EP taxonomy on activities.
preferred label: Ülés az intézményközi tárgyalásokhoz @hu
preferred label: Kokous toimielinten välisiä neuvotteluja varten @fi
preferred label: Vergadering voor interinstitutionele onderhandelingen @nl
preferred label: Cruinniú le haghaidh caibidlíochtaí idirinstitiúideacha @ga
preferred label: Møde med henblik på interinstitutionelle forhandlinger @da
preferred label: Kohtumine institutsioonidevahelisteks läbirääkimisteks @et
preferred label: Treffen zu interinstitutionellen Verhandlungen @de
preferred label: Posiedzenie w sprawie negocjacji międzyinstytucjonalnych @pl
preferred label: Reuniune pentru negocieri interinstituționale @ro
preferred label: Sastanak za međuinstitucijske pregovore @hr
preferred label: Schôdza na účely medziinštitucionálnych rokovaní @sk
preferred label: Reunião para as negociações interinstitucionais @pt
preferred label: Susitikimas tarpinstitucinėms deryboms @lt
preferred label: Sammanträde för interinstitutionella förhandlingar @sv
preferred label: Riunione per i negoziati interistituzionali @it
preferred label: Schůze pro interinstitucionální jednání @cs
preferred label: Заседание за междуинституционални преговори @bg
preferred label: Laqgħa għan-negozjati interistituzzjonali @mt
preferred label: Συνεδρίαση για διοργανικές διαπραγματεύσεις @el
preferred label: Réunion pour les négociations interinstitutionnelles @fr
preferred label: Sanāksme iestāžu sarunām @lv
preferred label: Sestanek za medinstitucionalna pogajanja @sl
preferred label: Reunión para las negociaciones interinstitucionales @es

Debating meeting part
type: Concept
created: 2023-10-31
deprecated: false
broader: Meeting activity
definition: Debating part of a meeting.
in scheme: EP taxonomy on activities.
preferred label: Debattdelen av sammanträdet @sv
preferred label: Debatdel @da
preferred label: Parte de la reunión de debate @es
preferred label: Част от дискусионната част от заседанието @bg
preferred label: Arutelukoosoleku osa @et
preferred label: Diskusia o časti schôdze @sk
preferred label: An chuid de na cruinnithe díospóireachta @ga
preferred label: Diskussionsteil @de
preferred label: Del za razpravo @sl
preferred label: Partea de ședință de dezbatere @ro
preferred label: Část věnovaná diskuzím @cs
preferred label: Partie de la réunion de discussion @fr
preferred label: A vitaülésről szóló rész @hu
preferred label: Dio za raspravu @hr
preferred label: Debat over een deel van de vergadering @nl
preferred label: Część posiedzenia dyskusyjnego @pl
preferred label: Riunione di discussione @it
preferred label: Kokouksen keskustelu @fi
preferred label: Diskusijų dalis @lt
preferred label: Μέρος της συνεδρίασης που αφορά τη συζήτηση @el
preferred label: Dibattitu dwar il-parti tal-laqgħa @mt
preferred label: Parte da reunião de debate @pt
preferred label: Debates par sanāksmes daļu @lv

European Parliament delegation meeting
type: Concept
type: ActivityType
created: 2023-10-31
deprecated: false
broader: Meeting activity
definition: Parliamentary delegation meeting.
in scheme: EP taxonomy on activities.
preferred label: Riunione della delegazione del Parlamento europeo @it
preferred label: Reunião de delegação do Parlamento Europeu @pt
preferred label: Reunión de delegación del Parlamento Europeo @es
preferred label: Euroopa Parlamendi delegatsiooni koosolek @et
preferred label: Laqgħa tad-delegazzjoni tal-Parlament Ewropew @mt
preferred label: Заседание на делегация на Европейския парламент @bg
preferred label: Eiropas Parlamenta delegācijas sanāksme @lv
preferred label: Réunion de délégation du Parlement européen @fr
preferred label: Delegationssitzung des Europäischen Parlaments @de
preferred label: Európai Parlament küldöttségi ülés @hu
preferred label: Sjednica izaslanstva Europskog parlamenta @hr
preferred label: Vergadering van een delegatie van het Europees Parlement @nl
preferred label: Συνεδρίαση αντιπροσωπείας του Ευρωπαϊκού Κοινοβουλίου @el
preferred label: Reuniune a unei delegații a Parlamentului European @ro
preferred label: Seja delegacije Evropskega parlamenta @sl
preferred label: Schůze delegace Evropského parlamentu @cs
preferred label: Europa-Parlamentets delegationsmøde @da
preferred label: Delegationssammanträde i Europaparlamentet @sv
preferred label: Posiedzenie delegacji Parlamentu Europejskiego @pl
preferred label: Schôdza delegácie Európskeho parlamentu @sk
preferred label: Cruinniú toscaireachta Pharlaimint na hEorpa @ga
preferred label: Europos Parlamento delegacijos posėdis @lt
preferred label: Euroopan parlamentin valtuuskunnan kokous @fi

Key-debating meeting part
type: Concept
created: 2023-10-31
deprecated: false
broader: Meeting activity
definition: Debating part of a meeting around a key topic.
in scheme: EP taxonomy on activities.
preferred label: Deel van de vergadering debatteren @nl
preferred label: Pagrindinių diskusijų dalis @lt
preferred label: Partea consacrată ședinței de dezbatere @ro
preferred label: Reunião de manutenção da reunião de debate @pt
preferred label: Mødedel til løbende debat @da
preferred label: Galveno debašu sanāksmes daļa @lv
preferred label: Ključni del seje za razpravo @sl
preferred label: An chuid is tábhachtaí den chruinniú díospóireachta @ga
preferred label: Част от дискусионното заседание на Key-debating @bg
preferred label: Keskeinen keskustelukokous @fi
preferred label: A vita kulcsa @hu
preferred label: Partie de la réunion de discussion clé @fr
preferred label: Část věnovaná klíčovému jednání @cs
preferred label: Parti tal-laqgħa Key-debating @mt
preferred label: Ključni dio za raspravu @hr
preferred label: Μέρος της συνεδρίασης με θέμα «Βασική συζήτηση» @el
preferred label: Põhiarutelu osa @et
preferred label: Hauptdiskussions-Sitzungsteil @de
preferred label: Parte de la reunión de debate principal @es
preferred label: Parte di riunione di discussione chiave @it
preferred label: Časť schôdze s kľúčovými diskusiami @sk
preferred label: Dyskusja na temat kluczowych części posiedzenia @pl
preferred label: Den del av sammanträdet som är föremål för debatt @sv

EP decision
type: Concept
type: ActivityType
created: 2023-10-31
deprecated: false
broader: Plenary activity
definition: EP decision refers to a position adopted by the European Parliament on a given issue, as defined in the European Parliament’s Rules of Procedure.
in scheme: EP taxonomy on activities.
narrow match: DEC RSI R1 byEP
narrow match: DEC BUDACT byEP
narrow match: DEC R3 byEP
narrow match: DEC BUDDIS byEP
preferred label: Decisión del PE @es
preferred label: Cinneadh PE @ga
preferred label: Απόφαση του Ευρωπαϊκού Κοινοβουλίου @el
preferred label: Deċiżjoni tal-PE @mt
preferred label: Rozhodnutie EP @sk
preferred label: EP sprendimas @lt
preferred label: Europaparlamentets beslut @sv
preferred label: Beschluss des EP @de
preferred label: Euroopa Parlamendi otsus @et
preferred label: Rozhodnutí EP @cs
preferred label: Decizia PE @ro
preferred label: EP lēmums @lv
preferred label: Odluka EP-a @hr
preferred label: Decyzja PE @pl
preferred label: Európai parlamenti határozat @hu
preferred label: Europa-Parlamentets afgørelse @da
preferred label: Decisão do PE @pt
preferred label: Besluit EP @nl
preferred label: Euroopan parlamentin päätös @fi
preferred label: Решение на Парламента @bg
preferred label: Decisione del Parlamento europeo @it
preferred label: Sklep Evropskega parlamenta @sl
preferred label: Décision du PE @fr

Tabling of amendments in the EP committee responsible
type: ActivityType
type: Concept
created: 2023-10-31
deprecated: false
broader: Parliamentary committee activity
definition: Parliamentary committee table amendment(s)
in scheme: EP taxonomy on activities.
narrow match: TABLAMEND R2 byEP CMT
preferred label: Grozījumu iesniegšana atbildīgajai EP komitejai @lv
preferred label: Módosítások előterjesztése az illetékes európai parlamenti bizottságban @hu
preferred label: Leasuithe a chur síos sa choiste freagrach de chuid Pharlaimint na hEorpa @ga
preferred label: Indiening van amendementen in de verantwoordelijke EP-commissie @nl
preferred label: Predkladanie pozmeňujúcich návrhov v gestorskom výbore EP @sk
preferred label: Κατάθεση τροπολογιών στην αρμόδια επιτροπή του ΕΚ @el
preferred label: Presentación de enmiendas en la comisión competente del PE @es
preferred label: Pakeitimų teikimas atsakingame EP komitete @lt
preferred label: Tressiq ta’ emendi fil-kumitat responsabbli tal-PE @mt
preferred label: Presentazione di emendamenti in seno alla commissione competente del PE @it
preferred label: Składanie poprawek we właściwej komisji PE @pl
preferred label: Ingivande av ändringsförslag i Europaparlamentets ansvariga utskott @sv
preferred label: Indgivelse af ændringsforslag til Europa-Parlamentets ansvarlige udvalg @da
preferred label: Einreichung von Änderungsanträgen im zuständigen Ausschuss des EP @de
preferred label: Dépôt d’amendements au sein de la commission compétente du PE @fr
preferred label: Depunerea amendamentelor în comisia competentă din cadrul PE @ro
preferred label: Muudatusettepanekute esitamine Euroopa Parlamendi vastutavas komitees @et
preferred label: Внасяне на изменения в компетентната комисия на ЕП @bg
preferred label: Tarkistukset jätetty käsiteltäväksi asiasta vastaavassa Euroopan parlamentin valiokunnassa @fi
preferred label: Podnošenje amandmana u nadležnom odboru EP-a @hr
preferred label: Předložení pozměňovacích návrhů v příslušném výboru EP @cs
preferred label: Apresentação de alterações na comissão competente do PE @pt
preferred label: Vložitev predlogov sprememb v pristojnem odboru EP @sl

Parliamentary delegation activity
type: Concept
created: 2023-10-31
deprecated: false
definition: Activity by a parliamentary delegation.
in scheme: EP taxonomy on activities.
preferred label: Aktivnosti parlamentarnog izaslanstva @hr
preferred label: Činnosť parlamentných delegácií @sk
preferred label: Attività tad-delegazzjoni parlamentari @mt
preferred label: Parlamentariske delegationers virksomhed @da
preferred label: Działalność delegacji parlamentarnych @pl
preferred label: Δραστηριότητα κοινοβουλευτικής αντιπροσωπείας @el
preferred label: Parlamendi delegatsiooni tegevus @et
preferred label: Gníomhaíocht na toscaireachta parlaimintí @ga
preferred label: Parlamento delegacijų veikla @lt
preferred label: Atividade das delegações parlamentares @pt
preferred label: Дейност на парламентарните делегации @bg
preferred label: Activiteit van de parlementaire delegatie @nl
preferred label: Tätigkeit der parlamentarischen Delegation @de
preferred label: Parlamentin valtuuskunnan toiminta @fi
preferred label: Attività delle delegazioni parlamentari @it
preferred label: Actividades de las delegaciones parlamentarias @es
preferred label: Činnost parlamentních delegací @cs
preferred label: Activitatea delegațiilor parlamentare @ro
preferred label: Parlamentarisk delegationsverksamhet @sv
preferred label: A parlamenti küldöttségek tevékenysége @hu
preferred label: Dejavnost parlamentarne delegacije @sl
preferred label: Parlamentārās delegācijas darbība @lv
preferred label: Activités des délégations parlementaires @fr
top concept of: EP taxonomy on activities.

Plenary vote explanations
type: Concept
type: ActivityType
created: 2023-10-31
deprecated: false
broader: Plenary activity
definition: Explanations of vote in plenary.
in scheme: EP taxonomy on activities.
preferred label: Explications relatives au vote en plénière @fr
preferred label: Обяснения на вота в пленарна зала @bg
preferred label: Mínithe ar an vótáil sa suí iomlánach @ga
preferred label: Wyjaśnienia dotyczące głosowania na posiedzeniu plenarnym @pl
preferred label: Täysistuntoäänestyksen selitykset @fi
preferred label: Spjegazzjonijiet dwar il-votazzjoni fil-plenarja @mt
preferred label: Explicații privind votul în plen @ro
preferred label: Erklärungen zur Abstimmung im Plenum @de
preferred label: Stemmeforklaringer på plenarmødet @da
preferred label: Vysvětlení hlasování na plenárním zasedání @cs
preferred label: Αιτιολογήσεις ψήφου στην ολομέλεια @el
preferred label: Stemverklaringen in de plenaire vergadering @nl
preferred label: Declarações de voto em sessão plenária @pt
preferred label: A plenáris szavazás indokolása @hu
preferred label: Objašnjenja glasovanja na plenarnoj sjednici @hr
preferred label: Vysvetlenia hlasovania v pléne @sk
preferred label: Röstförklaringar i kammaren @sv
preferred label: Dichiarazioni di voto in Aula @it
preferred label: Obrazložitev glasovanja na plenarnem zasedanju @sl
preferred label: Explicaciones sobre la votación en el Pleno @es
preferred label: Täiskogu hääletuse selgitused @et
preferred label: Plenārsēdes balsojuma skaidrojumi @lv
preferred label: Paaiškinimai dėl balsavimo plenariniame posėdyje @lt

Plenary reject proposal
type: Concept
created: 2023-10-31
deprecated: false
broader: Plenary activity
definition: Plenary reject proposal.
in scheme: EP taxonomy on activities.
narrow match: RJ byEP
narrow match: APR NO byEP
preferred label: Plenariniame posėdyje atmestas pasiūlymas @lt
preferred label: Täysistunto hylkää ehdotuksen @fi
preferred label: Förkasta förslaget i plenum @sv
preferred label: Odrzucenie propozycji na posiedzeniu plenarnym @pl
preferred label: Plenaire vergadering verwerpt voorstel @nl
preferred label: Απόρριψη πρότασης από την Ολομέλεια @el
preferred label: Vorschlag im Plenum ablehnen @de
preferred label: La proposta è respinta dall'Aula @it
preferred label: Plenul respinge propunerea @ro
preferred label: Il-plenarja tirrifjuta l-proposta @mt
preferred label: A plenáris ülés elutasítja a javaslatot @hu
preferred label: Täiskogu lükkas ettepaneku tagasi @et
preferred label: Zamietnutie návrhu na plenárnom zasadnutí @sk
preferred label: Zavrnitev predloga na plenarnem zasedanju @sl
preferred label: Plenární zasedání návrh zamítlo @cs
preferred label: Odbijanje prijedloga na plenarnoj sjednici @hr
preferred label: Отхвърляне на предложението на пленарно заседание @bg
preferred label: Plenārsēdē noraida priekšlikumu @lv
preferred label: O plenário rejeita a proposta @pt
preferred label: Forslag forkastet på plenarmødet @da
preferred label: La plénière rejette la proposition @fr
preferred label: El Pleno rechaza la propuesta @es
preferred label: Diúltú don togra sa suí iomlánach @ga

Speech of a debate in a plenary
type: ActivityType
type: Concept
created: 2023-10-31
deprecated: false
broader: Plenary activity
definition: Speech of a debate during a plenary.
in scheme: EP taxonomy on activities.
preferred label: Plenarinio posėdžio diskusijų kalba @lt
preferred label: Anförande av en debatt i en plenarsession @sv
preferred label: Tale om en debat på et plenarmøde @da
preferred label: Prejav rozpravy v pléne @sk
preferred label: Projev rozpravy na plenárním zasedání @cs
preferred label: Govor o razpravi na plenarnem zasedanju @sl
preferred label: Toespraak van een debat in een plenaire vergadering @nl
preferred label: Discurso de um debate em sessão plenária @pt
preferred label: Ομιλία συζήτησης σε σύνοδο ολομέλειας @el
preferred label: Intervento di un dibattito in plenaria @it
preferred label: Discursul unei dezbateri în plen @ro
preferred label: Discurso de un debate en el Pleno @es
preferred label: Govor tijekom rasprave na plenarnoj sjednici @hr
preferred label: A plenáris ülésen tartott vita beszéde @hu
preferred label: Óráid na díospóireachta i suí iomlánach @ga
preferred label: Discours d’un débat en plénière @fr
preferred label: Изказване на разискване в пленарна зала @bg
preferred label: Puhe täysistunnossa käytävästä keskustelusta @fi
preferred label: Wystąpienie podczas debaty na posiedzeniu plenarnym @pl
preferred label: Debašu runa plenārsēdē @lv
preferred label: Arutelu kõne täiskogu istungil @et
preferred label: Diskors ta’ dibattitu f’plenarja @mt
preferred label: Rede zu einer Aussprache im Plenum @de

Endorsement of the EP committee responsible decision to start interinstitutional negotiations by the EP plenary
type: ActivityType
type: Concept
created: 2023-10-31
deprecated: false
broader: Plenary activity
definition: Plenary endorse parliamentary responsible committee to enter into interinstitutional negotiations.
in scheme: EP taxonomy on activities.
preferred label: Euroopan parlamentin täysistunto hyväksynyt asiasta vastaavan Euroopan parlamentin valiokunnan päätöksen aloittaa toimielinten väliset neuvottelut @fi
preferred label: Έγκριση της απόφασης της αρμόδιας επιτροπής του ΕΚ για την έναρξη διοργανικών διαπραγματεύσεων από την ολομέλεια του ΕΚ @el
preferred label: Aprobarea de către plenul PE a deciziei comisiei competente din cadrul PE de a începe negocierile interinstituționale @ro
preferred label: Az Európai Parlament illetékes bizottsága által hozott, intézményközi tárgyalások megkezdésére irányuló határozat jóváhagyása az Európai Parlament plenáris ülése által @hu
preferred label: An cinneadh ón gcoiste fhreagrach de chuid Pharlaimint na hEorpa tús a chur le caibidlíocht idirinstitiúideach arna fhormhuiniú ag seisiún iomlánach Pharlaimint na hEorpa @ga
preferred label: Billigung durch das EP-Plenum des Beschlusses des zuständigen Ausschusses des EP zur Aufnahme interinstitutioneller Verhandlungen @de
preferred label: Approvazzjoni tad-deċiżjoni tal-kumitat responsabbli tal-PE biex jinbdew negozjati interistituzzjonali mill-plenarja tal-PE @mt
preferred label: Одобрение на пленарното заседание на ЕП на решението на компетентната комисия на ЕП за започване на междуинституционални преговори @bg
preferred label: Goedkeuring door de plenaire vergadering van het EP van het besluit van de verantwoordelijke EP-commissie tot het starten van interinstitutionele onderhandelingen @nl
preferred label: Plenarforsamlingens godkendelse af det ansvarlige udvalgs beslutning om at indlede interinstitutionelle forhandlinger @da
preferred label: Potvrđivanje odluke nadležnog odbora EP-a o početku međuinstitucijskih pregovora na plenarnoj sjednici EP-a @hr
preferred label: EP plenariniame posėdyje pareikštas pritarimas atsakingo EP komiteto sprendimui pradėti tarpinstitucines derybas @lt
preferred label: EP plenārsēdē apstiprināts EP atbildīgās komitejas lēmums sākt iestāžu sarunas @lv
preferred label: Schválení rozhodnutí příslušného výboru EP zahájit interinstitucionální jednání na plenárním zasedání EP @cs
preferred label: Potrditev sklepa pristojnega odbora EP o začetku medinstitucionalnih pogajanj na plenarnem zasedanju EP @sl
preferred label: Zatwierdzenie na posiedzeniu plenarnym PE decyzji właściwej komisji PE o rozpoczęciu negocjacji międzyinstytucjonalnych @pl
preferred label: Kammarens godkännande av det ansvariga parlamentsutskottets beslut att inleda interinstitutionella förhandlingar @sv
preferred label: Euroopa Parlamendi täiskogu on heaks kiitnud Euroopa Parlamendi vastutava komitee otsuse alustada institutsioonidevahelisi läbirääkimisi @et
preferred label: Approvazione della decisione della commissione competente del PE di avviare negoziati interistituzionali da parte della plenaria del PE @it
preferred label: Aprobación por el pleno del PE de la decisión de la comisión competente del PE de iniciar negociaciones interinstitucionales @es
preferred label: Aprovação pela sessão plenária do PE da decisão da comissão competente do PE de iniciar negociações interinstitucionais @pt
preferred label: Approbation par l’assemblée plénière du PE de la décision de la commission compétente du PE d’entamer des négociations interinstitutionnelles @fr
preferred label: Schválenie rozhodnutia gestorského výboru EP o začatí medziinštitucionálnych rokovaní na plenárnom zasadnutí EP @sk

Naming of a chair for a meeting
type: Concept
created: 2024-07-01
deprecated: false
alternative label: Наименуване на стол за заседание @bg
alternative label: Ονοματοδοσία καρέκλας για συνεδρίαση @el
alternative label: Numirea unui președinte pentru o ședință @ro
preferred label: Az ülés elnökének elnevezése @hu
alternative label: Tuolin nimeäminen istuntoa varten @fi
alternative label: Designación de la presidencia para una sesión @es
alternative label: Esimehe nimetamine istungile @et
alternative label: Désignation d'un président d'une session @fr
alternative label: Ainmniú cathaoir le haghaidh suí @ga
alternative label: Isem ta’ president għal seduta @mt
alternative label: DNomina di un presidente per una seduta @it
alternative label: Imenovanje stolice za sjednicu @hr
alternative label: Namngivande av en ordförande för ett sammanträde @sv
alternative label: Benennung eines Vorsitzenden für eine Sitzung @de
alternative label: Navngivning af en formand til et møde @da
alternative label: Pomenovanie stoličky na rokovanie @sk
alternative label: Krēsla nosaukums sēdei @lv
alternative label: Pojmenování předsedy na zasedání @cs
alternative label: Designação de uma presidência para uma sessão @pt
alternative label: Naming of a chair for a sitting
alternative label: Nazwa przewodniczącego na posiedzenie @pl
broader: Meeting activity
definition: Nomination of a chair for a meeting or a sitting.
in scheme: EP taxonomy on activities.
preferred label: Koosoleku juhataja nimetamine @et
preferred label: Udpegelse af en formand til et møde @da
preferred label: Наименуване на председател за заседание @bg
preferred label: Pirmininko vardas posėdžiui @lt
preferred label: Jmenování předsedy na schůzi @cs
preferred label: Ορισμός προέδρου για συνεδρίαση @el
preferred label: Designación de un presidente para una reunión @es
preferred label: Utnämning av en ordförande för ett möte @sv
preferred label: Cathaoirleach a ainmniú do chruinniú @ga
preferred label: Sanāksmes vadītāja vārds @lv
preferred label: Benennung eines Vorsitzenden für eine Versammlung @de
preferred label: Nomina di un presidente per una riunione @it
preferred label: Isem ta’ president għal laqgħa @mt
preferred label: Numirea unui președinte pentru o reuniune @ro
preferred label: Puheenjohtajan nimeäminen kokousta varten @fi
preferred label: Benoeming van een voorzitter voor een vergadering @nl
preferred label: Designação de um presidente para uma reunião @pt
preferred label: Wyznaczenie przewodniczącego posiedzenia @pl
preferred label: Imenovanje predsjedatelja za sastanak @hr
preferred label: Désignation d'un président d'une réunion @fr
preferred label: Pomenovanie predsedu schôdze @sk
preferred label: Imenovanje predsednika za sejo @sl

Publication in the Official Journal
type: ActivityType
type: Concept
created: 2023-10-31
deprecated: false
broader: Proceeding activity
definition: Text is published in the official journal on EURLex.
in scheme: EP taxonomy on activities.
preferred label: Publicēšana Oficiālajā Vēstnesī @lv
preferred label: Publicatie in het Publicatieblad @nl
preferred label: Uverejnenie v Úradnom vestníku @sk
preferred label: Δημοσίευση στην Επίσημη Εφημερίδα @el
preferred label: Zveřejnění v Úředním věstníku @cs
preferred label: Публикуване в Официален вестник @bg
preferred label: Veröffentlichung im Amtsblatt @de
preferred label: Pubblikazzjoni fil-Ġurnal Uffiċjali @mt
preferred label: Publicação no Jornal Oficial @pt
preferred label: Offentliggørelse i EU-Tidende @da
preferred label: Foilsiú san Iris Oifigiúil @ga
preferred label: Publicarea în Jurnalul Oficial @ro
preferred label: Objava u Službenom listu @hr
preferred label: Kihirdetés a Hivatalos Lapban @hu
preferred label: Julkaiseminen virallisessa lehdessä @fi
preferred label: Publicación en el Diario Oficial @es
preferred label: Pubblicazione nella Gazzetta ufficiale @it
preferred label: Paskelbimas Oficialiajame leidinyje @lt
preferred label: Publikacja w Dzienniku Urzędowym @pl
preferred label: Publication au Journal officiel @fr
preferred label: Offentliggörande i EUT @sv
preferred label: Objava v Uradnem listu @sl
preferred label: Avaldamine Euroopa Liidu Teatajas @et

Meeting activity
type: Concept
created: 2023-10-31
deprecated: false
definition: Activity related to a meeting.
in scheme: EP taxonomy on activities.
preferred label: Activități de reuniune @ro
preferred label: Attività di riunione @it
preferred label: Koosoleku tegevus @et
preferred label: Az ülés tevékenysége @hu
preferred label: Actividad de reunión @es
preferred label: Schůze @cs
preferred label: Gníomhaíocht cruinnithe @ga
preferred label: Posėdžio veikla @lt
preferred label: Działanie związane z posiedzeniem @pl
preferred label: Vergaderactiviteit @nl
preferred label: Mødeaktivitet @da
preferred label: Aktivnosti sastanaka @hr
preferred label: Attività ta’ laqgħa @mt
preferred label: Dejavnosti v zvezi s sestanki @sl
preferred label: Kokoustoiminta @fi
preferred label: Sitzungsaktivitäten @de
preferred label: Sanāksmes pasākums @lv
preferred label: Činnosť stretnutia @sk
preferred label: Δραστηριότητα συνεδριάσεων @el
preferred label: Дейности, свързани със заседанието @bg
preferred label: Activités de réunion @fr
preferred label: Mötesaktivitet @sv
preferred label: Atividade da reunião @pt
top concept of: EP taxonomy on activities.

Rejection of the joint text agreed in the Conciliation Committee by the EP
type: Concept
type: ActivityType
created: 2025-01-31
deprecated: false
broader: Plenary activity
definition: In the scope of a procedure subject to 3rd Reading, plenary reject the Join Text, result of the Conciliation Committee negotiations.
in scheme: EP taxonomy on activities.
preferred label: Europa-Parlamentets forkastelse af Forligsudvalgets fælles udkast @da
preferred label: Отхвърляне от страна на ЕП на общия проект, договорен в помирителния комитет @bg
preferred label: Zamietnutie spoločného textu dohodnutého v Zmierovacom výbore Európskym parlamentom @sk
preferred label: Reiezione da parte del PE del progetto comune concordato in sede di comitato di conciliazione @it
preferred label: Respingerea proiectului comun convenit în cadrul comitetului de conciliere de către PE @ro
preferred label: Ablehnung des vom Vermittlungsausschuss angenommenen gemeinsamen Entwurfs durch das EP @de
preferred label: Europaparlamentets förkastande av det gemensamma utkast som förlikningskommittén kommit överens om @sv
preferred label: Zavrnitev skupnega besedila, o katerem se je Evropski parlament dogovoril v spravnem odboru @sl
preferred label: EP odbija zajednički tekst dogovoren u Odboru za mirenje @hr
preferred label: Rejeição pelo PE do projeto comum acordado no Comité de Conciliação @pt
preferred label: Parlaimint na hEorpa do dhiúltú an téacs chomhpháirtigh a comhaontaíodh sa Choiste Idir-réitigh @ga
preferred label: Zamítnutí společného návrhu dohodnutého v dohodovacím výboru Evropským parlamentem @cs
preferred label: Ċaħda tat-test konġunt maqbul fil-Kumitat ta’ Konċiljazzjoni mill-PE @mt
preferred label: Odrzucenie przez PE wspólnego tekstu uzgodnionego przez komitet pojednawczy @pl
preferred label: Az egyeztetőbizottságban elfogadott közös szövegtervezet elutasítása az EP által @hu
preferred label: Euroopan parlamentti hylännyt sovittelukomiteassa sovitun yhteisen tekstin @fi
preferred label: Bendro projekto, dėl kurio susitarta Taikinimo komitete, atmetimas EP @lt
preferred label: Απόρριψη από το ΕΚ του κοινού σχεδίου που συμφωνήθηκε στην επιτροπή συνδιαλλαγής @el
preferred label: Rejet par le PE du projet commun approuvé par le comité de conciliation @fr
preferred label: Verwerping door het EP van de gemeenschappelijke ontwerptekst waarover in het bemiddelingscomité overeenstemming is bereikt @nl
preferred label: Rechazo por el PE del texto conjunto acordado en el Comité de Conciliación @es
preferred label: Lepituskomitees kokku lepitud ühine tekst lükatakse Euroopa Parlamendis tagasi @et
preferred label: Kopīgais dokuments, par kuru panākta vienošanās Samierināšanas komitejā, EP ir noraidīts @lv

Deliberations in the parliamentary committee
type: Concept
created: 2023-10-31
deprecated: false
broader: Parliamentary committee activity
definition: Debate in the course of a meeting of a parliamentary committee.
in scheme: EP taxonomy on activities.
preferred label: Deliberazioni in commissione parlamentare @it
preferred label: Arutelud parlamendikomisjonis @et
preferred label: Deliberazzjonijiet fil-kumitat parlamentari @mt
preferred label: Överläggningar i parlamentsutskottet @sv
preferred label: Rasprave u parlamentarnom odboru @hr
preferred label: Drøftelser i det parlamentariske udvalg @da
preferred label: Neverejné zasadnutie v parlamentnom výbore @sk
preferred label: Svarstymai Parlamento komitete @lt
preferred label: Obrady w komisji parlamentarnej @pl
preferred label: Συζητήσεις στην κοινοβουλευτική επιτροπή @el
preferred label: Apspriedes Parlamenta komitejā @lv
preferred label: Parlamenti bizottság tanácskozásai @hu
preferred label: Deliberaciones en la comisión parlamentaria @es
preferred label: Jednání v parlamentním výboru @cs
preferred label: Разисквания в парламентарна комисия @bg
preferred label: Déliberations dans la commission parlementaire @fr
preferred label: Dezbateri în comisia parlamentară @ro
preferred label: Pléití sa choiste parlaiminteach @ga
preferred label: Deliberações na comissão parlamentar @pt
preferred label: Razprave v parlamentarnem odboru @sl
preferred label: Erörterungen im parlamentarischen Ausschuss @de
preferred label: Keskustelu valiokunnassa @fi
preferred label: Beraadslagingen in de parlementaire commissie @nl

Plenary urgency vote
type: ActivityType
type: Concept
created: 2023-10-31
deprecated: false
broader: Plenary activity
definition: Urgency vote in plenary.
in scheme: EP taxonomy on activities.
preferred label: Vot de urgență în plen @ro
preferred label: Głosowanie w trybie pilnym na posiedzeniu plenarnym @pl
preferred label: Vote d’urgence en plénière @fr
preferred label: Brådskande omröstning i kammaren @sv
preferred label: Kiireellinen äänestys täysistunnossa @fi
preferred label: Hitno glasovanje na plenarnoj sjednici @hr
preferred label: Неотложно гласуване в пленарна зала @bg
preferred label: Spoedstemming in de plenaire vergadering @nl
preferred label: Naliehavé hlasovanie v pléne @sk
preferred label: Plenārsēdes steidzamais balsojums @lv
preferred label: Votazione d'urgenza in Aula @it
preferred label: Votación de urgencia en el Pleno @es
preferred label: Dringlichkeitsabstimmung im Plenum @de
preferred label: Nujno glasovanje na plenarnem zasedanju @sl
preferred label: Vótáil phráinne sa suí iomlánach @ga
preferred label: Votazzjoni ta’ urġenza fil-plenarja @mt
preferred label: Kiireloomuline hääletus täiskogul @et
preferred label: Skubus balsavimas plenariniame posėdyje @lt
preferred label: Επείγουσα ψηφοφορία στην ολομέλεια @el
preferred label: Sürgősségi szavazás plenáris ülésen @hu
preferred label: Votação urgente em sessão plenária @pt
preferred label: Afstemning om uopsættelighed på plenarmødet @da
preferred label: Naléhavé hlasování na plenárním zasedání @cs

Part session plenary folder
type: Concept
type: ActivityType
created: 2023-10-31
deprecated: false
broader: Plenary activity
definition: Part session plenary folder.
in scheme: EP taxonomy on activities.
preferred label: Mapp för plenarsessioner @sv
preferred label: Dossier van de zitting van de voltallige vergadering @nl
preferred label: Folder sesji plenarnej @pl
preferred label: Täysistunnon kansio @fi
preferred label: Dosarul sesiunii plenare a unei părți @ro
preferred label: Папка за пленарните сесии @bg
preferred label: Pasta da sessão plenária @pt
preferred label: Dokumentacija s plenarnim zasjedanjem @hr
preferred label: Ordner für die Plenartagung @de
preferred label: Mødemappe til plenarforsamlingen @da
preferred label: Fillteán iomlánach an pháirtseisiúin @ga
preferred label: Plenarinių sesijų aplankas @lt
preferred label: Dossier d'une partie de session plénière @fr
preferred label: Složka plenárního zasedání @cs
preferred label: Φάκελος της συνόδου ολομέλειας @el
preferred label: Carpeta del pleno @es
preferred label: Plenáris ülés mappa @hu
preferred label: Cartella della sessione plenaria @it
preferred label: Folder tas-sessjoni plenarja parzjali @mt
preferred label: Plenārsesijas mape @lv
preferred label: Priečinok plenárneho zasadnutia @sk
preferred label: Täiskogu osaistungjärgu kaust @et
preferred label: Mapa za delno plenarno zasedanje @sl

Convening of the Conciliation Committee
type: Concept
created: 2023-10-31
deprecated: false
broader: Proceeding activity
definition: In context of budgetary and ordinary legislative procedures, when no common position is found between Parliament and Council through the first and second reading, they can convene of a third reading, requesting a conciliation committee to take place.
in scheme: EP taxonomy on activities.
narrow match: REQ INI PROCONCERT byEP
preferred label: Zvolanie Zmierovacieho výboru @sk
preferred label: Samierināšanas komitejas sasaukšana @lv
preferred label: Zwołanie komitetu pojednawczego @pl
preferred label: Convocarea Comitetului de conciliere @ro
preferred label: Comóradh an Choiste Idir-réitigh @ga
preferred label: Convocação de Comité de Conciliação @pt
preferred label: Convocatoria Comité de Conciliación @es
preferred label: Convocazione del Comitato di conciliazione @it
preferred label: Sovittelukomitea kutsuttu koolle @fi
preferred label: Indkaldelse af Forligsudvalget @da
preferred label: Bijeenroeping van het bemiddelingscomité @nl
preferred label: Sammankallande av förlikningskommittén @sv
preferred label: Konvokazzjoni tal-Kumitat ta' Konċiljazzjoni @mt
preferred label: Lepituskomitee kokkukutsumine @et
preferred label: Свикване на Помирителния комитет @bg
preferred label: Svolání dohodovacího výboru @cs
preferred label: Convocation du comité de conciliation @fr
preferred label: Az egyeztetőbizottság összehívása @hu
preferred label: Einberufung des Vermittlungsausschusses @de
preferred label: Sazivanje Odbora za mirenje @hr
preferred label: Taikinimo komiteto sušaukimas @lt
preferred label: Sklic Spravnega odbora @sl
preferred label: Σύγκληση της επιτροπής συνδιαλλαγής @el

Ending of a meeting
type: Concept
created: 2024-07-01
deprecated: false
alternative label: Afslutning af et møde @da
alternative label: Fin de la sesión @es
alternative label: Fim da sessão @pt
alternative label: Završetak dnevne sjednice @hr
alternative label: Sēdes beigas @lv
alternative label: Konec zasedání @cs
alternative label: Ending of a sitting
alternative label: Fine di una seduta @it
alternative label: Istungi lõpp @et
alternative label: Tmiem ta’ seduta @mt
alternative label: Încheierea unei ședințe @ro
alternative label: Beëindiging van een vergadering @nl
alternative label: Ukončenie rokovania @sk
alternative label: Avslutande av ett sammanträde @sv
alternative label: Istunnon päättäminen @fi
alternative label: Fin d'une session @fr
alternative label: Deireadh le suí @ga
broader: Meeting activity
definition: Ending of a meeting or a sitting.
in scheme: EP taxonomy on activities.
preferred label: Zakończenie posiedzenia @pl
preferred label: Konec seje @sl
preferred label: Conclusione di una riunione @it
preferred label: Ende einer Sitzung @de
preferred label: Sanāksmes noslēgums @lv
preferred label: Încheierea unei reuniuni @ro
preferred label: Край на заседание @bg
preferred label: Mødets afslutning @da
preferred label: Finalización de una reunión @es
preferred label: Avslutande av ett möte @sv
preferred label: Tmiem ta’ laqgħa @mt
preferred label: Završetak sastanka @hr
preferred label: Az ülés vége @hu
preferred label: Λήξη συνεδρίασης @el
preferred label: Encerramento de uma reunião @pt
preferred label: Ukončenie schôdze @sk
preferred label: Kokouksen päättäminen @fi
preferred label: Deireadh a chur le cruinniú @ga
preferred label: Fin d'une réunion @fr
preferred label: Einde van een vergadering @nl
preferred label: Ukončení schůze @cs
preferred label: Koosoleku lõpp @et
preferred label: Posėdžio pabaiga @lt

Approval of the provisional agreement with the Council by the EP committee responsible
type: Concept
type: ActivityType
created: 2023-10-31
deprecated: false
broader: Parliamentary committee activity
definition: Responsible parliamentary committee approve provisional agreement resulting of interinstitutional negotiations.
in scheme: EP taxonomy on activities.
preferred label: Schválenie predbežnej dohody s Radou gestorským výborom EP @sk
preferred label: Odobrenje privremenog sporazuma s Vijećem od strane nadležnog odbora EP-a @hr
preferred label: Одобрение от компетентната комисия на ЕП на предварителното споразумение със Съвета @bg
preferred label: A Tanáccsal kötött ideiglenes megállapodás jóváhagyása az Európai Parlament illetékes bizottsága által @hu
preferred label: Preliminaraus susitarimo su Taryba patvirtinimas atsakingame EP komitete @lt
preferred label: Approvazione dell’accordo provvisorio con il Consiglio da parte della commissione competente del PE @it
preferred label: Aprovação pela comissão competente do PE do acordo provisório com o Conselho @pt
preferred label: Godkännande av den preliminära överenskommelsen med rådet av Europaparlamentets ansvariga utskott @sv
preferred label: Aprobación del acuerdo provisional con el Consejo por la comisión competente del PE @es
preferred label: EP atbildīgās komitejas apstiprināta provizoriskā vienošanās ar Padomi @lv
preferred label: Approvazzjoni tal-ftehim proviżorju mal-Kunsill mill-Kumitat responsabbli tal-PE @mt
preferred label: Aprobarea acordului provizoriu cu Consiliul de către comisia competentă din cadrul PE @ro
preferred label: Zatwierdzenie wstępnego porozumienia z Radą przez właściwą komisję PE @pl
preferred label: Det ansvarlige EP-udvalgs godkendelse af den foreløbige enighed med Rådet @da
preferred label: Euroopa Parlamendi vastutav komitee on heaks kiitnud esialgse kokkuleppe nõukoguga @et
preferred label: Approbation par la commission compétente du PE de l’accord provisoire avec le Conseil @fr
preferred label: Έγκριση της προσωρινής συμφωνίας με το Συμβούλιο από την αρμόδια επιτροπή του ΕΚ @el
preferred label: Schválení předběžné dohody s Radou příslušným výborem EP @cs
preferred label: Asiasta vastaava Euroopan parlamentin valiokunta hyväksynyt alustavan yhteisymmärryksen neuvoston kanssa @fi
preferred label: An comhaontú sealadach leis an gComhairle arna fhormheas ag an gcoiste freagrach de chuid Pharlaimint na hEorpa @ga
preferred label: Odobritev začasnega dogovora s Svetom s strani pristojnega odbora EP @sl
preferred label: Billigung der vorläufigen Einigung mit dem Rat durch den zuständigen Ausschuss des EP @de
preferred label: Goedkeuring van het voorlopige akkoord met de Raad door de verantwoordelijke EP-commissie @nl

Adoption of amendments to the Council’s position by the EP at 2nd reading
type: Concept
type: ActivityType
created: 2023-10-31
deprecated: false
broader: Plenary activity
definition: Plenary amend Council position.
in scheme: EP taxonomy on activities.
preferred label: A Tanács álláspontjára vonatkozó módosítások elfogadása az Európai Parlament által második olvasatban @hu
preferred label: Vaststelling van amendementen op het standpunt van de Raad door het EP in 2e lezing @nl
preferred label: Prijatie pozmeňujúcich návrhov k pozícii Rady zo strany EP v druhom čítaní @sk
preferred label: Euroopan parlamentti hyväksynyt tarkistukset neuvoston kantaan toisessa käsittelyssä @fi
preferred label: Nõukogu seisukohta käsitlevate muudatusettepanekute vastuvõtmine Euroopa Parlamendi poolt teisel lugemisel @et
preferred label: Tarybos pozicijos pakeitimų priėmimas EP antruoju svarstymu @lt
preferred label: Adoption des amendements à la position du Conseil par le PE en deuxième lecture @fr
preferred label: Adopción de las enmiendas a la posición del Consejo por el PE en segunda lectura @es
preferred label: Adozzjoni tal-emendi għall-pożizzjoni tal-Kunsill mill-PE fit-2 qari @mt
preferred label: Grozījumu Padomes nostājā pieņemšana Eiropas Parlamentā 2. lasījumā @lv
preferred label: Έγκριση τροπολογιών στη θέση του Συμβουλίου από το ΕΚ σε δεύτερη ανάγνωση @el
preferred label: Adoptarea amendamentelor la poziția Consiliului de către PE în a doua lectură @ro
preferred label: Sprejetje sprememb stališča Sveta s strani EP v drugi obravnavi @sl
preferred label: Adozione degli emendamenti alla posizione del Consiglio da parte del PE in seconda lettura @it
preferred label: Приемане на изменения в позицията на Съвета от ЕП на второ четене @bg
preferred label: EP usvaja amandmane na stajalište Vijeća u drugom čitanju @hr
preferred label: Přijetí pozměňovacích návrhů k postoji Rady v EP ve druhém čtení @cs
preferred label: Annahme von Abänderungen des Standpunkts des Rates durch das EP in 2. Lesung @de
preferred label: Przyjęcie poprawek do stanowiska Rady przez PE w drugim czytaniu @pl
preferred label: Glacadh leasuithe ar sheasamh na Comhairle ag PE ar an 2ú léamh @ga
preferred label: Europaparlamentets antagande av ändringsförslag till rådets ståndpunkt vid andra behandlingen @sv
preferred label: Adoção de alterações à posição do Conselho pelo PE em segunda leitura @pt
preferred label: Parlamentets vedtagelse af ændringer til Rådets holdning ved andenbehandling @da

Plenary vote results
type: Concept
type: ActivityType
created: 2023-10-31
deprecated: false
broader: Plenary activity
definition: Results of vote in plenary.
in scheme: EP taxonomy on activities.
preferred label: Резултати от гласуването в пленарна зала @bg
preferred label: Αποτελέσματα της ψηφοφορίας στην ολομέλεια @el
preferred label: Täiskogu hääletuse tulemused @et
preferred label: Risultati della votazione in Aula @it
preferred label: Výsledky plenárního hlasování @cs
preferred label: Rezultatele votului în plen @ro
preferred label: Abstimmungsergebnisse im Plenum @de
preferred label: Torthaí na vótála sa suí iomlánach @ga
preferred label: Wyniki głosowania na posiedzeniu plenarnym @pl
preferred label: Výsledky hlasovania v pléne @sk
preferred label: Riżultati tal-votazzjoni fil-plenarja @mt
preferred label: Resultat av omröstningen i kammaren @sv
preferred label: Resultados de la votación en el Pleno @es
preferred label: Täysistunnon äänestystulokset @fi
preferred label: Rezultati glasovanja na plenarnoj sjednici @hr
preferred label: Izid glasovanja na plenarnem zasedanju @sl
preferred label: Resultatet af afstemningen på plenarmødet @da
preferred label: Plenārsēdes balsojuma rezultāti @lv
preferred label: Balsavimo plenariniame posėdyje rezultatai @lt
preferred label: Uitslag van de plenaire stemming @nl
preferred label: A plenáris szavazás eredménye @hu
preferred label: Résultats du vote en plénière @fr
preferred label: Resultados da votação em sessão plenária @pt

Proceeding activity
type: Concept
created: 2023-10-31
deprecated: false
definition: Proceeding activity.
in scheme: EP taxonomy on activities.
preferred label: Aktivnost u tijeku @hr
preferred label: Atividade em curso @pt
preferred label: Sagsbehandlingsaktivitet @da
preferred label: Activitate procedurală @ro
preferred label: Actividad procedimental @es
preferred label: Svolgimento dell'attività @it
preferred label: Tęstinė veikla @lt
preferred label: Laufende Tätigkeit @de
preferred label: ΔΙΑΔΙΚΑΣΙΑ ΔΡΑΣΤΗΡΙΟΤΗΤΑΣ @el
preferred label: Activité de poursuite @fr
preferred label: Activiteiten in het kader van de procedure @nl
preferred label: Menetlustegevus @et
preferred label: Czynności związane z postępowaniem @pl
preferred label: Průběh řízení @cs
preferred label: Tiesvedības darbība @lv
preferred label: Jatkotoimi @fi
preferred label: Procesna dejavnost @sl
preferred label: Pågående verksamhet @sv
preferred label: Продължаване на дейността @bg
preferred label: Gníomhaíocht leanúnach @ga
preferred label: Az eljárás menete @hu
preferred label: Činnosť v konaní @sk
preferred label: Attività ta’ proċediment @mt
top concept of: EP taxonomy on activities.

Amending a text in plenary
type: ActivityType
type: Concept
created: 2023-10-31
deprecated: false
broader: Plenary activity
definition: Plenary amend a text.
in scheme: EP taxonomy on activities.
narrow match: AMEND byEP
preferred label: Zmiana tekstu na posiedzeniu plenarnym @pl
preferred label: Ändring av en text i kammaren @sv
preferred label: Téacs sa suí iomlánach a leasú @ga
preferred label: Emenda ta’ test fil-plenarja @mt
preferred label: Изменение на текст на пленарно заседание @bg
preferred label: Modificación de un texto en el Pleno @es
preferred label: Modifica di un testo in Aula @it
preferred label: Modificarea unui text în plen @ro
preferred label: Tekstin muuttaminen täysistunnossa @fi
preferred label: Wijziging van een tekst in de plenaire vergadering @nl
preferred label: Alteração de um texto em sessão plenária @pt
preferred label: Změna znění na plenárním zasedání @cs
preferred label: Τροποποίηση κειμένου στην ολομέλεια @el
preferred label: Änderung eines Textes im Plenum @de
preferred label: Teksta grozīšana plenārsēdē @lv
preferred label: Ændring af en tekst på plenarmødet @da
preferred label: Amendement d’un texte en plénière @fr
preferred label: Egy szöveg módosítása a plenáris ülésen @hu
preferred label: Zmena textu na plenárnom zasadnutí @sk
preferred label: Sprememba besedila na plenarnem zasedanju @sl
preferred label: Millega muudetakse täiskogu istungi teksti @et
preferred label: Izmjena teksta na plenarnoj sjednici @hr
preferred label: Teksto pakeitimas plenariniame posėdyje @lt

Vote on provisional agreement in the parliamentary committee responsible
type: Concept
created: 2023-10-31
deprecated: false
broader: Parliamentary committee activity
definition: Vote in the curse of a meeting of the Parliamentary Committee responsible on the provisional agreement issued by the interinstitutional negotiations.
in scheme: EP taxonomy on activities.
preferred label: Glasovanje o privremenom sporazumu u nadležnom parlamentarnom odboru @hr
preferred label: Balsavimas dėl preliminaraus susitarimo atsakingame Parlamento komitete @lt
preferred label: Glasovanje o začasnem dogovoru v pristojnem parlamentarnem odboru @sl
preferred label: Szavazás az ideiglenes megállapodásról az illetékes parlamenti bizottságban @hu
preferred label: Votación sobre el acuerdo provisional en la comisión parlamentaria competente para el fondo @es
preferred label: Votazzjoni dwar il-ftehim proviżorju fil-kumitat parlamentari responsabbli @mt
preferred label: Äänestys alustavasta sopimuksesta asiasta vastaavassa parlamentin valiokunnassa @fi
preferred label: Vote sur l’accord provisoire au sein de la commission parlementaire compétente @fr
preferred label: Abstimmung über die vorläufige Einigung im zuständigen Ausschuss des Parlaments @de
preferred label: Votazione sull'accordo provvisorio in seno alla commissione parlamentare competente @it
preferred label: Votação do acordo provisório na comissão parlamentar competente quanto à matéria de fundo @pt
preferred label: Гласуване на предварителното споразумение в компетентната парламентарна комисия @bg
preferred label: Hlasování o předběžné dohodě v příslušném parlamentním výboru @cs
preferred label: Hlasovanie o predbežnej dohode v gestorskom parlamentnom výbore @sk
preferred label: Omröstning om preliminär överenskommelse i ansvarigt utskott @sv
preferred label: Vótáil ar chomhaontú sealadach sa choiste parlaiminteach freagrach @ga
preferred label: Balsojums par provizorisko vienošanos atbildīgajā parlamentārajā komitejā @lv
preferred label: Głosowanie nad wstępnym porozumieniem w komisji przedmiotowo właściwej @pl
preferred label: Vot privind acordul provizoriu în cadrul comisiei parlamentare competente @ro
preferred label: Ψηφοφορία επί της προσωρινής συμφωνίας στην αρμόδια κοινοβουλευτική επιτροπή @el
preferred label: Stemming over voorlopig akkoord in de bevoegde parlementaire commissie @nl
preferred label: Hääletus esialgse kokkuleppe üle vastutavas parlamendikomisjonis @et
preferred label: Afstemning om foreløbig enighed i det korresponderende udvalg @da

Adoption of a report by the EP committee responsible
type: ActivityType
type: Concept
created: 2023-10-31
deprecated: false
broader: Parliamentary committee activity
definition: Responsible parliamentary committee adopt its report to table it further to plenary.
in scheme: EP taxonomy on activities.
preferred label: Asiasta vastaava Euroopan parlamentin valiokunta hyväksynyt mietinnön @fi
preferred label: Przyjęcie sprawozdania przez właściwą komisję PE @pl
preferred label: Goedkeuring van een verslag door de verantwoordelijke EP-commissie @nl
preferred label: Raporti vastuvõtmine Euroopa Parlamendi vastutavas komitees @et
preferred label: Adoptarea unui raport de către comisia competentă din cadrul PE @ro
preferred label: Přijetí zprávy v příslušném výboru EP @cs
preferred label: Ziņojuma pieņemšana atbildīgajā EP komitejā @lv
preferred label: Annahme eines Berichts durch den zuständigen Ausschuss des EP @de
preferred label: Adoption d’un rapport par la commission compétente du PE @fr
preferred label: Tuarascáil arna glacadh ag an gcoiste freagrach de chuid Pharlaimint na hEorpa @ga
preferred label: Pranešimo priėmimas atsakingame EP komitete @lt
preferred label: Donošenje izvješća nadležnog odbora EP-a @hr
preferred label: Adozzjoni ta’ rapport mill-kumitat responsabbli tal-PE @mt
preferred label: Antagande av betänkande av Europaparlamentets ansvariga utskott @sv
preferred label: Приемане на доклад от компетентната комисия на ЕП @bg
preferred label: Adozione di una relazione da parte della commissione competente del PE @it
preferred label: Jelentés elfogadása illetékes európai parlamenti bizottság által @hu
preferred label: Prijatie správy gestorským výborom EP @sk
preferred label: Έγκριση έκθεσης από την αρμόδια επιτροπή του ΕΚ @el
preferred label: Aprovação de um relatório pela comissão competente do PE @pt
preferred label: Sprejetje poročila pristojnega odbora EP @sl
preferred label: Adopción de un informe por la comisión competente del PE @es
preferred label: Vedtagelse af en betænkning fra Europa-Parlamentets ansvarlige udvalg @da

National chamber activity
type: ActivityType
type: Concept
created: 2025-01-31
deprecated: false
definition: Activity by a national chamber.
in scheme: EP taxonomy on activities.
preferred label: Attività della camera nazionale @it
preferred label: Činnosť národnej komory @sk
preferred label: Działalność izby krajowej @pl
preferred label: Nacionalinių rūmų veikla @lt
preferred label: Valsts palātas darbība @lv
preferred label: Tätigkeit der nationalen Kammer @de
preferred label: Den nationale afdelings virksomhed @da
preferred label: Δραστηριότητα εθνικού επιμελητηρίου @el
preferred label: Activité d'une chambre nationale @fr
preferred label: Dejavnost nacionalne zbornice @sl
preferred label: Činnost vnitrostátní komory @cs
preferred label: A nemzeti kamarák tevékenysége @hu
preferred label: Actividad de las cámaras nacionales @es
preferred label: Gníomhaíocht an tSeomra Náisiúnta @ga
preferred label: Attività tal-Kamra Nazzjonali @mt
preferred label: Дейност на националната камара @bg
preferred label: Djelatnost Nacionalne komore @hr
preferred label: Riikliku koja tegevus @et
preferred label: Den nationella kammarens verksamhet @sv
preferred label: Kansallisen kamarin toiminta @fi
preferred label: Activiteit van de nationale kamer @nl
preferred label: Atividade da câmara nacional @pt
preferred label: Activitatea camerei naționale @ro
top concept of: EP taxonomy on activities.

Opening of a meeting
type: Concept
created: 2024-07-01
deprecated: false
alternative label: Eröffnung einer Sitzung @de
alternative label: Deschiderea unei ședințe @ro
alternative label: Öppnande av ett sammanträde @sv
alternative label: Opening of a sitting
alternative label: Zahájení zasedání @cs
alternative label: Istunnon avaaminen @fi
alternative label: Abertura de uma sessão @pt
alternative label: Apertura di una seduta @it
alternative label: Apertura de la sesión @es
alternative label: Otvaranje sjednice @hr
alternative label: Ftuħ ta’ seduta @mt
alternative label: Sēdes atklāšana @lv
alternative label: Ouverture d'une session @fr
alternative label: Začiatok rokovania @sk
alternative label: Istungi avamine @et
alternative label: Oscailt suí @ga
broader: Meeting activity
definition: Starting of a meeting or a sitting.
in scheme: EP taxonomy on activities.
preferred label: Sanāksmes atklāšana @lv
preferred label: Abertura de uma reunião @pt
preferred label: Apertura di una riunione @it
preferred label: Posėdžio pradžia @lt
preferred label: Tús a chur le cruinniú @ga
preferred label: Ouverture d'une réunion @fr
preferred label: Kokouksen avaaminen @fi
preferred label: Deschiderea unei reuniuni @ro
preferred label: Apertura de una reunión @es
preferred label: Az ülés megnyitása @hu
preferred label: Otwarcie posiedzenia @pl
preferred label: Öppnande av ett möte @sv
preferred label: Otvaranje sastanka @hr
preferred label: Koosoleku avamine @et
preferred label: Zahájení schůze @cs
preferred label: Začetek seje @sl
preferred label: Otvorenie schôdze @sk
preferred label: Eröffnung einer Versammlung @de
preferred label: Откриване на заседание @bg
preferred label: Opening van een vergadering @nl
preferred label: Åbning af et møde @da
preferred label: Ftuħ ta’ laqgħa @mt
preferred label: Έναρξη συνεδρίασης @el

Sitting day
type: Concept
created: 2023-10-31
deprecated: false
broader: Meeting activity
definition: The sitting day indicates the day of a meeting of the plenary of the European Parliament, a parliamentary committee or parliamentary assembly.
in scheme: EP taxonomy on activities.
narrow match: DAY SITTING
preferred label: Sitzungstag @de
preferred label: Istungi päev @et
preferred label: Заседателен ден @bg
preferred label: Dan zasedanja @sl
preferred label: Vergaderdag @nl
preferred label: Jum tas-seduta @mt
preferred label: Dia de sessão @pt
preferred label: Zasedací den @cs
preferred label: Dzień posiedzenia @pl
preferred label: Sēdes diena @lv
preferred label: Ülésnap @hu
preferred label: Ημέρα συνεδρίασης @el
preferred label: Jour de séance @fr
preferred label: Lá suí @ga
preferred label: Dan zasjedanja @hr
preferred label: Posėdžio diena @lt
preferred label: Mødedag @da
preferred label: Istuntopäivä @fi
preferred label: Zi de ședință @ro
preferred label: Rokovací deň @sk
preferred label: Día de sesión @es
preferred label: Giorno di sessione @it
preferred label: Sammanträdesdag @sv

Referral of the matter back to the EP committee responsible for interinstitutional negotiations by the EP plenary
type: Concept
type: ActivityType
created: 2023-10-31
deprecated: false
broader: Plenary activity
definition: Plenary refer back the matter to parliamentary responsible committee to enter into interinstitutional negotiations.
in scheme: EP taxonomy on activities.
preferred label: Vrácení věci výboru EP odpovědnému za interinstitucionální jednání na plenárním zasedání EP @cs
preferred label: Plenarforsamlingens henvisning af sagen til fornyet behandling i udvalget med ansvar for interinstitutionelle forhandlinger @da
preferred label: Vrátenie veci gestorskému výboru EP na medziinštitucionálne rokovania plénom EP @sk
preferred label: Przekazanie na posiedzeniu plenarnym PE sprawy z powrotem do właściwej komisji PE odpowiadającej za negocjacje międzyinstytucjonalne @pl
preferred label: Upućivanje predmeta na ponovno odlučivanje odboru EP-a nadležnom za međuinstitucijske pregovore na plenarnoj sjednici EP-a @hr
preferred label: Klausimo grąžinimas už tarpinstitucines derybas atsakingam EP komitetui EP plenariniame posėdyje @lt
preferred label: Euroopan parlamentin täysistunto palauttanut asian asiasta vastaavaan Euroopan parlamentin valiokuntaan toimielinten välisiä neuvotteluja varten @fi
preferred label: Отнасяне на въпроса до компетентната комисия, за да го разгледа отново с оглед на провеждането на междуинституционални преговори, на пленарното заседание на ЕП @bg
preferred label: Riferiment tal-kwistjoni lill-kumitat tal-PE responsabbli għan-negozjati interistituzzjonali mill-plenarja tal-PE @mt
preferred label: Devolução do assunto pela sessão plenária do PE à comissão parlamentar competente para as negociações interinstitucionais @pt
preferred label: Retrimiterea chestiunii de către plenul PE comisiei PE competente pentru negocierile interinstituționale @ro
preferred label: An t-ábhar arna tharchur ar ais ag seisiún iomlánach Pharlaimint na hEorpa chuig an gcoiste freagrach de chuid Pharlaimint na hEorpa le haghaidh caibidlíocht idirinstitiúideach @ga
preferred label: Az ügynek az illetékes parlamenti bizottsághoz való visszautalása intézményközi tárgyalások céljából az Európai Parlament plenáris ülése által @hu
preferred label: EP plenārsēdē atbildīgajai EP komitejai nodots jautājums iestāžu sarunu risināšanai @lv
preferred label: Kammarens återförvisning av ärendet till det utskott som ansvarar för interinstitutionella förhandlingar @sv
preferred label: Zurücküberweisung der Angelegenheit zu interinstitutionellen Verhandlungen an den zuständigen Ausschuss des EP durch das EP-Plenum @de
preferred label: Rinvio della questione alla commissione del PE competente per i negoziati interistituzionali da parte della plenaria del PE @it
preferred label: Terugverwijzing van de zaak door de plenaire vergadering van het EP naar de EP-commissie die verantwoordelijk is voor interinstitutionele onderhandelingen @nl
preferred label: Remisión del asunto por el pleno del PE a la comisión del PE competente para las negociaciones interinstitucionales @es
preferred label: Predložitev zadeve na plenarnem zasedanju EP nazaj odboru EP, pristojnemu za medinstitucionalna pogajanja @sl
preferred label: Renvoi de la question par l’assemblée plénière du PE à la commission compétente du PE aux fins de négociations interinstitutionnelles @fr
preferred label: Αναπομπή του θέματος στην αρμόδια για τις διοργανικές διαπραγματεύσεις επιτροπή του ΕΚ από την ολομέλεια του ΕΚ @el
preferred label: Euroopa Parlamendi täiskogu on saatnud küsimuse tagasi vastutavale Euroopa Parlamendi komiteele institutsioonidevahelisteks läbirääkimisteks @et

Rejection of the EP committee responsible decision to start interinstitutional negotiations by the EP plenary
type: Concept
created: 2023-10-31
deprecated: false
broader: Plenary activity
definition: Plenary reject parliamentary responsible committee to enter into interinstitutional negotiations.
in scheme: EP taxonomy on activities.
preferred label: Rejeição pela sessão plenária do PE da decisão da comissão competente do PE de iniciar negociações interinstitucionais @pt
preferred label: Ablehnung durch das EP-Plenum des Beschlusses des zuständigen Ausschusses des EP zur Aufnahme interinstitutioneller Verhandlungen @de
preferred label: Rifjut tad-deċiżjoni tal-kumitat responsabbli tal-PE biex jinbdew negozjati interistituzzjonali mill-plenarja tal-PE @mt
preferred label: Отхвърляне на пленарното заседание на ЕП на решението на компетентната комисия на ЕП за започване на междуинституционални преговори @bg
preferred label: Zavrnitev sklepa pristojnega odbora EP o začetku medinstitucionalnih pogajanj na plenarnem zasedanju EP @sl
preferred label: An cinneadh ón gcoiste fhreagrach de chuid Pharlaimint na hEorpa tús a chur le caibidlíocht idirinstitiúideach arna dhiúltú ag seisiún iomlánach Pharlaimint na hEorpa @ga
preferred label: Reiezione della decisione della commissione competente del PE di avviare negoziati interistituzionali da parte della plenaria del PE @it
preferred label: Verwerping door de plenaire vergadering van het EP van het besluit van de verantwoordelijke EP-commissie tot het starten van interinstitutionele onderhandelingen @nl
preferred label: Plenarforsamlingens forkastelse af det ansvarlige udvalgs beslutning om at indlede interinstitutionelle forhandlinger @da
preferred label: Απόρριψη της απόφασης της αρμόδιας επιτροπής του ΕΚ για την έναρξη διοργανικών διαπραγματεύσεων από την ολομέλεια του ΕΚ @el
preferred label: Az Európai Parlament illetékes bizottsága által hozott, intézményközi tárgyalások megkezdésére irányuló határozat elutasítása az Európai Parlament plenáris ülése által @hu
preferred label: Odrzucenie na posiedzeniu plenarnym PE decyzji właściwej komisji PE o rozpoczęciu negocjacji międzyinstytucjonalnych @pl
preferred label: Rechazo por el pleno del PE de la decisión de la comisión competente del PE de iniciar negociaciones interinstitucionales @es
preferred label: Euroopa Parlamendi täiskogu on tagasi lükanud Euroopa Parlamendi vastutava komitee otsuse alustada institutsioonidevahelisi läbirääkimisi @et
preferred label: EP plenārsēdē noraidīts atbildīgās EP komitejas lēmums sākt iestāžu sarunas @lv
preferred label: Rejet par l’assemblée plénière du PE de la décision de la commission compétente du PE d’entamer des négociations interinstitutionnelles @fr
preferred label: Kammarens förkastande av det ansvariga parlamentsutskottets beslut att inleda interinstitutionella förhandlingar @sv
preferred label: Atsakingo EP komiteto sprendimo pradėti tarpinstitucines derybas atmetimas EP plenariniame posėdyje @lt
preferred label: Zamietnutie rozhodnutia gestorského výboru EP o začatí medziinštitucionálnych rokovaní na plenárnom zasadnutí EP @sk
preferred label: Respingerea de către plenul PE a deciziei comisiei competente a PE de a începe negocierile interinstituționale @ro
preferred label: Euroopan parlamentin täysistunto hylännyt asiasta vastaavan Euroopan parlamentin valiokunnan päätöksen aloittaa toimielinten väliset neuvottelut @fi
preferred label: Zamítnutí rozhodnutí příslušného výboru EP zahájit interinstitucionální jednání na plenárním zasedání EP @cs
preferred label: Odbijanje odluke nadležnog odbora EP-a o početku međuinstitucijskih pregovora na plenarnoj sjednici EP-a @hr

Parliamentary committee tabling report
type: ActivityType
type: Concept
created: 2023-10-31
deprecated: false
broader: Parliamentary committee activity
definition: Parliamentary committee table report.
in scheme: EP taxonomy on activities.
narrow match: REP RSI byEP CMT
narrow match: REP R2 byEP CMT
narrow match: REP R3 byEP CMT
narrow match: REP ASS byEP CMT
narrow match: REP R1 byEP CMT
narrow match: REP BUDACT byEP CMT
preferred label: Parlamentarischer Ausschuss, der einen Bericht einreicht @de
preferred label: Predložitev poročila parlamentarnega odbora @sl
preferred label: Raporti esitamine parlamendikomisjonis @et
preferred label: Raportul comisiei parlamentare de depunere a raportului @ro
preferred label: Rapport de dépôt des commissions parlementaires @fr
preferred label: Presentación del informe de la comisión parlamentaria @es
preferred label: Υποβολή έκθεσης από την κοινοβουλευτική επιτροπή @el
preferred label: Verslag over de indiening door de parlementaire commissie @nl
preferred label: Sprawozdanie komisji parlamentarnej @pl
preferred label: A parlamenti bizottság jelentést terjeszt elő @hu
preferred label: Доклад на парламентарната комисия @bg
preferred label: Předložení zprávy parlamentním výborem @cs
preferred label: Parlamentsutskottets framläggande av betänkande @sv
preferred label: Valiokunnan lausunto mietinnöstä @fi
preferred label: Indgivelse af betænkning fra det parlamentariske udvalg @da
preferred label: Relatório da comissão parlamentar sobre a apresentação de relatórios @pt
preferred label: Relazione di presentazione della commissione parlamentare @it
preferred label: Rapport ta’ tressiq mill-kumitat parlamentari @mt
preferred label: Parlamento komitetas, pateikiantis pranešimą @lt
preferred label: Tuarascáil curtha síos ag an gcoiste parlaiminteach @ga
preferred label: Podnošenje izvješća parlamentarnog odbora @hr
preferred label: Parlamenta komiteja, kas iesniedz ziņojumu @lv
preferred label: Predkladanie správy parlamentného výboru @sk

Appointment of a rapporteur
type: Concept
created: 2024-07-01
deprecated: false
broader: Parliamentary committee activity
definition: Parliamentary committee appoints a rapporteur.
in scheme: EP taxonomy on activities.
preferred label: Ħatra ta’ relatur @mt
preferred label: Ορισμός εισηγητή @el
preferred label: Előadó kijelölése @hu
preferred label: Назначаване на докладчик @bg
preferred label: Wyznaczenie sprawozdawcy @pl
preferred label: Designação de um relator @pt
preferred label: Nomination d'un rapporteur @fr
preferred label: Benoeming van een rapporteur @nl
preferred label: Ziņotāja iecelšana @lv
preferred label: Udpegelse af en ordfører @da
preferred label: Bestellung des Berichterstatters @de
preferred label: Pranešėjo skyrimas @lt
preferred label: Imenovanje poročevalca @sl
preferred label: Designación de un ponente @es
preferred label: Vymenovanie spravodajcu @sk
preferred label: Utnämning av en föredragande @sv
preferred label: Esittelijän nimeäminen @fi
preferred label: Numirea unui raportor @ro
preferred label: Rapóirtéir a cheapadh @ga
preferred label: Imenovanje izvjestitelja @hr
preferred label: Jmenování zpravodaje @cs
preferred label: Raportööri nimetamine @et
preferred label: Nomina di un relatore @it

Sitting part
type: Concept
created: 2023-10-31
deprecated: false
broader: Meeting activity
definition: Part of sitting meeting.
in scheme: EP taxonomy on activities.
preferred label: Siddende del @da
preferred label: Sitzender Teil @de
preferred label: Sediaca časť @sk
preferred label: Cuid an tSuímh @ga
preferred label: Partea de șezut @ro
preferred label: Ülőrész @hu
preferred label: Sedeči del @sl
preferred label: Parte di una riunione di sessione @it
preferred label: Parti bilqiegħda @mt
preferred label: Sėdimoji dalis @lt
preferred label: Sēžu daļa @lv
preferred label: Καθήμενο μέρος @el
preferred label: Část zasedání @cs
preferred label: Седяща част @bg
preferred label: Zittend deel @nl
preferred label: Część siedząca @pl
preferred label: Sittande del @sv
preferred label: Istuv osa @et
preferred label: Partie d'une réunion de session @fr
preferred label: Sjedeći dio @hr
preferred label: Parte sentada @es
preferred label: Istunto-osa @fi

Parliamentary delegation adopting a report
type: Concept
created: 2023-10-31
deprecated: false
broader: Parliamentary delegation activity
definition: Parliamentary delegation adopt its report.
in scheme: EP taxonomy on activities.
preferred label: Delegația parlamentară adoptă un raport @ro
preferred label: Parlamendi delegatsioon võtab vastu raporti @et
preferred label: Parlamentná delegácia, ktorá prijíma správu @sk
preferred label: Parlamentarna delegacija sprejela poročilo @sl
preferred label: Parlamentní delegace, která přijala zprávu @cs
preferred label: Parlamentarno izaslanstvo usvojilo izvješće @hr
preferred label: La delegación parlamentaria aprueba un informe @es
preferred label: Parlamento delegacija, priimanti pranešimą @lt
preferred label: Delegacja parlamentarna przyjmująca sprawozdanie @pl
preferred label: Delegazzjoni parlamentari li tadotta rapport @mt
preferred label: Mietinnön hyväksymisestä vastaava parlamentin valtuuskunta @fi
preferred label: Parlamentarisk delegation vedtog en betænkning @da
preferred label: ΚΟΙΝΟΒΟΥΛΕΥΤΙΚΗ Αντιπροσωπεια για την ΕΓΚΡΙΣΗ ΕΚΘΕΣΗΣ @el
preferred label: Parlementaire delegatie keurt verslag goed @nl
preferred label: Délégation parlementaire adoptant un rapport @fr
preferred label: Delegação parlamentar que aprova um relatório @pt
preferred label: Glacann toscaireacht pharlaiminteach tuarascáil @ga
preferred label: Parlamenta delegācija, kas pieņem ziņojumu @lv
preferred label: A parlamenti küldöttség elfogadja a jelentést @hu
preferred label: Annahme eines Berichts durch die parlamentarische Delegation @de
preferred label: Парламентарна делегация, приемаща доклад @bg
preferred label: Parlamentsdelegationen antar ett betänkande @sv
preferred label: Approvazione da parte della delegazione parlamentare di una relazione @it

European Parliament plenary session
type: Concept
created: 2023-10-31
deprecated: false
broader: Meeting activity
definition: The European Parliament plenary session shall be the annual period prescribed by the Act and the Treaties.
in scheme: EP taxonomy on activities.
preferred label: Plenaire zitting van het Europees Parlement @nl
preferred label: Euroopa Parlamendi istungjärk @et
preferred label: Sessão plenária do Parlamento Europeu @pt
preferred label: Session plénière du Parlement européen @fr
preferred label: Plenarsitzungsperiode des Europäischen Parlaments @de
preferred label: Пленарна сесия на Европейския парламент @bg
preferred label: Plenarno zasedanje Evropskega parlamenta @sl
preferred label: Seisiún iomlánach de Pharlaimint na hEorpa @ga
preferred label: Sesiune plenară a Parlamentului European @ro
preferred label: Sessjoni plenarja tal-Parlament Ewropew @mt
preferred label: Período de sesiones plenarias del Parlamento Europeo @es
preferred label: Sesja plenarna Parlamentu Europejskiego @pl
preferred label: Eiropas Parlamenta gadskārtējā plenārsesija @lv
preferred label: Plenárne zasadanie Európskeho parlamentu @sk
preferred label: Európai Parlament plenáris ülésszak @hu
preferred label: Plenární zasedání Evropského parlamentu @cs
preferred label: Σύνοδος του Ευρωπαϊκού Κοινοβουλίου @el
preferred label: Sessione plenaria del Parlamento europeo @it
preferred label: Europos Parlamento plenarinė sesija @lt
preferred label: Europa-Parlamentets session @da
preferred label: Europaparlamentets plenarsession @sv
preferred label: Plenarno zasjedanje Europskog parlamenta @hr
preferred label: Euroopan parlamentin istuntokausi @fi

Parliamentary committee adopting an opinion
type: ActivityType
type: Concept
created: 2023-10-31
deprecated: false
broader: Parliamentary committee activity
definition: Committee for opinion adopts its report to transmit it further to the Responsible Committee.
in scheme: EP taxonomy on activities.
preferred label: Kumitat Parlamentari li jadotta opinjoni @mt
preferred label: Parlementaire commissie die een advies uitbrengt @nl
preferred label: Commission parlementaire adoptant un avis @fr
preferred label: A parlamenti bizottság véleményt fogad el @hu
preferred label: Arvamuse vastuvõtmine parlamendikomisjonis @et
preferred label: Η κοινοβουλευτική επιτροπή εγκρίνει γνωμοδότηση @el
preferred label: Parlamenta komiteja, kas pieņem atzinumu @lv
preferred label: Parlamento komitetas, priimantis nuomonę @lt
preferred label: Parlamentný výbor, ktorý prijíma stanovisko @sk
preferred label: La comisión parlamentaria aprueba una opinión @es
preferred label: Adozione di un parere da parte della commissione parlamentare @it
preferred label: Comissão parlamentar que aprova um parecer @pt
preferred label: Parlamentsutskott som antar ett yttrande @sv
preferred label: Parlamentarischer Ausschuss zur Annahme einer Stellungnahme @de
preferred label: Parlamentin valiokunta, joka antaa lausunnon @fi
preferred label: Coiste parlaiminteach ag glacadh tuairime @ga
preferred label: Komisja parlamentarna przyjmująca opinię @pl
preferred label: Adoptarea unui aviz de către comisia parlamentară @ro
preferred label: Parlamentní výbor, který přijímá stanovisko @cs
preferred label: Парламентарна комисия, приемаща становище @bg
preferred label: Parlamentarni odbor donosi mišljenje @hr
preferred label: Parlamentarni odbor sprejme mnenje @sl
preferred label: Parlamentsudvalg, der vedtager en udtalelse @da

Parliamentary committee vote
type: Concept
created: 2023-10-31
deprecated: false
broader: Parliamentary committee activity
definition: Vote in the curse of a meeting of a parliamentary committee.
in scheme: EP taxonomy on activities.
preferred label: Votación en comisión parlamentaria @es
preferred label: Afstemning i parlamentsudvalget @da
preferred label: Stemming in de parlementaire commissie @nl
preferred label: Glasovanje v parlamentarnem odboru @sl
preferred label: Abstimmung im parlamentarischen Ausschuss @de
preferred label: Głosowanie w komisji parlamentarnej @pl
preferred label: Vótáil sa choiste parlaiminteach @ga
preferred label: Гласуване в парламентарна комисия @bg
preferred label: Votul în comisie parlamentară @ro
preferred label: Balsojums Parlamenta komitejās @lv
preferred label: Votazione in commissione parlamentare @it
preferred label: Hlasování parlamentního výboru @cs
preferred label: Parlamenti bizottsági szavazás @hu
preferred label: Vote en commission parlementaire @fr
preferred label: Balsavimas Parlamento komitete @lt
preferred label: Parlamendikomisjonide hääletus @et
preferred label: Hlasovanie parlamentných výborov @sk
preferred label: Votazzjoni fil-kumitati parlamentari @mt
preferred label: Ψηφοφορία στην κοινοβουλευτική επιτροπή @el
preferred label: Glasovanje u parlamentarnom odboru @hr
preferred label: Omröstning i parlamentets utskott @sv
preferred label: Parlamentin valiokuntaäänestys @fi
preferred label: Votação em comissão parlamentar @pt

European Parliament plenary sitting
type: Concept
type: ActivityType
created: 2023-10-31
deprecated: false
broader: Meeting activity
definition: The European Parliament plenary sitting is a subdivision of a plenary part-session. Sittings of the Parliament held on the same day shall be deemed to be a single sitting.
in scheme: EP taxonomy on activities.
preferred label: Eiropas Parlamenta plenārsēde @lv
preferred label: Συνεδρίαση του Ευρωπαϊκού Κοινοβουλίου @el
preferred label: Plenární denní zasedání Evropského parlamentu @cs
preferred label: Sessão diária plenária do Parlamento Europeu @pt
preferred label: Plenaire vergadering van het Europees Parlement @nl
preferred label: Európai Parlament plenáris ülésnap @hu
preferred label: Euroopan parlamentin täysistunto @fi
preferred label: Plenarsitzung des Europäischen Parlaments @de
preferred label: Posiedzenie plenarne Parlamentu Europejskiego @pl
preferred label: Sesión plenaria del Parlamento Europeo @es
preferred label: Пленарно заседание на Европейския парламент @bg
preferred label: Seduta plenaria del Parlamento europeo @it
preferred label: Séance plénière du Parlement européen @fr
preferred label: Plenarsammanträde i Europaparlamentet @sv
preferred label: Europos Parlamento plenarinis posėdis @lt
preferred label: Seduta plenarja tal-Parlament Ewropew @mt
preferred label: Europa-Parlamentets plenarmøde @da
preferred label: Plenárne rokovanie Európskeho parlamentu @sk
preferred label: Ședință plenară a Parlamentului European @ro
preferred label: Dnevna plenarna sjednica Europskog parlamenta @hr
preferred label: Euroopa Parlamendi istung @et
preferred label: Plenarna seja Evropskega parlamenta @sl
preferred label: Suí iomlánach de Pharlaimint na hEorpa @ga

Parliamentary committee activity
type: Concept
created: 2023-10-31
deprecated: false
definition: Activity by a parliamentary committee.
in scheme: EP taxonomy on activities.
preferred label: Parlamendikomisjonide tegevus @et
preferred label: Werkzaamheden van de parlementaire commissies @nl
preferred label: Parlamentin valiokuntien toiminta @fi
preferred label: Činnosť parlamentných výborov @sk
preferred label: Parlamentarisk udvalgsvirksomhed @da
preferred label: A parlamenti bizottságok tevékenysége @hu
preferred label: Activitatea comisiilor parlamentare @ro
preferred label: Gníomhaíocht an choiste pharlaimintigh @ga
preferred label: Attivitajiet tal-kumitati parlamentari @mt
preferred label: Dejavnosti parlamentarnih odborov @sl
preferred label: Atividades das comissões parlamentares @pt
preferred label: Actividades de las comisiones parlamentarias @es
preferred label: Tätigkeit der parlamentarischen Ausschüsse @de
preferred label: Parlamenta komiteju darbība @lv
preferred label: Activité par une commission parlementaire @fr
preferred label: Działalność komisji parlamentarnych @pl
preferred label: Aktivnosti parlamentarnih odbora @hr
preferred label: Δραστηριότητες των κοινοβουλευτικών επιτροπών @el
preferred label: Činnost parlamentních výborů @cs
preferred label: Attività delle commissioni parlamentari @it
preferred label: Parlamentarisk utskottsverksamhet @sv
preferred label: Parlamento komitetų veikla @lt
preferred label: Дейност на парламентарните комисии @bg
top concept of: EP taxonomy on activities.

Debates in European Parliament plenary sitting
type: Concept
type: ActivityType
created: 2023-10-31
deprecated: false
broader: Plenary activity
definition: Debates in the course of a plenary sitting of the European Parliament.
in scheme: EP taxonomy on activities.
narrow match: DIS BUDR1 byEP
narrow match: DIS BUDR2 byEP
preferred label: Razprave na plenarnem zasedanju Evropskega parlamenta @sl
preferred label: Keskustelut Euroopan parlamentin täysistunnossa @fi
preferred label: Rozpravy na plenárním zasedání Evropského parlamentu @cs
preferred label: Разисквания по време на пленарно заседание на Европейския парламент @bg
preferred label: Dibattiti fis-seduta plenarja tal-Parlament Ewropew @mt
preferred label: Dezbateri în plenul Parlamentului European @ro
preferred label: Diskusijos Europos Parlamento plenariniame posėdyje @lt
preferred label: Debates en la sesión plenaria del Parlamento Europeo @es
preferred label: Arutelud Euroopa Parlamendi täiskogu istungil @et
preferred label: Debates na sessão plenária do Parlamento Europeu @pt
preferred label: Συζητήσεις στη συνεδρίαση της ολομέλειας του Ευρωπαϊκού Κοινοβουλίου @el
preferred label: Rasprave na plenarnoj sjednici Europskog parlamenta @hr
preferred label: Debates Eiropas Parlamenta plenārsēdē @lv
preferred label: Discussioni durante la seduta plenaria del Parlamento europeo @it
preferred label: Rozpravy na plenárnej schôdzi Európskeho parlamentu @sk
preferred label: Díospóireachtaí i suí iomlánach Pharlaimint na hEorpa @ga
preferred label: Aussprachen im Plenum des Europäischen Parlaments @de
preferred label: Viták az Európai Parlament plenáris ülésén @hu
preferred label: Debatter vid Europaparlamentets plenarsammanträde @sv
preferred label: Déliberations dans la session plénière du Parlement Européen @fr
preferred label: Debatten in de plenaire vergadering van het Europees Parlement @nl
preferred label: Drøftelser på Europa-Parlamentets plenarmøde @da
preferred label: Debaty na posiedzeniu plenarnym Parlamentu Europejskiego @pl

Submission of a reasoned opinion by a national chamber
type: Concept
type: ActivityType
created: 2025-01-31
deprecated: false
broader: National chamber activity
definition: National chambers can issue reasoned opinion when they consider draft legislation does not comply with the principle of subsidiarity.
in scheme: EP taxonomy on activities.
preferred label: Indiening van een met redenen omkleed advies door een nationale kamer @nl
preferred label: Tuairim réasúnaithe arna tíolacadh ag dlísheomra náisiúnta @ga
preferred label: A nemzeti tanács indokolással ellátott véleményének benyújtása @hu
preferred label: Prezentarea unui aviz motivat de către o cameră națională @ro
preferred label: Predloženie odôvodneného stanoviska vnútroštátnou komorou @sk
preferred label: Υποβολή αιτιολογημένης γνώμης από εθνικό τμήμα @el
preferred label: Indgivelse af begrundet udtalelse fra en national afdeling @da
preferred label: Presentación de un dictamen motivado por una cámara nacional @es
preferred label: Předložení odůvodněného stanoviska vnitrostátní komorou @cs
preferred label: Pamatota atzinuma iesniegšana, ko veic valsts palāta @lv
preferred label: Podnošenje obrazloženog mišljenja nacionalnog doma @hr
preferred label: Nacionalinių rūmų pagrįsta nuomonė @lt
preferred label: Predložitev obrazloženega mnenja nacionalnega doma @sl
preferred label: Presentazione di un parere motivato da parte di una camera nazionale @it
preferred label: Vorlage einer mit Gründen versehenen Stellungnahme durch eine nationale Kammer @de
preferred label: Preżentazzjoni ta’ opinjoni motivata minn kamra nazzjonali @mt
preferred label: Liikmesriigi koja põhjendatud arvamuse esitamine @et
preferred label: Kansallisen kamarin perusteltu lausunto @fi
preferred label: Внасяне на мотивирано становище от национална камара @bg
preferred label: Przedłożenie uzasadnionej opinii przez izbę krajową @pl
preferred label: Inlämning av ett motiverat yttrande från en nationell kammare @sv
preferred label: Soumission d'un avis motivé par une chambre nationale @fr
preferred label: Apresentação de um parecer fundamentado por uma câmara nacional @pt

Rejection of the Council’s position by the EP at 2nd reading
type: ActivityType
type: Concept
created: 2023-10-31
deprecated: false
broader: Plenary activity
definition: Plenary reject Council position.
in scheme: EP taxonomy on activities.
narrow match: RJ byEP
preferred label: Zamítnutí postoje Rady v EP ve 2. čtení @cs
preferred label: Rejet de la position du Conseil par le PE en deuxième lecture @fr
preferred label: A Tanács álláspontjának elutasítása az Európai Parlament által második olvasatban @hu
preferred label: Nõukogu seisukoha tagasilükkamine Euroopa Parlamendi poolt teisel lugemisel @et
preferred label: Rifiuto della posizione del Consiglio da parte del PE in seconda lettura @it
preferred label: Verwerping van het standpunt van de Raad door het EP in 2e lezing @nl
preferred label: Zamietnutie pozície Rady zo strany EP v druhom čítaní @sk
preferred label: Padomes nostājas noraidījums Eiropas Parlamentā 2. lasījumā @lv
preferred label: Respingerea poziției Consiliului de către PE în a doua lectură @ro
preferred label: Euroopan parlamentti hylännyt neuvoston kannan toisessa käsittelyssä @fi
preferred label: Zavrnitev stališča Sveta s strani EP v drugi obravnavi @sl
preferred label: Diúltú leasuithe ar sheasamh na Comhairle ag PE ar an 2ú léamh @ga
preferred label: Europaparlamentets avvisning av rådets ståndpunkt vid andra behandlingen @sv
preferred label: Rejeição da posição do Conselho pelo PE em segunda leitura @pt
preferred label: Απόρριψη της θέσης του Συμβουλίου από το ΕΚ σε δεύτερη ανάγνωση @el
preferred label: Tarybos pozicijos atmetimas EP antruoju svarstymu @lt
preferred label: Rifjut tal-pożizzjoni tal-Kunsill mill-PE fit-2 qari @mt
preferred label: Ablehnung des Standpunkts des Rates durch das EP in 2. Lesung @de
preferred label: EP odbija stajalište Vijeća u drugom čitanju @hr
preferred label: Odrzucenie stanowiska Rady przez PE w drugim czytaniu @pl
preferred label: Parlamentets forkastelse af Rådets holdning ved andenbehandling @da
preferred label: Rechazo por el PE en segunda lectura de la posición del Consejo @es
preferred label: Отхвърляне на позицията на Съвета от ЕП на второ четене @bg

EP position at 1st reading with amendments
type: ActivityType
type: Concept
created: 2023-10-31
deprecated: false
broader: Plenary activity
definition: EP position at 1st reading with amendments refers to the position adopted by the European Parliament, at first reading, introducing modifications (amendments) to a given draft legislative act.
in scheme: EP taxonomy on activities.
preferred label: Az Európai Parlament első olvasatban kialakított, módosításokat bevezető álláspontja @hu
preferred label: Stajalište EP-a u prvom čitanju s amandmanima @hr
preferred label: Posición del PE en primera lectura con enmiendas @es
preferred label: Posição do PE em primeira leitura com alterações @pt
preferred label: Position du PE en première lecture avec amendements @fr
preferred label: Pozícia EP v 1. čítaní s pozmeňujúcimi návrhmi @sk
preferred label: Europaparlamentets ståndpunkt vid första behandlingen med ändringsförslag @sv
preferred label: Europa-Parlamentets førstebehandlingsholdning med ændringsforslag @da
preferred label: Stališče Evropskega parlamenta v prvi obravnavi s spremembami @sl
preferred label: Il-pożizzjoni tal-PE fl-ewwel qari bl-emendi @mt
preferred label: Euroopa Parlamendi seisukoht esimesel lugemisel koos muudatusettepanekutega @et
preferred label: Postoj EP při 1. čtení s pozměňovacími návrhy @cs
preferred label: EP nostāja pirmajā lasījumā ar grozījumiem @lv
preferred label: Θέση του Ευρωπαϊκού Κοινοβουλίου σε πρώτη ανάγνωση με τροπολογίες @el
preferred label: Euroopan parlamentin ensimmäisen käsittelyn kanta tarkistuksineen @fi
preferred label: Seasamh PE sa chéad léamh le leasuithe @ga
preferred label: Позиция на ЕП на първо четене с изменения @bg
preferred label: Posizione del PE in 1ª lettura con emendamenti @it
preferred label: Poziția PE la prima lectură cu amendamente @ro
preferred label: Standpunt EP in 1e lezing met amendementen @nl
preferred label: Stanowisko PE w pierwszym czytaniu wraz z poprawkami @pl
preferred label: EP per 1-ąjį svarstymą priimta pozicija su pakeitimais @lt
preferred label: Standpunkt des EP in erster Lesung mit Änderungen @de

Approval of the joint text agreed in the Conciliation Committee by the EP
type: Concept
type: ActivityType
created: 2025-01-31
deprecated: false
broader: Plenary activity
definition: In the scope of a procedure subject to 3rd Reading, plenary adopt the Join Text, result of the Conciliation Committee negotiations.
in scheme: EP taxonomy on activities.
preferred label: Lepituskomitees kokku lepitud ühine tekst kiidetakse Euroopa Parlamendis heaks @et
preferred label: Parlaimint na hEorpa do fhormheas an téacs chomhpháirtigh a comhaontaíodh sa Choiste Idir-réitigh @ga
preferred label: Έγκριση από το ΕΚ του κοινού σχεδίου που συμφωνήθηκε στην επιτροπή συνδιαλλαγής @el
preferred label: EP odobrava zajednički tekst dogovoren u Odboru za mirenje @hr
preferred label: Billigung des vom Vermittlungsausschuss angenommenen gemeinsamen Entwurfs durch das EP @de
preferred label: Euroopan parlamentti hyväksynyt sovittelukomiteassa sovitun yhteisen tekstin @fi
preferred label: Kopīgais dokuments, par kuru panākta vienošanās Samierināšanas komitejā, EP ir apstiprināts @lv
preferred label: Goedkeuring door het EP van de gemeenschappelijke ontwerptekst waarover in het bemiddelingscomité overeenstemming is bereikt @nl
preferred label: Aprobación por el PE del texto conjunto acordado en el Comité de Conciliación @es
preferred label: Approvazzjoni tat-test konġunt maqbul fil-Kumitat ta’ Konċiljazzjoni mill-PE @mt
preferred label: Europaparlamentets godkännande av det gemensamma utkast som förlikningskommittén kommit överens om @sv
preferred label: Approvazione da parte del PE del progetto comune concordato in sede di comitato di conciliazione @it
preferred label: Aprovação pelo PE do projeto comum acordado no Comité de Conciliação @pt
preferred label: Az egyeztetőbizottságban elfogadott közös szövegtervezet jóváhagyása az EP által @hu
preferred label: Odobritev skupnega besedila, o katerem se je Evropski parlament dogovoril v spravnem odboru @sl
preferred label: Одобряване от страна на ЕП на общия проект, договорен в помирителния комитет @bg
preferred label: Aprobarea proiectului comun convenit în cadrul comitetului de conciliere de către PE @ro
preferred label: Zatwierdzenie przez PE wspólnego tekstu uzgodnionego przez komitet pojednawczy @pl
preferred label: Schválenie spoločného textu dohodnutého v Zmierovacom výbore Európskym parlamentom @sk
preferred label: Schválení společného návrhu dohodnutého v dohodovacím výboru Evropským parlamentem @cs
preferred label: Bendro projekto, dėl kurio susitarta Taikinimo komitete, patvirtinimas EP @lt
preferred label: Approbation par le PE du projet commun approuvé par le comité de conciliation @fr
preferred label: Europa-Parlamentets godkendelse af Forligsudvalgets fælles udkast @da

EP position at 1st reading
type: Concept
type: ActivityType
created: 2023-10-31
deprecated: false
broader: Plenary activity
definition: Plenary adopt its position.
in scheme: EP taxonomy on activities.
narrow match: ADP byEP
narrow match: ADP R1 POS byEP
preferred label: EP pozicija pirmuoju svarstymu @lt
preferred label: Posizione del PE in prima lettura @it
preferred label: Postoj EP v 1. čtení @cs
preferred label: Позиция на Парламента на първо четене @bg
preferred label: Pozícia EP v 1. čítaní @sk
preferred label: Eiropas Parlamenta nostāja 1. lasījumā @lv
preferred label: Euroopan parlamentin ensimmäisen käsittelyn kanta @fi
preferred label: Stajalište EP-a u prvom čitanju @hr
preferred label: Position du Parlement européen en première lecture @fr
preferred label: Posición del PE en primera lectura @es
preferred label: Stanowisko PE w pierwszym czytaniu @pl
preferred label: Posição do PE em primeira leitura @pt
preferred label: Stališče EP na prvi obravnavi @sl
preferred label: Europa-Parlamentets førstebehandlingsholdning @da
preferred label: Seasamh PE sa chéad léamh @ga
preferred label: Poziția Parlamentului European la prima lectură @ro
preferred label: Standpunt Europees Parlement in 1e lezing @nl
preferred label: Θέση του ΕΚ σε 1η ανάγνωση @el
preferred label: Standpunkt des Parlaments in 1. Lesung @de
preferred label: Europaparlamentets ståndpunkt vid första behandlingen @sv
preferred label: A Parlament álláspontja első olvasatban @hu
preferred label: Euroopa Parlament võtab vastu esimese lugemise seisukoha @et
preferred label: Il-pożizzjoni tal-PE fl-ewwel qari @mt

Request for split vote
type: ActivityType
type: Concept
created: 2023-10-31
deprecated: false
broader: Proceeding activity
definition: Request for a vote to be split.
in scheme: EP taxonomy on activities.
preferred label: Искане за разделно гласуване @bg
preferred label: Kohta kohdalta -äänestystä koskeva pyyntö @fi
preferred label: Žádost o dílčí hlasování @cs
preferred label: Cerere de vot pe părți @ro
preferred label: Demande de vote par division @fr
preferred label: Richiesta di votazione per parti separate @it
preferred label: Antrag auf getrennte Abstimmung @de
preferred label: Wniosek o głosowanie podzielone @pl
preferred label: Talba għal votazzjoni maqsuma @mt
preferred label: Pedido de votação por partes @pt
preferred label: Iarraidh ar vótáil dheighilte @ga
preferred label: Prašymas balsuoti dalimis @lt
preferred label: Verzoek om stemming in onderdelen @nl
preferred label: Žiadosť o hlasovanie po častiach @sk
preferred label: Zahtjev za glasovanje po dijelovima @hr
preferred label: Zahteva za glasovanje po delih @sl
preferred label: Taotlus osade kaupa hääletamiseks @et
preferred label: Αίτηση για ψηφοφορία κατά τμήματα @el
preferred label: Anmodning om delt afstemning @da
preferred label: Pieprasījums balsot pa daļām @lv
preferred label: Részenkénti szavazás iránti kérelem @hu
preferred label: Begäran om delad omröstning @sv
preferred label: Solicitud de votación por partes @es

Request for urgency vote
type: Concept
created: 2024-07-01
deprecated: false
broader: Proceeding activity
definition: Request for an urgency vote.
in scheme: EP taxonomy on activities.
preferred label: Solicitud de votación de urgencia @es
preferred label: Žiadosť o naliehavé hlasovanie @sk
preferred label: Zahteva za nujno glasovanje @sl
preferred label: Verzoek om dringende stemming @nl
preferred label: Pedido de votação urgente @pt
preferred label: Zahtjev za hitno glasovanje @hr
preferred label: Antrag auf Dringlichkeitsabstimmung @de
preferred label: Sürgősségi szavazás iránti kérelem @hu
preferred label: Talba għal votazzjoni ta’ urġenza @mt
preferred label: Steidzamības balsojuma pieprasījums @lv
preferred label: Искане за спешно гласуване @bg
preferred label: Αίτηση έκτακτης ψηφοφορίας @el
preferred label: Žádost o naléhavé hlasování @cs
preferred label: Vótáil ar iarraidh phráinne @ga
preferred label: Anmodning om hasteafstemning @da
preferred label: Kiireellistä äänestystä koskeva pyyntö @fi
preferred label: Begäran om brådskande omröstning @sv
preferred label: Cerere de vot în regim de urgență @ro
preferred label: Demande de vote urgent @fr
preferred label: Kiirhääletuse taotlus @et
preferred label: Richiesta di votazione d'urgenza @it
preferred label: Prašymas skubos tvarka balsuoti @lt
preferred label: Wniosek o głosowanie w trybie pilnym @pl

Plenary activity
type: Concept
type: ActivityType
created: 2023-10-31
deprecated: false
definition: Activity by plenary.
in scheme: EP taxonomy on activities.
preferred label: Tätigkeit des Plenums @de
preferred label: Činnost plenárního zasedání @cs
preferred label: A plenáris ülés tevékenysége @hu
preferred label: Plenarmøder @da
preferred label: Пленарни дейности @bg
preferred label: Δραστηριότητα της Ολομέλειας @el
preferred label: Aktivnosti plenarne sjednice @hr
preferred label: Attività della plenaria @it
preferred label: Plenaire activiteit @nl
preferred label: Täysistuntotoiminta @fi
preferred label: Täiskogu tegevus @et
preferred label: Plenārsesijas pasākums @lv
preferred label: Dejavnost plenarnega zasedanja @sl
preferred label: Activitate în plen @ro
preferred label: Plenarverksamhet @sv
preferred label: Činnosť plenárneho zasadnutia @sk
preferred label: Plenarinių posėdžių veikla @lt
preferred label: Atividade plenária @pt
preferred label: Activités de la plénière @fr
preferred label: Attività tal-plenarja @mt
preferred label: Działalność plenarna @pl
preferred label: Actividades plenarias @es
preferred label: Gníomhaíocht sa suí iomlánach @ga
top concept of: EP taxonomy on activities.

Parliamentary committee rejecting provisional agreement
type: Concept
created: 2023-10-31
deprecated: false
broader: Parliamentary committee activity
definition: Responsible parliamentary committee reject provisional agreement resulting of interinstitutional negotiations.
in scheme: EP taxonomy on activities.
preferred label: Parlamentarisk udvalg, der forkaster den foreløbige aftale @da
preferred label: Commission parlementaire rejetant l’accord provisoire @fr
preferred label: Parlamenta komiteja, kas noraida pagaidu vienošanos @lv
preferred label: Парламентарна комисия, отхвърляща предварителното споразумение @bg
preferred label: Parlamento komitetas atmeta preliminarų susitarimą @lt
preferred label: Parlamentný výbor zamietol predbežnú dohodu @sk
preferred label: Parlamentarni odbor koji odbija privremeni sporazum @hr
preferred label: La comisión parlamentaria rechaza el acuerdo provisional @es
preferred label: Κοινοβουλευτική επιτροπή που απορρίπτει την προσωρινή συμφωνία @el
preferred label: La commissione parlamentare respinge l'accordo provvisorio @it
preferred label: Coiste parlaiminteach a dhiúltaíonn do chomhaontú sealadach @ga
preferred label: Comisia parlamentară de respingere a acordului provizoriu @ro
preferred label: Parlamentin valiokunta hylkää alustavan sopimuksen @fi
preferred label: Kumitat Parlamentari li jiċħad ftehim proviżorju @mt
preferred label: Parlamentarni odbor zavrača začasni dogovor @sl
preferred label: Az ideiglenes megállapodást elutasító parlamenti bizottság @hu
preferred label: Parlamentsausschuss lehnt vorläufige Einigung ab @de
preferred label: Komisja parlamentarna odrzuca wstępne porozumienie @pl
preferred label: Esialgse kokkuleppe tagasilükkamine parlamendikomisjoni poolt @et
preferred label: Parlamentní výbor zamítající předběžnou dohodu @cs
preferred label: Comissão parlamentar que rejeita o acordo provisório @pt
preferred label: Parlamentsutskottet förkastar den preliminära överenskommelsen @sv
preferred label: Parlementaire commissie verwerpt voorlopig akkoord @nl

Written statement of a debate in a plenary
type: ActivityType
type: Concept
created: 2023-10-31
deprecated: false
broader: Plenary activity
definition: Written statement of a debate during a plenary.
in scheme: EP taxonomy on activities.
preferred label: Ráiteas i scríbhinn maidir le díospóireacht i suí iomlánach @ga
preferred label: Γραπτή δήλωση συζήτησης σε ολομέλεια @el
preferred label: Pisna izjava o razpravi na plenarnem zasedanju @sl
preferred label: Declarație scrisă a unei dezbateri în plen @ro
preferred label: Dikjarazzjoni bil-miktub ta’ dibattitu f’plenarja @mt
preferred label: Skriftligt uttalande från en debatt i kammaren @sv
preferred label: A plenáris ülésen folytatott vitára vonatkozó írásbeli nyilatkozat @hu
preferred label: Skriftlig redegørelse for en debat på et plenarmøde @da
preferred label: Täiskogu istungil toimunud arutelu kirjalik avaldus @et
preferred label: Písomné vyhlásenie z rozpravy v pléne @sk
preferred label: Pisana izjava s rasprave na plenarnoj sjednici @hr
preferred label: Pisemne oświadczenie o debacie na posiedzeniu plenarnym @pl
preferred label: Declaração escrita de um debate em sessão plenária @pt
preferred label: Kirjallinen kannanotto täysistunnossa käytävään keskusteluun @fi
preferred label: Dichiarazione scritta di un dibattito in plenaria @it
preferred label: Rakstisks paziņojums par debatēm plenārsēdē @lv
preferred label: Písemné prohlášení z rozpravy na plenárním zasedání @cs
preferred label: Déclaration écrite d’un débat en plénière @fr
preferred label: Declaración por escrito de un debate en el Pleno @es
preferred label: Plenarinio posėdžio diskusijų rašytinis pareiškimas @lt
preferred label: Schriftelijke uiteenzetting van een debat in de plenaire vergadering @nl
preferred label: Писмено изявление от разискванията в пленарна зала @bg
preferred label: Schriftliche Erklärung einer Aussprache im Plenum @de

EP taxonomy on activities.
type: ConceptScheme
created: 2023-10-31
creator: EP
description: Taxonomy of the European Parliament on legislative activities.
modified: 2026-01-31
version info: 20260131_1

Outcome of a plenary
type: ActivityType
type: Concept
created: 2023-10-31
deprecated: false
broader: Plenary activity
definition: Outcome of a plenary.
in scheme: EP taxonomy on activities.
preferred label: Täiskogu istungjärgu tulemused @et
preferred label: An toradh a bhí ar chruinniú iomlánach @ga
preferred label: Ishod plenarne sjednice @hr
preferred label: Wyniki posiedzenia plenarnego @pl
preferred label: Resultaat van een plenaire vergadering @nl
preferred label: Eżitu ta’ plenarja @mt
preferred label: Resultado de un pleno @es
preferred label: Täysistunnon tulokset @fi
preferred label: A plenáris ülés eredménye @hu
preferred label: Plenārsēdes rezultāti @lv
preferred label: Resultatet af et plenarmøde @da
preferred label: Resultados de uma sessão plenária @pt
preferred label: Résultats d’une session plénière @fr
preferred label: ΑΠΟΤΕΛΕΣΜΑΤΑ ΤΗΣ ΟΛΟΜΕΛΕΙΑΣ @el
preferred label: Esito di una sessione plenaria @it
preferred label: Rezultatul unei sesiuni plenare @ro
preferred label: Ergebnis einer Plenartagung @de
preferred label: Резултати от пленарно заседание @bg
preferred label: Plenarinės sesijos rezultatai @lt
preferred label: Výsledok plenárneho zasadnutia @sk
preferred label: Výsledek plenárního zasedání @cs
preferred label: Resultatet av ett plenarsammanträde @sv
preferred label: Izid plenarnega zasedanja @sl

Formal sitting part
type: Concept
created: 2023-10-31
deprecated: false
broader: Meeting activity
definition: Formal part of sitting meeting.
in scheme: EP taxonomy on activities.
preferred label: Sesión solemne @es
preferred label: Seduta solenne di una riunione di sessione @it
preferred label: Partie formelle d'une réunion de session @fr
preferred label: Uroczysta część posiedzenia @pl
preferred label: Juhlaistunto @fi
preferred label: Slavnostna seja @sl
preferred label: Πανηγυρική συνεδρίαση @el
preferred label: Sessão solene @pt
preferred label: Parti tal-udjenza solenni @mt
preferred label: Feierlicher Sitzungsteil @de
preferred label: Formální část zasedání @cs
preferred label: Тържествено заседание @bg
preferred label: Svinīgā sēdes daļa @lv
preferred label: Iškilmingas posėdis @lt
preferred label: Istungi pidulik osa @et
preferred label: Plechtige zitting @nl
preferred label: Partea solemnă de ședință @ro
preferred label: Cuid an tsuí fhoirmiúil @ga
preferred label: Svečana sjednica @hr
preferred label: Formálna časť rokovania @sk
preferred label: Ünnepélyes ülésrész @hu
preferred label: Højtideligt retsmøde @da
preferred label: Högtidlig sammanträdesdel @sv

European Parliament plenary part-session
type: ActivityType
type: Concept
created: 2023-10-31
deprecated: false
broader: Meeting activity
definition: The European Parliament plenary part-session shall be the meeting of the Europeal Parliament convened as a rule each month and subdivided into daily sittings.
in scheme: EP taxonomy on activities.
preferred label: Europos Parlamento plenarinė mėnesinė sesija @lt
preferred label: Europaparlamentets plenarsammanträdesperiod @sv
preferred label: Perioadă de sesiune plenară a Parlamentului European @ro
preferred label: Месечна пленарна сесия на Европейския парламент @bg
preferred label: Période de session plénière du Parlement européen @fr
preferred label: Plenarna sesja miesięczna Parlamentu Europejskiego @pl
preferred label: Plenaire vergaderperiode van het Europees Parlement @nl
preferred label: Euroopan parlamentin istuntojakso @fi
preferred label: Eiropas Parlamenta plenārsesija @lv
preferred label: Páirtseisiún iomlánach de Pharlaimint na hEorpa @ga
preferred label: Delno plenarno zasedanje Evropskega parlamenta @sl
preferred label: Plenárna schôdza Európskeho parlamentu @sk
preferred label: Europa-Parlamentets mødeperiode @da
preferred label: Plenartagung des Europäischen Parlaments @de
preferred label: Plenární dílčí zasedání Evropského parlamentu @cs
preferred label: Tornata del Parlamento europeo @it
preferred label: Sessjoni parzjali plenarja tal-Parlament Ewropew @mt
preferred label: Plenarna sjednica Europskog parlamenta @hr
preferred label: Euroopa Parlamendi osaistungjärk @et
preferred label: Európai Parlament plenáris ülés @hu
preferred label: Período de sessões plenárias do Parlamento Europeu @pt
preferred label: Período parcial de sesiones del Parlamento Europeo @es
preferred label: Περίοδος συνόδου του Ευρωπαϊκού Κοινοβουλίου @el