Electronic roll-call vote
type: Concept
preferred label: Elektrooniline nimeline hääletus @et
preferred label: Elektroničko poimenično glasovanje @hr
preferred label: Elektronisk omröstning med namnupprop @sv
created: 2023-10-31
preferred label: Vardinis balsavimas elektroniniu būdu @lt
preferred label: Elektronikus név szerinti szavazás @hu
preferred label: Elektronische hoofdelijke stemming @nl
preferred label: Jmenovité elektronické hlasování @cs
preferred label: Elektroniczne głosowanie imienne @pl
preferred label: Elektronisk afstemning ved navneopråb @da
preferred label: Elektronické hlasovanie podľa mien @sk
in scheme: EP taxonomy on decision methods
preferred label: Elektronische namentliche Abstimmung @de
deprecated: false
broader: Vote
preferred label: Електронно поименно гласуване @bg
definition: Voting method in which voters cast their ballots by electronic means in a non anonymous way.
preferred label: Koneäänestyksenä toimitettu nimenhuutoäänestys @fi
preferred label: Votação eletrónica nominal @pt
preferred label: Ηλεκτρονική ψηφοφορία με ονομαστική κλήση @el
preferred label: Elektronsko poimensko glasovanje @sl
type: DecisionMethod
preferred label: Elektroniskā balsošana pēc saraksta @lv
preferred label: Votazzjoni elettronika b’sejħa tal-ismijiet @mt
preferred label: Vótáil leictreonach le glao rolla @ga
preferred label: Vot electronic prin apel nominal @ro
preferred label: Votación nominal electrónica @es
preferred label: Vote électronique par appel nominal @fr
preferred label: Votazione elettronica per appello nominale @it

EP taxonomy on decision methods
type: ConceptScheme
version info: 20250930_1
modified: 2025-09-30
description: Taxonomy of the European Parliament on decision and vote methods.
created: 2023-10-31
creator: EP

Vote
type: Concept
preferred label: Ψηφοφορία @el
top concept of: EP taxonomy on decision methods
preferred label: Vótáil @ga
preferred label: Glas @sl
definition: A formal indication of a choice between two or more options, usually through a ballot or a show of hands.
preferred label: Hlasování @cs
preferred label: Hlasovanie @sk
preferred label: Głosowanie @pl
preferred label: Гласуване @bg
preferred label: Votează @ro
preferred label: Votazione @it
deprecated: false
preferred label: Stemmen @nl
preferred label: Omröstning @sv
preferred label: Hääletus @et
preferred label: Szavazás @hu
preferred label: Balsavimas @lt
preferred label: Afstemning @da
preferred label: Votação @pt
preferred label: Abstimmung @de
preferred label: Votazzjoni @mt
in scheme: EP taxonomy on decision methods
preferred label: Glasanje @hr
preferred label: Äänestys @fi
created: 2023-10-31
preferred label: Votación @es
preferred label: Balsojums @lv

Simple electronic vote
type: DecisionMethod
preferred label: Zwykłe głosowanie elektroniczne @pl
preferred label: Elektrooniline lihthäälteenamusega hääletus @et
preferred label: Vienkārša elektroniskā balsošana @lv
preferred label: Gewone elektronische stemming @nl
preferred label: Votazzjoni elettronika sempliċi @mt
preferred label: Jednoduché elektronické hlasování @cs
preferred label: Paprastas balsavimas elektroniniu būdu @lt
broader: Vote
preferred label: Enostavno elektronsko glasovanje @sl
created: 2023-10-31
preferred label: Simpel elektronisk afstemning @da
preferred label: Votação eletrónica simples @pt
preferred label: Jednostavno elektroničko glasovanje @hr
preferred label: Elektronikus szavazás @hu
preferred label: Enkel elektronisk omröstning @sv
in scheme: EP taxonomy on decision methods
preferred label: Jednoduché elektronické hlasovanie @sk
definition: Voting system in which voters cast their ballots by electronic means.
preferred label: Vótáil leictreonach shimplí @ga
preferred label: Vote électronique simple @fr
preferred label: Обикновено електронно гласуване @bg
preferred label: Vot electronic simplu @ro
preferred label: Votación electrónica simple @es
type: Concept
preferred label: Votazione elettronica semplice @it
preferred label: Yksinkertainen koneäänestys @fi
preferred label: Einfache elektronische Abstimmung @de
preferred label: Απλή ηλεκτρονική ψηφοφορία @el
deprecated: false

Hand raise vote
type: Concept
preferred label: Kädennostoäänestys @fi
preferred label: Vótáil trí lámh a ardú @ga
preferred label: Głosowanie przez podniesienie ręki @pl
preferred label: Vote à main-levée @fr
preferred label: Гласуване с вдигане на ръка @bg
preferred label: Votazzjoni b’turija tal-idejn @mt
preferred label: Glasovanje dizanjem ruke @hr
preferred label: Votación a mano alzada @es
preferred label: Szavazás kézfelemeléssel @hu
preferred label: Käe tõstmisega hääletus @et
broader: Vote
preferred label: Votação por braços erguidos @pt
preferred label: Balsošana, paceļot roku @lv
deprecated: false
preferred label: Abstimmung per Handzeichen @de
preferred label: Omröstning med handuppräckning @sv
preferred label: Votazione per alzata di mano @it
type: DecisionMethod
preferred label: Hlasování zvednutím ruky @cs
preferred label: Stemming bij handopsteken @nl
created: 2023-10-31
definition: Voting method in which voters raise one hand to demonstrate their support for or opposition towards an idea.
preferred label: Vot prin ridicarea mâinii @ro
preferred label: Hlasovanie zdvihnutím ruky @sk
preferred label: Ψηφοφορία με ανάταση των χεριών @el
preferred label: Balsavimas rankos pakėlimu @lt
preferred label: Glasovanje z vzdigom roke @sl
in scheme: EP taxonomy on decision methods
preferred label: Afstemning ved håndsrækning @da

Secret ballot electronic vote
type: Concept
broader: Vote
preferred label: Salainen koneäänestys @fi
preferred label: Geheime elektronische stemming @nl
preferred label: Votazione elettronica a scrutinio segreto @it
preferred label: Tajné hlasovanie formou elektronického hlasovania @sk
preferred label: Tajno elektroničko glasovanje @hr
preferred label: Elektronsko tajno glasovanje @sl
preferred label: Votação eletrónica por escrutínio secreto @pt
preferred label: Hemmelig elektronisk afstemning @da
preferred label: Aizklāta elektroniskā balsošana @lv
created: 2023-10-31
preferred label: Slaptas balsavimas elektroniniu būdu @lt
preferred label: Vot electronic secret @ro
preferred label: Sluten elektronisk omröstning @sv
preferred label: Votación secreta electrónica @es
deprecated: false
preferred label: Votazzjoni elettronika permezz ta’ vot sigriet @mt
type: DecisionMethod
preferred label: Vote électronique par scrutin secret @fr
definition: Voting method in which voters cast their ballots by electronic means, without their identity being disclosed.
in scheme: EP taxonomy on decision methods
preferred label: Elektroniczne głosowanie tajne @pl
preferred label: Тайно електронно гласуване @bg
preferred label: Vótáil leictreonach le ballóid rúnda @ga
preferred label: Elektronické hlasování tajným hlasováním @cs
preferred label: Salajane elektrooniline hääletus @et
preferred label: Μυστική ηλεκτρονική ψηφοφορία @el
preferred label: Titkos szavazás elektronikus úton @hu
preferred label: Elektronische geheime Abstimmung @de

Decision
type: Concept
preferred label: Beslut @sv
preferred label: Decyzja @pl
preferred label: Decizie @ro
in scheme: EP taxonomy on decision methods
preferred label: Otsus @et
preferred label: Határozat @hu
preferred label: Rozhodnutie @sk
preferred label: Cinneadh @ga
preferred label: Decisione @it
preferred label: Entscheidung @de
preferred label: Besluit @nl
preferred label: Päätös @fi
preferred label: Odluka @hr
created: 2023-10-31
preferred label: Решението @bg
preferred label: Απόφαση @el
preferred label: Rozhodnutí @cs
preferred label: Decisión @es
top concept of: EP taxonomy on decision methods
preferred label: Decisão @pt
preferred label: Sprendimas @lt
preferred label: Lēmums @lv
preferred label: Décision @fr
preferred label: Odločitev @sl
preferred label: Afgørelse @da
definition: A conclusion or resolution reached after consideration.
preferred label: Deċiżjoni @mt
deprecated: false

Secret ballot non-electronic vote
type: Concept
preferred label: Slaptas balsavimas ne elektroniniu būdu @lt
preferred label: Votação não eletrónica por escrutínio secreto @pt
preferred label: Titkos szavazás nem elektronikus úton @hu
preferred label: Muuten kuin koneäänestyksenä toimitettu salainen äänestys @fi
preferred label: Aizklāta neelektroniska balsošana @lv
preferred label: Μυστική μη ηλεκτρονική ψηφοφορία @el
preferred label: Neelektronické hlasování tajným hlasováním @cs
preferred label: Vot neelectronic secret @ro
preferred label: Geheime niet-elektronische stemming @nl
preferred label: Vote non électronique par scrutin secret @fr
preferred label: Nieelektroniczne głosowanie tajne @pl
broader: Vote
in scheme: EP taxonomy on decision methods
preferred label: Votazzjoni mhux elettronika permezz ta’ vot sigriet @mt
preferred label: Vótáil neamhleictreonach le ballóid rúnda @ga
created: 2023-10-31
preferred label: Тайно гласуване, което не е електронно @bg
preferred label: Votación secreta no electrónica @es
preferred label: Hemmelig ikkeelektronisk afstemning @da
type: DecisionMethod
preferred label: Votazione non elettronica a scrutinio segreto @it
preferred label: Sluten icke-elektronisk omröstning @sv
preferred label: Tajné hlasovanie neelektronickou formou hlasovania @sk
preferred label: Nicht elektronische geheime Abstimmung @de
preferred label: Salajane mitteelektrooniline hääletus @et
deprecated: false
preferred label: Neelektronsko tajno glasovanje @sl
preferred label: Neelektroničko tajno glasovanje @hr
definition: Voting method in which voters cast their ballots by non electronic means, without their identity being disclosed.

Non-electronic roll-call vote
type: DecisionMethod
preferred label: Μη ηλεκτρονική ψηφοφορία με ονομαστική κλήση @el
preferred label: Niet-elektronische hoofdelijke stemming @nl
preferred label: Neelektronické hlasovanie podľa mien @sk
preferred label: Vot neelectronic prin apel nominal @ro
definition: Voting method in whic h voters cast their ballots by non electronic means in a non anonymous way.
broader: Vote
preferred label: Поименно гласуване, което не е електронно @bg
preferred label: Votazione non elettronica per appello nominale @it
created: 2023-10-31
preferred label: Ikkeelektronisk afstemning ved navneopråb @da
preferred label: Nem elektronikus név szerinti szavazás @hu
preferred label: Votação nominal não eletrónica @pt
preferred label: Neelektroniska balsošana pēc saraksta @lv
preferred label: Icke-elektronisk omröstning med namnupprop @sv
preferred label: Muuten kuin koneäänestyksenä toimitettu nimenhuutoäänestys @fi
preferred label: Votación nominal no electrónica @es
preferred label: Neelektroničko poimenično glasovanje @hr
type: Concept
preferred label: Nieelektroniczne głosowanie imienne @pl
preferred label: Vote non électronique par appel nominal @fr
deprecated: false
preferred label: Votazzjoni mhux elettronika b’sejħa tal-ismijiet @mt
preferred label: Jmenovité hlasování jiné než elektronické @cs
preferred label: Nicht elektronische namentliche Abstimmung @de
preferred label: Vardinis balsavimas ne elektroniniu būdu @lt
preferred label: Neelektronsko poimensko glasovanje @sl
preferred label: Vótáil le glao rolla neamhleictreonach @ga
preferred label: Mitteelektrooniline nimeline hääletus @et
in scheme: EP taxonomy on decision methods