Bureau notice to Members
type: WorkType
in scheme: EP taxonomy on document types.
preferred label: Oznámenie Predsedníctva poslancom @sk
preferred label: Comunicação da Mesa aos membros @pt
preferred label: Avviż tal-Bureau lill-Membri @mt
preferred label: Obavijest Predsjedništva zastupnicima @hr
preferred label: Comunicarea Biroului către membri @ro
preferred label: Comunicazione dell'Ufficio di presidenza ai deputati @it
preferred label: Obvestilo predsedstva poslancem @sl
preferred label: Elnökségi közlemény a képviselők számára @hu
preferred label: Mededeling van het Bureau aan de leden @nl
preferred label: Ανακοίνωση του Προεδρείου προς τους βουλευτές @el
preferred label: Съобщение на Бюрото до членовете на ЕП @bg
preferred label: Præsidiets meddelelse til medlemmerne @da
definition: Communication from the European Parliament Bureau.
preferred label: Juhatuse teatis parlamendiliikmetele @et
preferred label: Communication du Bureau aux députés @fr
preferred label: Sdělení předsednictva poslancům @cs
preferred label: Puhemiehistön ilmoitus jäsenille @fi
preferred label: Comunicación de la Mesa a los diputados @es
preferred label: Fógra ón mBiúró do na Feisirí @ga
preferred label: Prezidija paziņojums deputātiem @lv
preferred label: Meddelande från presidiet till ledamöterna @sv
preferred label: Komunikat Prezydium dla posłów @pl
created: 2025-10-31
type: Concept
preferred label: Biuro pranešimas nariams @lt
preferred label: Mitteilung des Präsidiums an die Mitglieder @de
broader: Bureau document
deprecated: false

EP taxonomy on document types.
type: ConceptScheme
created: 2023-10-31
creator: EP
description: Taxonomy of the European Parliament on document types.
version info: 20260131_1
modified: 2026-01-31

Bureau document
type: Concept
in scheme: EP taxonomy on document types.
definition: Document from the European Parliament Bureau.
created: 2025-10-31
preferred label: Dokument předsednictva @cs
preferred label: Präsidiumsdokument @de
preferred label: Documento da Mesa @pt
preferred label: Document al Biroului @ro
preferred label: Työvaliokunnan asiakirja @fi
preferred label: Documento dell'Ufficio di presidenza @it
deprecated: false
broader: Document
preferred label: Document van het bureau @nl
preferred label: Dokument tal-Bureau @mt
preferred label: Dokument Prezydium @pl
preferred label: Dokument Predsjedništva @hr
preferred label: Biroja dokuments @lv
preferred label: Presidiets dokument @sv
preferred label: Elnökségi dokumentum @hu
preferred label: Dokument predsedstva @sl
preferred label: Документ на Бюрото @bg
preferred label: Document du Bureau @fr
preferred label: Præsidiedokument @da
preferred label: Documento de la Mesa @es
preferred label: Biuro dokumentas @lt
preferred label: Έγγραφο του Προεδρείου @el
preferred label: Dokument predsedníctva @sk
type: WorkType
preferred label: Doiciméad ón mBiúró @ga
preferred label: Juhatuse dokument @et

Document
type: Concept
preferred label: Doiciméad @ga
preferred label: Dokument @hr
preferred label: Documento @es
preferred label: Έγγραφο @el
definition: Piece of official information.
preferred label: Asiakirja @fi
preferred label: Dokuments @lv
in scheme: EP taxonomy on document types.
preferred label: Dokumentas @lt
deprecated: false
top concept of: EP taxonomy on document types.
preferred label: Dokumentum @hu
created: 2023-10-31
preferred label: Документ @bg

Follow-up of acts
type: Concept
preferred label: Daljnje postupanje u vezi s aktima @hr
preferred label: Säädösten seuranta @fi
preferred label: Suivi des actes @fr
preferred label: Následná opatření v návaznosti na akty @cs
definition: European Commission follow up document on European Parliament texts adopted.
preferred label: Παρακολούθηση των πράξεων @el
preferred label: Uppföljning av rättsakter @sv
preferred label: Seguimiento de los actos @es
preferred label: Folgemaßnahmen zu Rechtsakten @de
in scheme: EP taxonomy on document types.
preferred label: Acțiuni ulterioare actelor @ro
preferred label: Následné opatrenia v nadväznosti na akty @sk
preferred label: Acompanhamento dos atos @pt
preferred label: Turpmākie pasākumi saistībā ar tiesību aktiem @lv
preferred label: Nadaljnje ukrepanje v zvezi z akti @sl
preferred label: Opfølgning på retsakter @da
preferred label: A jogi aktusok nyomon követése @hu
preferred label: Follow-up van besluiten @nl
preferred label: Õigusaktide järelmeetmed @et
preferred label: Seguito dato agli atti @it
created: 2023-10-31
deprecated: false
preferred label: Segwitu tal-atti @mt
preferred label: Tolesni veiksmai, susiję su aktais @lt
preferred label: Działania następcze w związku z aktami @pl
preferred label: Bearta leantacha ar ghníomhartha @ga
preferred label: Последващи действия във връзка с актове @bg
top concept of: EP taxonomy on document types.

Parliamentary committee mission report with recommendations and conclusions
type: WorkType
preferred label: Доклад за командировката на парламентарната комисия с препоръки и заключения @bg
in scheme: EP taxonomy on document types.
preferred label: Parlamenti bizottsági küldöttségi jelentés ajánlásokkal és következtetésekkel @hu
preferred label: Rapport tal-missjoni tal-kumitat parlamentari b'rakkomandazzjonijiet u konklużjonijiet @mt
preferred label: Relazione di missione della commissione parlamentare con raccomandazioni e conclusioni @it
definition: Parliamentary committee mission report with recommendations and conclusions.
preferred label: Zpráva o pracovní cestě parlamentního výboru s doporučeními a závěry @cs
preferred label: Parlamentin valiokunnan matkaraportti suosituksineen ja päätelmineen @fi
preferred label: Έκθεση αποστολής κοινοβουλευτικής επιτροπής με συστάσεις και συμπεράσματα @el
broader: Mission report
preferred label: Poročilo o misiji parlamentarnega odbora s priporočili in sklepi @sl
type: Concept
preferred label: Parlamento komiteto misijos ataskaita su rekomendacijomis ir išvadomis @lt
preferred label: Rapport från parlamentsutskottens tjänsteresa med rekommendationer och slutsatser @sv
preferred label: Správa zo služobnej cesty parlamentného výboru s odporúčaniami a závermi @sk
preferred label: Bericht über die Reise einer Delegation des Parlamentsausschusses mit Empfehlungen und Schlussfolgerungen @de
preferred label: Rapport de mission de la commission parlementaire avec recommandations et conclusions @fr
preferred label: Izvješće o službenom putovanju parlamentarnog odbora s preporukama i zaključcima @hr
preferred label: Relatório de missão da comissão parlamentar com recomendações e conclusões @pt
preferred label: Sprawozdanie z wyjazdu komisji parlamentarnej wraz z zaleceniami i wnioskami @pl
preferred label: Rapport fra udvalgsdelegationsrejser med henstillinger og konklusioner @da
preferred label: Parlamendikomisjoni lähetuse aruanne soovituste ja järeldustega @et
preferred label: Tuarascáil mhisin an choiste pharlaimintigh ina bhfuil moltaí agus conclúidí @ga
preferred label: Verslag van het werkbezoek van de parlementaire commissie met aanbevelingen en conclusies @nl
preferred label: Parlamenta komiteju darba brauciena ziņojums ar ieteikumiem un secinājumiem @lv
preferred label: Informe de misión de la comisión parlamentaria con recomendaciones y conclusiones @es
deprecated: false
preferred label: Raportul misiunii comisiei parlamentare conținând recomandări și concluzii @ro
created: 2025-10-31

Mission report
type: WorkType
broader: Document
deprecated: false
preferred label: Zpráva o služební cestě @cs
preferred label: Lähetuse aruanne @et
created: 2025-10-31
preferred label: Έκθεση αποστολής @el
preferred label: Tuarascáil mhisin @ga
preferred label: Missionsrapport @da
preferred label: Rapport de mission @fr
preferred label: Raportul de misiune @ro
in scheme: EP taxonomy on document types.
preferred label: Rapport tal-missjoni @mt
preferred label: Informe de misión @es
preferred label: Relazione sulla missione @it
preferred label: Správa zo služobnej cesty @sk
preferred label: Uppdragsrapport @sv
preferred label: Darba brauciena atskaite @lv
definition: Report about a mission.
preferred label: Relatório de missão @pt
preferred label: Доклад от командировката @bg
preferred label: Komandiruotės ataskaita @lt
preferred label: Verslag van het werkbezoek @nl
preferred label: Bericht über die Dienstreise @de
type: Concept
preferred label: Virkamatkaraportti @fi
preferred label: Sprawozdanie z misji @pl
preferred label: Poročilo o misiji @sl
preferred label: Küldetési jelentés @hu
preferred label: Izvješće o službenom putovanju @hr

Joint text
type: Concept
broader: Resolution
deprecated: false
preferred label: Wspólny tekst @pl
preferred label: Bendras tekstas @lt
preferred label: Kopīgs dokuments @lv
preferred label: Yhteinen teksti @fi
preferred label: Texte commun @fr
preferred label: Fælles udkast @da
created: 2023-10-31
preferred label: Közös szövegtervezet @hu
preferred label: Gemensamt utkast @sv
preferred label: Projeto comum @pt
preferred label: Ühistekst @et
preferred label: Oбщ проект @bg
preferred label: Texto conjunto @es
preferred label: Téacs comhpháirteach @ga
preferred label: Κοινό σχέδιο @el
preferred label: Společný návrh @cs
preferred label: Spoločný text @sk
preferred label: Gemeenschappelijke ontwerptekst @nl
preferred label: Gemeinsamer Entwurf @de
preferred label: Proiect comun @ro
in scheme: EP taxonomy on document types.
preferred label: Zajednički tekst @hr
preferred label: Progetto comune @it
preferred label: Test konġunt @mt
preferred label: Skupno besedilo @sl
definition: Joint text.

Resolution
type: Concept
preferred label: Päätöslauselma @fi
top concept of: EP taxonomy on document types.
preferred label: Resolutie @nl
preferred label: Resolucija @sl
in scheme: EP taxonomy on document types.
preferred label: Riżoluzzjoni @mt
definition: Text in which a body expresses an opinion or a purpose with respect to a given matter or topic that is temporary in nature.
preferred label: Rezolucja @pl
preferred label: Állásfoglalás @hu
preferred label: Entschließung @de
preferred label: Rezolūcija @lv
preferred label: Uznesenie @sk
preferred label: Resolução @pt
preferred label: Rezolucija @hr
deprecated: false
preferred label: Резолюция @bg
preferred label: Risoluzione @it
preferred label: Rún @ga
preferred label: Rezoliucija @lt
preferred label: Rezoluție @ro
preferred label: Résolution @fr
preferred label: Ψήφισμα @el
preferred label: Resolusjon @no
preferred label: Resolutsioon @et
preferred label: Usnesení @cs
preferred label: Resolución @es
created: 2023-10-31

Draft directive
type: Concept
preferred label: Projeto de diretiva @pt
preferred label: Nacrt direktiva @hr
preferred label: Proyecto de directiva @es
in scheme: EP taxonomy on document types.
preferred label: Entwurf einer Richtlinie @de
preferred label: Předloha směrnice @cs
preferred label: Direktiiviluonnos @fi
preferred label: Abbozz ta' direttiva @mt
preferred label: Návrh smernice @sk
preferred label: Direktīvas projektas @lv
preferred label: Проектодиректива @bg
preferred label: Utkast til direktiv @sv
preferred label: Ontwerprichtlijn @nl
preferred label: Udkast til direktiv @da
preferred label: Projekt dyrektywy @pl
preferred label: Σχέδιο οδηγίας @el
definition: Draft legislative act setting out a goal that EU countries must achieve by devising their own laws on how to reach these goals.
created: 2023-10-31
preferred label: Direktiivi eelnõu @et
broader: Dyrektywa
preferred label: Direktyva projekts @lt
preferred label: Osnutek direktive @sl
preferred label: Progetto di direttiva @it
preferred label: Irányelvtervezet @hu
deprecated: false
preferred label: Proiect de directivă @ro
preferred label: Projet de directive @fr
preferred label: Dréacht-treoir @ga

Dyrektywa
type: Concept
preferred label: Treoir @ga
preferred label: Direktyva @lt
preferred label: Directiva @es
preferred label: Direktiva @hr
preferred label: Diretiva @pt
in scheme: EP taxonomy on document types.
preferred label: Οδηγία @el
preferred label: Richtlinie @de
preferred label: Richtlijn @nl
preferred label: Direktīva @lv
preferred label: Direttiva @mt
preferred label: Direktiivi @fi
created: 2023-10-31
top concept of: EP taxonomy on document types.
preferred label: Directivă @ro
preferred label: Smernica @sk
definition: Legislative act setting out a goal that EU countries must achieve by devising their own laws on how to reach these goals.
preferred label: Direktiiv @et
deprecated: false
preferred label: Irányelv @hu
preferred label: Директива @bg
preferred label: Směrnice @cs
preferred label: Directive
preferred label: Direktiv @da

EP Rules of Procedures
type: Concept
deprecated: false
definition: Text laying down accepted rules, ethics and customs governing proceedings and meetings of the European Parliament.
preferred label: Regulamin PE @pl
created: 2023-10-31
preferred label: Jednací řád EP @cs
preferred label: Poslovnik EP-a @hr
preferred label: Regimento do Parlamento Europeu @pt
preferred label: Regoli ta’ Proċedura tal-PE @mt
preferred label: Regolamento del PE @it
preferred label: EP:n työjärjestys @fi
preferred label: Poslovnik Evropskega parlamenta @sl
top concept of: EP taxonomy on document types.
preferred label: Rokovací poriadok EP @sk
preferred label: EP's forretningsorden @da
preferred label: Rialacha Nós Imeachta Pharlaimint na hEorpa @ga
preferred label: Geschäftsordnung des EP @de
in scheme: EP taxonomy on document types.
preferred label: EP darbo tvarkos taisyklės @lt
preferred label: Regulamentul de procedură al PE @ro
preferred label: Reglamento interno del Parlamento Europeo @es
preferred label: Règlement du Parlement Européen @fr
preferred label: Κανονισμός του ΕΚ @el
preferred label: Reglement van het EP @nl
preferred label: Euroopa Parlamendi kodukord @et
preferred label: Правилник за дейността на ЕП @bg
preferred label: Az EP eljárási szabályzata @hu
preferred label: Parlamentets arbetsordning @sv
preferred label: EP Reglaments @lv

Draft parliamentary committee report
type: Concept
preferred label: Parlamendikomisjoni raporti projekt @et
preferred label: Entwurf eines Berichts eines parlamentarischen Ausschusses @de
preferred label: Proyecto de informe de comisión parlamentaria @es
definition: Draft text drawn up by a parliamentary committee on a subject in a view of a debate and a vote.
preferred label: Проект на доклад на парламентарна комисия @bg
preferred label: Parlamento komiteto pranešimo projektas @lt
preferred label: Udkast til betænkning fra et parlamentarisk udvalg @da
preferred label: Σχέδιο έκθεσης κοινοβουλευτικής επιτροπής @el
preferred label: Projeto de relatório de uma comissão parlamentar @pt
preferred label: Valiokunnan mietintöluonnos @fi
in scheme: EP taxonomy on document types.
preferred label: Proiect de raport al comisiei parlamentare @ro
preferred label: Progetto di relazione di una commissione parlamentare @it
preferred label: Parlamenti bizottság jelentéstervezete @hu
preferred label: Ontwerpverslag van een parlementaire commissie @nl
preferred label: Návrh správy parlamentného výboru @sk
preferred label: Abbozz ta’ rapport ta’ Kumitat Parlamentari @mt
preferred label: Förslag till betänkande från ett parlamentsutskott @sv
type: WorkType
broader: Report
preferred label: Návrh zprávy parlamentního výboru @cs
deprecated: false
preferred label: Osnutek poročila parlamentarnega odbora @sl
preferred label: Parlamenta komitejas ziņojuma projekts @lv
preferred label: Projekt sprawozdania komisji parlamentarnej @pl
created: 2023-10-31
preferred label: Dréacht-tuarascáil ó Choiste Parlaiminteach @ga
preferred label: Projet de rapport de commission parlementaire @fr
preferred label: Nacrt izvješća parlamentarnog odbora @hr

Report
type: Concept
top concept of: EP taxonomy on document types.
preferred label: Poročilo @sl
preferred label: Informe @es
in scheme: EP taxonomy on document types.
preferred label: Jelentés @hu
deprecated: false
preferred label: Raport @ro
preferred label: Relazione @it
preferred label: Pranešimas @lt
preferred label: Bericht @de
preferred label: Kertomus @fi
preferred label: Správa @sk
preferred label: Доклад @bg
preferred label: Sprawozdanie @pl
preferred label: Verslag @nl
preferred label: Tuarascáil @ga
created: 2023-10-31
definition: To give a description of something or information about it to someone
preferred label: Izvješće @hr
preferred label: Rapport @da
preferred label: Relatório @pt
preferred label: Zpráva @cs
preferred label: Έκθεση @el
preferred label: Ziņojums @lv

Parliamentary committee roll-call votes
type: WorkType
preferred label: Votazioni per appello nominale delle commissioni parlamentari @it
preferred label: namentliche Abstimmungen des Parlamentsausschusses @de
preferred label: Parlamenta komiteju balsojumi pēc saraksta @lv
preferred label: Hlasovanie podľa mien parlamentného výboru @sk
preferred label: Поименни гласувания в парламентарните комисии @bg
preferred label: Hoofdelijke stemmingen in de parlementaire commissies @nl
preferred label: Vardinis balsavimas Parlamento komitete @lt
definition: Results of roll-call votes in the written record of a meeting of a parliamentary committee.
deprecated: false
preferred label: Votes par appel nominal des commissions parlementaires @fr
created: 2025-10-31
preferred label: Parlamendikomisjonide nimelised hääletused @et
preferred label: Omröstningar med namnupprop i parlamentsutskotten @sv
type: Concept
preferred label: Poimenično glasovanje u parlamentarnom odboru @hr
preferred label: Votaciones nominales de las comisiones parlamentarias @es
preferred label: Votazzjonijiet b'sejħa tal-ismijiet tal-kumitati parlamentari @mt
in scheme: EP taxonomy on document types.
preferred label: Parlamentin valiokuntien nimenhuutoäänestykset @fi
preferred label: Voturi prin apel nominal ale comisiilor parlamentare @ro
broader: Parliamentary committee minutes
preferred label: Votações nominais das comissões parlamentares @pt
preferred label: Afstemninger ved navneopråb i Parlamentets udvalg @da
preferred label: Ψηφοφορίες με ονομαστική κλήση της κοινοβουλευτικής επιτροπής @el
preferred label: Poimensko glasovanje v parlamentarnih odborih @sl
preferred label: Vótáil le glaoch rolla an choiste pharlaimintigh @ga
preferred label: Jmenovité hlasování parlamentních výborů @cs
preferred label: Parlamenti bizottsági név szerinti szavazások @hu
preferred label: Głosowania imienne w komisjach parlamentarnych @pl

Parliamentary committee minutes
type: WorkType
preferred label: Acta de comisión parlamentaria @es
preferred label: Valiokunnan pöytäkirja @fi
preferred label: Miontuairiscí Coiste Pharlaimintigh @ga
preferred label: Proces-verbal al comisiei parlamentare @ro
in scheme: EP taxonomy on document types.
definition: Written record of a parliamentary committee meeting.
preferred label: Parlamento komiteto posėdžio protokolas @lt
preferred label: Minuti ta’ Kumitat Parlamentari @mt
preferred label: Ata de uma comissão parlamentar @pt
preferred label: Processo verbale di una commissione parlamentare @it
preferred label: Notulen van een vergadering van een parlementaire commissie @nl
created: 2023-10-31
preferred label: Zápisnica parlamentného výboru @sk
type: Concept
preferred label: Zapisnik parlamentarnega odbora @sl
preferred label: Протокол от заседание на парламентарна комисия @bg
deprecated: false
preferred label: Parlamenti bizottság ülésének jegyzőkönyve @hu
preferred label: Protokol fra et møde i et parlamentarisk udvalg @da
preferred label: Zápis z jednání parlamentního výboru @cs
preferred label: Procès-verbal de commission parlementaire @fr
preferred label: Πρακτικά κοινοβουλευτικής επιτροπής @el
preferred label: Parlamendikomisjoni koosoleku protokoll @et
broader: Minutes
preferred label: Parlamenta komitejas protokols @lv
preferred label: Protokoll einer Sitzung eines parlamentarischen Ausschusses @de
preferred label: Protokoll från ett utskottssammanträde @sv
preferred label: Protokół posiedzenia komisji parlamentarnej @pl
preferred label: Zapisnik parlamentarnog odbora @hr

Minutes
type: Concept
preferred label: Jegyzőkönyv @hu
top concept of: EP taxonomy on document types.
preferred label: Zápisnica @sk
preferred label: Processo verbale @it
preferred label: Minuti @mt
preferred label: Zápis @cs
preferred label: Protokol @da
preferred label: Acta @es
preferred label: Procès-verbal @fr
preferred label: Zapisnik @sl
preferred label: Protokols @lv
preferred label: Posėdžio protokolas @lt
preferred label: Miontuairiscí @ga
preferred label: Протокол @bg
preferred label: Pöytäkirja @fi
preferred label: Protokół @pl
in scheme: EP taxonomy on document types.
preferred label: Proces-verbal @ro
created: 2023-10-31
preferred label: Protokoll @sv
preferred label: Συνοπτικά πρακτικά @el
deprecated: false
definition: Written record of a meeting.
preferred label: Ata @pt
preferred label: Notulen @nl

Errata
type: WorkType
preferred label: Oikaisu @fi
preferred label: Pogreška @hr
preferred label: Erratum
preferred label: Поправки @bg
type: Concept
broader: Annex
preferred label: Διορθωτικο @el
preferred label: Errátum @sk
preferred label: Erată @ro
definition: A mistake in a printed or written document
in scheme: EP taxonomy on document types.
created: 2023-10-31
deprecated: false
preferred label: Earráid @ga
preferred label: Hibajegyzék @hu
preferred label: Erraty @pl
preferred label: Napáka @sl
preferred label: Parandus @et

Annex
type: WorkType
preferred label: Príloha @sk
preferred label: Melléklet @hu
preferred label: Annexe @fr
preferred label: Priedas @lt
preferred label: Παράρτημα @el
preferred label: Lisa @et
preferred label: Załącznik @pl
preferred label: Pielikums @lv
preferred label: Bijlage @nl
preferred label: Bilag @da
preferred label: Příloha @cs
top concept of: EP taxonomy on document types.
deprecated: false
preferred label: Prilog @hr
preferred label: Anness @mt
preferred label: Bilaga @sv
definition: Section of a text appended to its end or in a separated document.
preferred label: Anexă @ro
preferred label: Приложение @bg
preferred label: Anhang @de
preferred label: Iarscríbhinn @ga
created: 2023-10-31
in scheme: EP taxonomy on document types.
preferred label: Allegato @it
preferred label: Liite @fi
preferred label: Priloga @sl
type: Concept
preferred label: Anexo @es

Parliamentary delegation agenda
type: Concept
definition: Agenda of a parliamentary delegation meeting.
preferred label: Ordine de zi a delegației parlamentare @ro
preferred label: Valtuuskunnan esityslista @fi
preferred label: Ημερήσια διάταξη κοινοβουλευτικής αντιπροσωπείας @el
preferred label: Dnevni red parlamentarne delegacije @sl
preferred label: Porządek dzienny posiedzenia delegacji parlamentarnej @pl
created: 2023-10-31
preferred label: Дневен ред на парламентарна делегация @bg
preferred label: Agenda de délégation parlementaire @fr
preferred label: Parlamento delegacijos posėdžio darbotvarkė @lt
preferred label: Clár oibre Toscaireachta Parlaimintí @ga
broader: Tagesordnung
preferred label: Dagsorden for et møde i en parlamentarisk delegation @da
preferred label: Dnevni red parlamentarnog izaslanstva @hr
preferred label: Orden del día de delegación parlamentaria @es
preferred label: Program rokovania parlamentnej delegácie @sk
preferred label: Tagesordnung einer parlamentarischen Delegation @de
preferred label: Aġenda ta’ Delegazzjoni Parlamentari @mt
preferred label: Föredragningslista för ett delegationssammanträde @sv
preferred label: Agenda van een parlementaire delegatie @nl
preferred label: Parlamendi delegatsiooni koosoleku päevakord @et
in scheme: EP taxonomy on document types.
preferred label: Ordine del giorno di una delegazione parlamentare @it
deprecated: false
preferred label: Parlamenti küldöttség ülésének napirendje @hu
preferred label: Parlamenta delegācijas darba kārtība @lv
preferred label: Pořad jednání parlamentní delegace @cs
preferred label: Ordem do dia de uma delegação parlamentar @pt

Tagesordnung
type: Concept
preferred label: Ημερήσια διάταξη @el
preferred label: Pořad jednání @cs
preferred label: Napirend @hu
preferred label: Aġenda @mt
preferred label: Esityslista @fi
preferred label: Päevakord @et
preferred label: Dagordning @sv
preferred label: Orden del día @es
in scheme: EP taxonomy on document types.
preferred label: Ordem de trabalhos @pt
preferred label: Dnevni red @sl
preferred label: Darba kārtība @lv
preferred label: Ordinea de zi @ro
top concept of: EP taxonomy on document types.
preferred label: Clár Oibre @ga
created: 2023-10-31
preferred label: Darbotvarkė @lt
preferred label: Дневен ред @bg
definition: Agenda of a meeting.
preferred label: Ordre du jour @fr
deprecated: false
preferred label: Agenda
preferred label: Dagsorden @da
preferred label: Porządek obrad @pl
preferred label: Ordine del giorno @it

Legislative resolution
type: Concept
preferred label: Wetgevingsresolutie @nl
preferred label: Lagstiftningsresolution @sv
preferred label: Jogalkotási állásfoglalás @hu
preferred label: Résolution législative @fr
in scheme: EP taxonomy on document types.
broader: Resolution
preferred label: Lovgivningsmæssig beslutning @da
preferred label: Seadusandlik resolutsioon @et
preferred label: Normatīvā rezolūcija @lv
preferred label: Lainsäädäntöpäätöslauselma @fi
preferred label: Rún reachtach @ga
preferred label: Legislative Entschließung @de
preferred label: Zakonodavna rezolucija @hr
preferred label: Resolução legislativa @pt
preferred label: Teisėkūros rezoliucija @lt
preferred label: Rezolucja ustawodawcza @pl
preferred label: Νομοθετικό ψήφισμα @el
deprecated: false
preferred label: Risoluzione legislativa @it
created: 2023-10-31
preferred label: Законодателна резолюция @bg
preferred label: Legislativní usnesení @cs
preferred label: Zakonodajna resolucija @sl
preferred label: Resolución legislativa @es
preferred label: Rezoluție legislativă @ro
preferred label: Legislatívne uznesenie @sk
definition: Text in which a body expresses an opinion or a purpose with respect to a given matter or topic that is temporary in nature.
preferred label: Riżoluzzjoni leġiżlattiva @mt

Draft motion for resolution
type: Concept
created: 2023-10-31
preferred label: Proyecto de propuesta de resolución @es
preferred label: Rezolūcijas priekšlikuma projekts @lv
in scheme: EP taxonomy on document types.
preferred label: Projet de proposition de résolution @fr
preferred label: Entwurf eines Entschließungsantrags @de
definition: Draft text declaring European Parliament's opinion on a matter tabled on a topical issue, at the request of a committee, a political group or members and voted in plenary.
preferred label: Projeto de proposta de resolução @pt
preferred label: Dréacht-tairiscint i gcomhair rúin @ga
preferred label: Předběžný návrh usnesení @cs
preferred label: Nacrt prijedloga rezolucije @hr
broader: Resolution
preferred label: Resolutsiooni ettepaneku projekt @et
preferred label: Abbozz ta’ mozzjoni għal riżoluzzjoni @mt
preferred label: Návrh uznesenia @sk
preferred label: Проект на предложение за резолюция @bg
preferred label: Proiect de propunere de rezoluție @ro
preferred label: Ontwerpresolutie @nl
deprecated: false
preferred label: Pasiūlymo dėl rezoliucijos projektas @lt
preferred label: Luonnos päätöslauselmaesitykseksi @fi
preferred label: Utkast till förslag till resolution @sv
preferred label: Állásfoglalási indítvány tervezete @hu
preferred label: Udkast til forslag til beslutning @da
preferred label: Wstępny projekt rezolucji @pl
preferred label: Progetto di proposta di risoluzione @it
preferred label: Σχέδιο πρότασης ψηφίσματος @el
preferred label: Osnutek predloga resolucije @sl

Parliamentary committee working document
type: WorkType
preferred label: Pracovní dokument parlamentního výboru @cs
preferred label: Radni dokument parlamentarnog odbora @hr
preferred label: Arbeitsdokument des Parlamentsausschusses @de
preferred label: Dokument ta' ħidma tal-kumitat parlamentari @mt
preferred label: Documento de trabalho das comissões parlamentares @pt
preferred label: Έγγραφο εργασίας της κοινοβουλευτικής επιτροπής @el
preferred label: Parlamentin valiokunnan työasiakirja @fi
in scheme: EP taxonomy on document types.
preferred label: Document de travail de la commission parlementaire @fr
broader: Working document
preferred label: Arbejdsdokument fra Parlamentets udvalg @da
preferred label: Document de lucru al comisiei parlamentare @ro
preferred label: Werkdocument van de parlementaire commissie @nl
deprecated: false
preferred label: Doiciméad oibre an choiste pharlaimintigh @ga
preferred label: Arbetsdokument från parlamentsutskottet @sv
preferred label: Parlamento komiteto darbo dokumentas @lt
preferred label: Pracovný dokument parlamentného výboru @sk
preferred label: Documento de trabajo de la comisión parlamentaria @es
preferred label: Dokument roboczy komisji parlamentarnej @pl
type: Concept
preferred label: Parlamendikomisjoni töödokument @et
preferred label: Работен документ на парламентарната комисия @bg
definition: Parliamentary committee working document.
preferred label: Documento di lavoro delle commissioni parlamentari @it
preferred label: Delovni dokument parlamentarnega odbora @sl
preferred label: Parlamenta komitejas darba dokuments @lv
created: 2025-10-31
preferred label: Parlamenti bizottsági munkadokumentum @hu

Working document
type: Concept
preferred label: Arbeitsunterlage @de
preferred label: Document de travail @fr
preferred label: Radni dokument @hr
preferred label: Documento de trabalho @pt
preferred label: Document de lucru @ro
preferred label: Delovni dokument @sl
in scheme: EP taxonomy on document types.
preferred label: Dokument roboczy @pl
preferred label: Munkadokumentum @hu
preferred label: Documento de trabajo @es
preferred label: Työasiakirja @fi
preferred label: Töödokument @et
preferred label: Работен документ @bg
preferred label: Darba dokuments @lv
preferred label: Pracovní dokument @cs
preferred label: Arbejdsdokument @da
broader: Document
preferred label: Werkdocument @nl
preferred label: Darbinis dokumentas @lt
preferred label: Dokument ta' ħidma @mt
preferred label: Pracovný dokument @sk
created: 2025-10-31
type: WorkType
preferred label: Arbetsdokument @sv
deprecated: false
definition: Working document.
preferred label: Documento di lavoro @it
preferred label: Doiciméad oibre @ga
preferred label: Έγγραφο εργασίας @el

EP's list of amendments
type: WorkType
preferred label: Popis amandmana EP-a @hr
preferred label: Seznam predlogov sprememb Evropskega parlamenta @sl
preferred label: Lista poprawek PE @pl
deprecated: false
preferred label: Liste der Änderungsanträge des EP @de
preferred label: Parlamentets förteckning över ändringsförslag @sv
preferred label: Lista de enmiendas del Parlamento Europeo @es
preferred label: Az EP módosításainak jegyzéke @hu
preferred label: Списък на измененията на ЕП @bg
preferred label: Seznam pozměňovacích návrhů EP @cs
in scheme: EP taxonomy on document types.
type: Concept
created: 2023-10-31
broader: Amendment
preferred label: Liste d‘amendements du PE @fr
preferred label: EP:n tarkistusluettelo @fi
preferred label: Lista ta’ emendi tal-PE @mt
preferred label: EP's liste over ændringsforslag @da
preferred label: Zoznam pozmeňujúcich návrhov EP @sk
definition: List grouping amendments.
preferred label: Lijst van amendementen van het EP @nl
preferred label: Lista amendamentelor PE @ro
preferred label: Parlamendi muudatusettepanekute loetelu @et
preferred label: EP grozījumu saraksts @lv
preferred label: Κατάλογος τροπολογιών του ΕΚ @el
preferred label: Elenco di emendamenti del PE @it
preferred label: Liosta leasuithe PE @ga
preferred label: EP pakeitimų sąrašas @lt
preferred label: Lista de alterações do PE @pt

Amendment
type: Concept
preferred label: Ændring @da
preferred label: Dodatek @cs
preferred label: Proposta għal emenda @mt
preferred label: Pakeitimas @lt
top concept of: EP taxonomy on document types.
preferred label: Änderung @de
preferred label: Amendement @fr
preferred label: Τροποποίηση @el
preferred label: Изменение @bg
preferred label: Amandman @hr
preferred label: Grozījums @lv
deprecated: false
preferred label: Enmienda @es
preferred label: Muudatusettepanek @et
preferred label: Zmeny @sk
preferred label: Tarkistus @fi
preferred label: Ändringsförslag @sv
definition: Change introduced in a text in form of an addition, modification or deletion from the original source text.
preferred label: Alteração @pt
preferred label: Emendamento @it
preferred label: Amendamentul @ro
preferred label: Poprawka @pl
preferred label: Sprememba @sl
in scheme: EP taxonomy on document types.
created: 2023-10-31
preferred label: Módosítás @hu
preferred label: Leasú @ga

EP plenary sitting explanation of vote
type: Concept
preferred label: Erklärung zur Abstimmung im Plenum des EP @de
preferred label: Explicación de voto de la sesión plenaria del PE @es
broader: Minutes
preferred label: Explicarea votului în ședința plenară a PE @ro
preferred label: Explication du vote en séance plénière du PE @fr
deprecated: false
preferred label: Vysvětlení hlasování na plenárním zasedání EP @cs
preferred label: Declaração de voto na sessão plenária do PE @pt
preferred label: Ep:n täysistunnon äänestysselitys @fi
preferred label: Spjegazzjoni tal-vot tas-seduta plenarja tal-PE @mt
preferred label: Euroopa Parlamendi täiskogu istungi selgitus hääletuse kohta @et
preferred label: Objašnjenje glasovanja na plenarnoj sjednici EP-a @hr
preferred label: Dichiarazione di voto in seduta plenaria del PE @it
preferred label: Obrazložitev glasovanja na plenarnem zasedanju EP @sl
preferred label: Stemmeforklaring fra EP's plenarmøde @da
preferred label: Stemverklaring voor de plenaire vergadering van het EP @nl
preferred label: Vysvetlenie hlasovania na plenárnej schôdzi EP @sk
preferred label: Röstförklaring vid Europaparlamentets plenarsammanträde @sv
in scheme: EP taxonomy on document types.
preferred label: EP plenarinio posėdžio paaiškinimas dėl balsavimo @lt
preferred label: Αιτιολόγηση ψήφου στην ολομέλεια του ΕΚ @el
preferred label: Az EP plenáris ülésének indoklása a szavazáshoz @hu
preferred label: Wyjaśnienie głosowania na posiedzeniu plenarnym PE @pl
preferred label: Обяснение на вот от пленарното заседание на ЕП @bg
definition: Justification for some amendment to vote record in the written record of a plenary sitting of the European Parliament.
preferred label: Míniú ar an vótáil i suí iomlánach na Parlaiminte @ga
preferred label: EP plenārsēdes balsojuma skaidrojums @lv
created: 2023-10-31

Draft resolution
type: Concept
preferred label: Návrh rezolúcie @sk
preferred label: Проекторезолюция @bg
preferred label: Proiect de rezoluție @ro
preferred label: Ontwerpresolutie @nl
in scheme: EP taxonomy on document types.
preferred label: Utkast till resolution @sv
preferred label: Udkast til resolution @da
preferred label: Resolutsiooni eelnõu @et
preferred label: Abbozz ta' riżoluzzjoni @mt
created: 2023-10-31
preferred label: Σχέδιο ψηφίσματος @el
preferred label: Entwurf einer Entschließung @de
preferred label: Päätöslauselmaluonnos @fi
preferred label: Projet de résolution @fr
preferred label: Progetto di risoluzione @it
preferred label: Állásfoglalás-tervezet @hu
definition: Draft text in which a body expresses an opinion or a purpose with respect to a given matter or topic that is temporary in nature.
preferred label: Projeto de resolução @pt
preferred label: Předloha usnesení @cs
preferred label: Nacrt rezolucije @hr
preferred label: Proyecto de resolución @es
broader: Resolution
preferred label: Dréachtrún @ga
preferred label: Rezolūcijas projekts @lv
deprecated: false
preferred label: Osnutek resolucije @sl
preferred label: Rezoliucijos projektas @lt
preferred label: Projekt rezolucji @pl

Joint motion for a resolution
type: WorkType
preferred label: Κοινή πρόταση ψηφίσματος @el
preferred label: Kopīgs rezolūcijas priekšlikums @lv
preferred label: Proposta de resolução comum @pt
preferred label: Wspólny projekt rezolucji @pl
created: 2023-10-31
definition: Text declaring European Parliament's opinion on a matter tabled on a topical issue, at the jointly request of committee(s)or political group(s) and voted in plenary.
preferred label: Yhteinen päätöslauselmaesitys @fi
preferred label: Bendras pasiūlymas dėl rezoliucijos @lt
preferred label: Propuesta de resolución común @es
preferred label: Fælles beslutningsforslag @da
type: Concept
preferred label: Gemensamt förslag till resolution @sv
preferred label: Общо предложение за резолюция @bg
preferred label: Gezamenlijke ontwerpresolutie @nl
preferred label: Společný návrh usnesení @cs
broader: Resolution
preferred label: Mozzjoni għal riżoluzzjoni konġunta @mt
in scheme: EP taxonomy on document types.
preferred label: Comhthairiscint i gcomhair rúin @ga
preferred label: Proposta di risoluzione comune @it
preferred label: Propunere comună de rezoluție @ro
preferred label: Spoločný návrh uznesenia @sk
preferred label: Skupni predlog resolucije @sl
preferred label: Zajednički prijedlog rezolucije @hr
preferred label: Gemeinsamer Entschließungsantrag @de
preferred label: Közös állásfoglalásra irányuló indítvány @hu
deprecated: false
preferred label: Resolutsiooni ühisettepanek @et
preferred label: Proposition de résolution commune @fr

Mandate to open interinstitutional negotiations
type: WorkType
preferred label: Mandát na začatie medziinštitucionálnych rokovaní @sk
preferred label: Εντολή για την έναρξη διοργανικών διαπραγματεύσεων @el
preferred label: Toimielinten välisten neuvottelujen aloittamista koskeva valtuutus @fi
in scheme: EP taxonomy on document types.
preferred label: Pilnvaras sākt iestāžu sarunas @lv
preferred label: Mandát k zahájení interinstitucionálních jednání @cs
broader: Resolution
preferred label: Megbízás intézményközi tárgyalások megkezdésére @hu
preferred label: Įgaliojimai pradėti tarpinstitucines derybas @lt
preferred label: Upoważnienie do rozpoczęcia negocjacji międzyinstytucjonalnych @pl
preferred label: Mandat za otvaranje međuinstitucijskih pregovora @hr
preferred label: Mandat att inleda interinstitutionella förhandlingar @sv
definition: Propoosal for a decision on the opening of, and on the mandate for, interninstitutional negotiations.
preferred label: Mandato de abertura de negociações interinstitucionais @pt
preferred label: Mandaat voor het openen van interinstitutionele onderhandelingen @nl
deprecated: true
preferred label: Volitus institutsioonidevaheliste läbirääkimiste alustamiseks @et
preferred label: Mandat til at indlede interinstitutionelle forhandlinger @da
created: 2025-10-31
preferred label: Mandatul de deschidere a negocierilor interinstituționale @ro
preferred label: Mandat zur Aufnahme interinstitutioneller Verhandlungen @de
preferred label: Мандат за започване на междуинституционални преговори @bg
type: Concept
preferred label: Mandat għall-ftuħ ta' negozjati interistituzzjonali @mt
preferred label: Mandato di avviare negoziati interistituzionali @it
preferred label: Sainordú chun tús a chur le caibidlíochtaí idirinstitiúideacha @ga
preferred label: Mandat za začetek medinstitucionalnih pogajanj @sl
preferred label: Mandato de apertura de negociaciones interinstitucionales @es
preferred label: Mandat d'ouverture des négociations interinstitutionnelles @fr

Written answer to an EP question for written answer
type: Concept
preferred label: Schriftelijk antwoord op een EP-vraag met verzoek om schriftelijk antwoord @nl
definition: Written answer to a question in a written form.
preferred label: Freagra i scríbhinn ar cheist PE i gcomhair freagra i scríbhinn @ga
preferred label: Skriftligt svar på en EP fråga med begäran om skriftligt svar @sv
preferred label: Risposta scritta ad una interrogazione del PE con richiesta di risposta scritta @it
preferred label: Γραπτή απάντηση σε ερώτηση του ΕΚ για γραπτή απάντηση @el
deprecated: false
preferred label: Respuesta escrita a una pregunta con solicitud de respuesta escrita del PE @es
preferred label: Odpowiedź na piśmie na pytanie PE wymagające odpowiedzi na piśmie @pl
preferred label: Schriftliche Antwort auf eine EP-Anfrage des EP zur schriftlichen Beantwortung @de
preferred label: Skriftligt svar på en EP-forespørgsel til skriftlig besvarelse @da
preferred label: Rakstiska atbilde uz EP jautājumu, uz kuru jāatbild rakstiski @lv
preferred label: Писмен отговор на въпрос на ЕП с искане за писмен отговор @bg
preferred label: Resposta escrita a uma pergunta com pedido de resposta escrita do PE @pt
preferred label: Răspuns scris la o întrebare cu solicitare de răspuns scris a PE @ro
preferred label: Kirjalik vastus EP kirjalikult vastatavale küsimusele @et
preferred label: Kirjallinen vastaus EP:n kirjallisesti vastattavaan kysymykseen @fi
preferred label: Pisani odgovor na pitanje za pisani odgovor EP-a @hr
preferred label: Pisni odgovor na vprašanje za pisni odgovor EP @sl
created: 2023-10-31
broader: EP question and interpellation
preferred label: Písomná odpoveď na otázku EP na písomné zodpovedanie @sk
preferred label: Tweġiba bil-miktub għal mistoqsija tal-PE għal tweġiba bil-miktub @mt
type: WorkType
preferred label: Réponse écrite à une question écrite du PE @fr
in scheme: EP taxonomy on document types.
preferred label: EP írásbeli választ igénylő elsőbbségi kérdésre adott írásbeli válasz @hu
preferred label: Písemná odpověď na parlamentní otázku k písemnému zodpovězení @cs
preferred label: Atsakymas raštu į EP klausimą, į kurį atsakoma raštu @lt

EP question and interpellation
type: Concept
in scheme: EP taxonomy on document types.
alternative label: Question and interpellation
preferred label: PE question et interpellation @fr
preferred label: EP:n kysymys ja tiedustelu @fi
preferred label: Întrebarea și interpelarea PE @ro
preferred label: Vprašanje in interpelacija EP @sl
preferred label: EP küsimus ja arupärimine @et
preferred label: Parlamentní otázka a interpelace @cs
preferred label: Ceist agus trascheist PE @ga
preferred label: EP-forespørgsler @da
preferred label: Ερώτηση και επερώτηση του ΕΚ @el
preferred label: EP vragen en interpellaties @nl
preferred label: Pytania i interpelacje PE @pl
preferred label: Pergunta e interpelação do PE @pt
preferred label: EP kérdés és interpelláció @hu
preferred label: EP klausimas ir paklausimas @lt
top concept of: EP taxonomy on document types.
preferred label: Mistoqsijiet u interpellanzi tal-PE @mt
created: 2023-10-31
preferred label: Въпрос и запитване на ЕП @bg
preferred label: Otázka a interpelácia EP @sk
deprecated: false
preferred label: Anfrage des EP @de
preferred label: EP fråga och interpellation @sv
preferred label: EP jautājums un interpelācija @lv
preferred label: Interrogazioni e interpellanze del PE @it
preferred label: Pitanje i pitanje za pisani odgovor EP-a @hr
definition: European Parliament question and interpellation.
preferred label: Pregunta e interpelación del PE @es

Letter of agreement
type: Concept
created: 2023-10-31
preferred label: Ittra ta’ ftehim @mt
preferred label: Vienošanās dokuments @lv
preferred label: Izjava o soglasju @sl
preferred label: Lettre d'accord @fr
in scheme: EP taxonomy on document types.
preferred label: Atskirasis leidimas @lt
preferred label: Akkoordverklaring @nl
preferred label: Zezwolenie @pl
preferred label: Scrisoare de aprobare @ro
preferred label: Godkendelsesbrev @da
preferred label: Schvalovací dopis @cs
preferred label: Einverständniserklärung @de
deprecated: false
preferred label: Autorizzazione a procedere @it
preferred label: Carta de acordo @pt
preferred label: Eseti engedély @hu
broader: Letter
preferred label: Έγγραφο συμφωνίας @el
preferred label: Písomný súhlas @sk
preferred label: Pismo o suglasnosti @hr
preferred label: Godkännandebrev @sv
preferred label: Документ за съгласие @bg
definition: Letter between the Council of the European Union and the European Parliament to officialise exchange of a provisional agreement in view of its further examination by the plenary.
preferred label: Litir an chomhaontaithe @ga
preferred label: Heakskiidukiri @et
preferred label: Hyväksymiskirje @fi
preferred label: Carta de acuerdo @es

Letter
type: Concept
definition: Written message sent to adressee(s).
preferred label: Brev @da
preferred label: Писмо @bg
preferred label: Scrisoare @ro
preferred label: Litir @ga
preferred label: Vēstule @lv
preferred label: Lettre @fr
preferred label: Brief @nl
preferred label: Kiri @et
top concept of: EP taxonomy on document types.
preferred label: Carta @pt
preferred label: Pismo @hr
preferred label: Laiškas @lt
preferred label: Dopis @cs
preferred label: Επιστολή @el
deprecated: false
in scheme: EP taxonomy on document types.
preferred label: Skrivelse @sv
preferred label: Kirje @fi
preferred label: Levél @hu
preferred label: Lettera @it
created: 2023-10-31
preferred label: List @pl
preferred label: Ittra @mt

Bureau decision to Members
type: Concept
preferred label: Juhatuse otsus parlamendiliikmetele @et
definition: Decision from the European Parliament Bureau to the Members.
preferred label: Deċiżjoni tal-Bureau lill-Membri @mt
preferred label: Prezidija lēmums deputātiem @lv
in scheme: EP taxonomy on document types.
preferred label: Præsidiets afgørelse til medlemmerne @da
preferred label: Rozhodnutí předsednictva určené poslancům @cs
created: 2025-10-31
preferred label: Decyzja Prezydium skierowana do posłów @pl
preferred label: Puhemiehistön päätös jäsenille @fi
preferred label: Rozhodnutie predsedníctva pre poslancov @sk
preferred label: Besluit van het Bureau aan de leden @nl
preferred label: Elnökségi határozat a képviselők számára @hu
preferred label: Biuro sprendimas nariams @lt
preferred label: Απόφαση του Προεδρείου προς τους βουλευτές @el
preferred label: Odluka Predsjedništva zastupnicima @hr
broader: Decision
preferred label: Decisão da Mesa aos deputados @pt
preferred label: Decisione dell'Ufficio di presidenza ai deputati @it
preferred label: Решение на Бюрото до членовете на ЕП @bg
preferred label: Cinneadh ón mBiúró chuig na Feisirí @ga
deprecated: false
preferred label: Sklep predsedstva za poslance @sl
preferred label: Decisión de la Mesa a los diputados @es
broader: Bureau document
type: WorkType
preferred label: Décision du Bureau aux députés @fr
preferred label: Decizia Biroului pentru deputați @ro
preferred label: Presidiets beslut till ledamöterna @sv
preferred label: Beschluss des Präsidiums an die Mitglieder @de

Decision
type: Concept
deprecated: false
preferred label: Besluit @nl
preferred label: Otsus @et
preferred label: Päätös @fi
preferred label: Decyzja @pl
preferred label: Afgørelse @da
preferred label: Beslut @sv
definition: Text binding on those to whom it is addressed and is directly applicable.
preferred label: Sklep @sl
preferred label: Lēmums @lv
preferred label: Rozhodnutí @cs
preferred label: Cinneadh @ga
preferred label: Decisión @es
top concept of: EP taxonomy on document types.
preferred label: Decisão @pt
preferred label: Απόφαση @el
preferred label: Decisione @it
preferred label: Décision @fr
created: 2023-10-31
preferred label: Решение @bg
preferred label: Beschluss @de
preferred label: Határozat @hu
preferred label: Odluka @hr
preferred label: Decizie @ro
preferred label: Rozhodnutie @sk
preferred label: Deċiżjoni @mt
preferred label: Sprendimas @lt
in scheme: EP taxonomy on document types.

National chamber contribution document
type: Concept
preferred label: Έγγραφο συμβολής του εθνικού επιμελητηρίου @el
preferred label: Doiciméad ranníocaíochta ón dlísheomra náisiúnta @ga
preferred label: Documento de contribución de la cámara nacional @es
preferred label: Liikmesriigi koja panust käsitlev dokument @et
preferred label: Dokument ta’ kontribuzzjoni tal-kamra nazzjonali @mt
definition: National chamber contribution document.
preferred label: Dokument o prispevku nacionalne zbornice @sl
preferred label: Dokument o příspěvku národní komory @cs
broader: Document
preferred label: Beitragsdokument der nationalen Kammer @de
preferred label: Document de contribuție a camerei naționale @pt
preferred label: Dokument zawierający uwagi izby krajowej @pl
preferred label: Contribution d'une chambre nationale @fr
preferred label: Valsts palātas atbildes dokuments @lv
preferred label: Dokument för bidrag från den nationella kammaren @sv
preferred label: Bijdragedocument van de nationale kamer @nl
preferred label: Dokument o príspevku národnej komory @sk
preferred label: Dokument o doprinosu nacionalne komore @hr
preferred label: Документ за участие на националната камара @bg
preferred label: Dokument om bidrag fra den nationale afdeling @da
preferred label: A nemzeti kamarák hozzájárulásáról szóló dokumentum @hu
preferred label: Nacionalinių rūmų nuomonės dokumentas @lt
preferred label: Documento di contributo della camera nazionale @it
preferred label: Kansallisen kamarin panosta koskeva asiakirja @fi
deprecated: false
in scheme: EP taxonomy on document types.
created: 2025-01-31

EP minor interpellation
type: Concept
preferred label: EP lühem arupärimine @et
preferred label: EP beperkte interpellatie @nl
preferred label: Interpelacja PE dotycząca kwestii drugorzędnych @pl
preferred label: Manjša interpelacija EP @sl
preferred label: Ήσσονος σημασίας επερώτηση του ΕΚ @el
preferred label: Interpellanza minore del PE @it
definition: European Parliament minor interpellation.
type: WorkType
preferred label: Menšia interpelácia EP @sk
in scheme: EP taxonomy on document types.
preferred label: Mion-trascheist PE @ga
preferred label: Interpellanza minuri tal-PE @mt
deprecated: false
preferred label: EP:n toissijainen tiedustelu @fi
preferred label: PE petites interpellations @fr
preferred label: Interpelarea minoră a PE @ro
preferred label: EP mindre interpellation @sv
created: 2023-10-31
preferred label: Kraće pitanje za pisani odgovor EP-a @hr
preferred label: EP īsa interpelācija @lv
broader: EP question and interpellation
preferred label: Mindre EP-forespørgsler @da
preferred label: EP kisebb interpelláció @hu
preferred label: Parlamentní méně závažná interpelace @cs
preferred label: Interpelação breve do PE @pt
preferred label: EP neesminis paklausimas @lt
preferred label: Kleine Anfrage des EP @de
preferred label: Interpelación menor del PE @es
preferred label: Кратко запитване на ЕП @bg

Text adopted
type: WorkType
preferred label: Antagen text @sv
preferred label: Usvojeni tekst @hr
preferred label: Tekst przyjęty @pl
deprecated: false
preferred label: Texto aprovado @pt
preferred label: Εγκριθέν κείμενο @el
preferred label: Test adottat @mt
preferred label: Priimti tekstai @lt
preferred label: Texto aprobado @es
preferred label: Texte adopté @fr
preferred label: Hyväksytty teksti @fi
created: 2023-10-31
preferred label: Elfogadott szövegek @hu
broader: Resolution
broader: Decision
preferred label: Testo approvato @it
in scheme: EP taxonomy on document types.
preferred label: Pieņemtais teksts @lv
type: Concept
preferred label: Angenommener Text @de
preferred label: Aangenomen tekst @nl
definition: Text adopted by a vote in the plenary of the European Parliament.
preferred label: Textul a fost adoptat @ro
preferred label: Приети текстове @bg
preferred label: Téacs arna ghlacadh @ga
preferred label: Sprejeto besedilo @sl
broader: Recommendation
preferred label: Vedtagne tekster @da
preferred label: Vastuvõetud tekst @et
preferred label: Přijaté texty @cs
preferred label: Prijaté znenie @sk

Recommendation
type: Concept
preferred label: Recomendação @pt
preferred label: Priporočilo @sl
deprecated: false
preferred label: Odporúčanie @sk
preferred label: Doporučení @cs
preferred label: Rekommendation @sv
preferred label: Aanbeveling @nl
definition: Text allowing the institutions to make their views known and to suggest a line of action without imposing any legal obligation on those to whom it is addressed.
in scheme: EP taxonomy on document types.
preferred label: Empfehlung @de
preferred label: Recomendación @es
preferred label: Ieteikums @lv
preferred label: Ajánlás @hu
preferred label: Zalecenie @pl
top concept of: EP taxonomy on document types.
preferred label: Recommandation @fr
created: 2023-10-31
preferred label: Recomandare @ro
preferred label: Rakkomandazzjoni @mt
preferred label: Raccomandazione @it
preferred label: Soovitus @et
preferred label: Suositus @fi
preferred label: Препоръка @bg
preferred label: Preporuka @hr
preferred label: Henstilling @da
preferred label: Σύσταση @el
preferred label: Moladh @ga
preferred label: Rekomendacija @lt

Staff working document
type: Concept
deprecated: false
preferred label: Documento de trabalho dos serviços @pt
preferred label: Talituste töödokument @et
preferred label: Arbejdsdokument fra tjenestegrenene @da
preferred label: Dokument roboczy służb @pl
preferred label: Szolgálati munkadokumentum @hu
preferred label: Tarnybų darbo dokumentas @lt
preferred label: Arbetsdokument @sv
preferred label: Работен документ на службите @bg
preferred label: Document de lucru al serviciilor @ro
definition: Staff working document
preferred label: Έγγραφο εργασίας των υπηρεσιών @el
in scheme: EP taxonomy on document types.
preferred label: Documento de trabajo de los servicios @es
preferred label: Páipéar Oibre Fhoireann @ga
preferred label: Radni dokument službi @hr
preferred label: Arbeitsdokument der Dienststellen @de
preferred label: Yksiköiden valmisteluasiakirja @fi
preferred label: Werkdocument van de diensten @nl
preferred label: Dienestu darba dokuments @lv
preferred label: Documento di lavoro dei servizi @it
preferred label: Document de travail des services @fr
preferred label: Dokument ta’ ħidma tal-persunal @mt
preferred label: Pracovní dokument útvarů @cs
preferred label: Pracovný dokument útvarov @sk
broader: Document
created: 2023-10-31
preferred label: Delovni dokument služb @sl

EP plenary part-session agenda
type: WorkType
preferred label: PE ordre du jour de la plénière @fr
preferred label: Agenda della tornata del PE @it
preferred label: Ordinea de zi a perioadei de sesiune plenară a PE @ro
preferred label: Program plenárnej schôdze EP @sk
preferred label: EP plenārsesijas darba kārtība @lv
preferred label: Porządek dzienny plenarnej sesji miesięcznej PE @pl
in scheme: EP taxonomy on document types.
preferred label: Tagesordnung der Plenartagung des EP @de
definition: European Parliament plenary part-session agenda.
preferred label: EP plenarinės sesijos darbotvarkė @lt
preferred label: Dnevni red delnega plenarnega zasedanja EP @sl
created: 2023-10-31
preferred label: Ordem do dia do período de sessões plenárias do PE @pt
preferred label: Aġenda tas-sessjoni parzjali plenarja tal-PE @mt
preferred label: Agenda van de vergaderperiode van het EP @nl
preferred label: EP-plenarmødedagsorden @da
broader: Tagesordnung
preferred label: EP:n istuntojakson esityslista @fi
type: Concept
preferred label: EP osaistungjärgu päevakord @et
preferred label: Orden del día del período parcial de sesiones plenarias del PE @es
preferred label: Föredragningslista för EP plenarsammanträdesperiod @sv
preferred label: EP plenáris ülés napirendje @hu
preferred label: Pořad jednání dílčího zasedání EP @cs
deprecated: false
preferred label: Clár oibre do pháirtseisiún iomlánach PE @ga
preferred label: Ημερήσια διάταξη περιόδου συνόδου της Ολομέλειας του ΕΚ @el
preferred label: Dnevni red sjednice EP-a @hr
preferred label: Дневен ред на месечна пленарна сесия на ЕП @bg

Provisional agreement
type: Concept
preferred label: Provizoriska vienošanās @lv
in scheme: EP taxonomy on document types.
preferred label: Accord provisoire @fr
preferred label: Predbežná dohoda @sk
preferred label: Voorlopig akkoord @nl
preferred label: Alustava yhteisymmärrys @fi
preferred label: Accordo provvisorio @it
preferred label: Ideiglenes megállapodás @hu
preferred label: Vorläufige Einigung @de
preferred label: Προσωρινή συμφωνία @el
created: 2023-10-31
type: WorkType
preferred label: Foreløbig enighed @da
preferred label: Ftehim proviżorju @mt
preferred label: Privremeni dogovor @hr
preferred label: Wstępne porozumienie @pl
preferred label: Esialgne kokkulepe @et
preferred label: Comhaontú sealadach @ga
preferred label: Acordo provisório @pt
deprecated: false
preferred label: Preliminär överenskommelse @sv
top concept of: EP taxonomy on document types.
preferred label: Предварително споразумение @bg
preferred label: Předběžná dohoda @cs
preferred label: Preliminarus susitarimas @lt
preferred label: Acord provizoriu @ro
preferred label: Začasni dogovor @sl
definition: An informal agreement on an amended text of a legislative proposal reached in interinstitutional negotiations (trialogues) between the Parliament and the Council, which has to be approved by the formal procedures applicable within each institution.
preferred label: Acuerdo provisional @es

EP plenary part-session draft agenda
type: Concept
preferred label: Návrh pořadu jednání plenárního zasedání EP @cs
preferred label: Osnutek dnevnega reda plenarnega zasedanja EP @sl
preferred label: Проект на дневен ред на пленарната сесия на ЕП @bg
in scheme: EP taxonomy on document types.
deprecated: false
preferred label: Dréachtchlár oibre do pháirtseisiún iomlánach Pharlaimint na hEorpa @ga
preferred label: Proiectul de ordine de zi pentru perioada de sesiune plenară a PE @ro
preferred label: Σχέδιο ημερήσιας διάταξης της περιόδου συνόδου ολομέλειας του ΕΚ @el
preferred label: Prijedlog dnevnog reda plenarne sjednice EP-a @hr
preferred label: Förslag till föredragningslista för Europaparlamentets sammanträdesperiod @sv
preferred label: Euroopan parlamentin istuntojakson esityslistaluonnos @fi
created: 2023-10-31
preferred label: Projeto de ordem do dia do período de sessões do PE @pt
preferred label: Návrh programu plenárnej schôdze EP @sk
preferred label: Forslag til dagsorden for Parlamentets plenarmødeperiode @da
preferred label: Az EP plenáris ülésének napirendtervezete @hu
definition: European Parliament plenary part-session draft agenda.
preferred label: Projet d’ordre du jour de la session plénière du PE @fr
broader: Tagesordnung
preferred label: Proyecto de orden del día del período parcial de sesiones del PE @es
preferred label: EP plenārsesijas darba kārtības projekts @lv
preferred label: Progetto di ordine del giorno della tornata plenaria del PE @it
preferred label: Entwurf der Tagesordnung für die Plenartagung des EP @de
preferred label: Ontwerpagenda van de plenaire vergadering van het EP @nl
preferred label: Projekt porządku obrad sesji plenarnej PE @pl
preferred label: Euroopa Parlamendi täiskogu osaistungjärgu päevakorra projekt @et
preferred label: EP plenarinės sesijos darbotvarkės projektas @lt
preferred label: Abbozz ta’ aġenda tas-sessjoni plenarja tal-PE @mt

EP major interpellation
type: WorkType
in scheme: EP taxonomy on document types.
preferred label: EP išplėstinis paklausimas @lt
preferred label: Večja interpelacija EP @sl
preferred label: EP:n ensisijainen tiedustelu @fi
preferred label: Trascheist mhór PE @ga
preferred label: Parlamentní závažná interpelace @cs
definition: European Parliament major interpellation.
preferred label: EP plaša interpelācija @lv
preferred label: EP põhjalikum arupärimine @et
preferred label: EP större interpellation @sv
preferred label: Interpelação extensa do PE @pt
preferred label: Interpelarea majoră a PE @ro
preferred label: Større EP-forespørgsler @da
created: 2023-10-31
preferred label: EP nagyobb interpelláció @hu
type: Concept
preferred label: Väčšia interpelácia EP @sk
preferred label: Interpelación mayor del PE @es
preferred label: Große Anfrage des EP @de
preferred label: EP uitgebreide interpellatie @nl
preferred label: Запитване на ЕП @bg
preferred label: Interpellanza principale del PE @it
preferred label: Interpellanza maġġuri tal-PE @mt
preferred label: PE grandes interpellations @fr
preferred label: Dulje pitanje za pisani odgovor EP-a @hr
broader: EP question and interpellation
preferred label: Interpelacja PE dotycząca kwestii pierwszorzędnych @pl
deprecated: false
preferred label: Μείζονος σημασίας επερώτηση του ΕΚ @el

Joint report
type: Concept
preferred label: Gezamenlijk verslag @nl
preferred label: Yhteinen raportti @fi
preferred label: Rapport conjoint @fr
preferred label: Relatório conjunto @pt
preferred label: Közös jelentés @hu
preferred label: Spoločná správa @sk
preferred label: Fælles rapport @da
preferred label: Ühisaruanne @et
broader: Report
preferred label: Wspólne sprawozdanie @pl
preferred label: Bendras pranešimas @lt
preferred label: Skupno poročilo @sl
preferred label: Rapport konġunt @mt
preferred label: Informe conjunto @es
preferred label: Tuarascáil chomhpháirteach @ga
in scheme: EP taxonomy on document types.
preferred label: Съвместен доклад @bg
preferred label: Κοινή έκθεση @el
preferred label: Kopīgs ziņojums @lv
definition: Text drawn up by two or three parliamentary committees on a subject in a view of a debate and a vote.
preferred label: Relazione congiunta @it
preferred label: Gemensam rapport @sv
preferred label: Raport comun @ro
preferred label: Společná zpráva @cs
created: 2023-10-31
deprecated: false
preferred label: Gemeinsamer Bericht @de
preferred label: Zajedničko izvješće @hr

Declaration on awareness of conflicts of interest
type: Concept
preferred label: Dearbhú maidir le feasacht ar choinbhleacht leasa @ga
alternative label: Oświadczenie posłów do Parlamentu Europejskiego w sprawie świadomości konfliktu interesów @pl
alternative label: Verklaring van de leden van het Europees Parlement over het bewustzijn van belangenconflicten @nl
alternative label: Δήλωση των βουλευτών του Ευρωπαϊκού Κοινοβουλίου σχετικά με την ευαισθητοποίηση σχετικά με τις συγκρούσεις συμφερόντων @el
alternative label: Euroopa Parlamendi liikmete deklaratsioon teadlikkuse kohta huvide konfliktidest @et
alternative label: Декларация на членовете на Европейския парламент относно осведомеността относно конфликтите на интереси @bg
in scheme: EP taxonomy on document types.
preferred label: Erklärung zur Kenntnis von Interessenkonflikten @de
preferred label: Declaración sobre conocimiento de conflictos de intereses @es
preferred label: Δήλωση επίγνωσης σχετικά με σύγκρουση συμφερόντων @el
preferred label: Prohlášení, zda je poslanci znám střet zájmů @cs
alternative label: Erklæring fra medlemmer af Europa-Parlamentet om bevidsthed om interessekonflikter @da
alternative label: Déclaration des députés au Parlement européen sur la sensibilisation aux conflits d'intérêts @fr
alternative label: Euroopan parlamentin jäsenten lausuma eturistiriitoja koskevasta tiedosta @fi
preferred label: Декларация за осведоменост за конфликт на интереси @bg
alternative label: Declarația deputaților în Parlamentul European privind conștientizarea conflictelor de interese @ro
preferred label: Dichiarazione di conoscenza di conflitti di interessi @it
alternative label: Declaração dos deputados ao Parlamento Europeu sobre a sensibilização para os conflitos de interesses @pt
alternative label: Förklaring från Europaparlamentets ledamöter om medvetenhet om intressekonflikter @sv
type: WorkType
alternative label: Vyhlásenie poslancov Európskeho parlamentu o povedomí o konflikte záujmov @sk
broader: Members' declaration
preferred label: Vyhlásenie o informovanosti o konfliktoch záujmov @sk
definition: Document completed by Members to declare their conflicts of interests in compliance with their code of conduct.
preferred label: Declaração sobre o conhecimento de conflitos de interesses @pt
preferred label: Oświadczenie o świadomości konfliktów interesów @pl
preferred label: Verklaring over kennis van belangenconflicten @nl
alternative label: Europos Parlamento narių deklaracija dėl informuotumo apie interesų konfliktus @lt
preferred label: Declarație privind conștientizarea conflictelor de interese @ro
alternative label: Erklärung der Mitglieder des Europäischen Parlaments zur Sensibilisierung für Interessenkonflikte @de
preferred label: Izjava o svijesti o sukobu interesa @hr
alternative label: Declaration by Members of the European Parliament on awareness of conflicts of interest
preferred label: Dikjarazzjoni ta' għarfien ta’ kunflitti ta’ interessi @mt
alternative label: Az európai parlamenti képviselők nyilatkozata az összeférhetetlenségről való tudomásszerzésről @hu
deprecated: false
preferred label: Deklaratsioon teadlikkuse kohta huvide konfliktidest @et
alternative label: Dearbhú ó Fheisirí de Pharlaimint na hEorpa maidir le feasacht ar choinbhleachtaí leasa @ga
preferred label: Nyilatkozat összeférhetetlenségről való tudomáról @hu
created: 2025-02-28
preferred label: Ilmoitus tiedossa olevista eturistiriidoista @fi
preferred label: Förklaring om medvetenhet om intressekonflikter @sv
alternative label: Prohlášení poslanců Evropského parlamentu o povědomí o střetu zájmů @cs
alternative label: Izjava poslancev Evropskega parlamenta o ozaveščenosti o navzkrižju interesov @sl
preferred label: Erklæring om kendskab til interessekonflikter @da
preferred label: Déclaration de connaissance de conflits d’intérêts @fr
alternative label: Eiropas Parlamenta deputātu deklarācija par informētību par interešu konfliktiem @lv
preferred label: Deklarācija par interešu konflikta apzināšanos @lv
alternative label: Izjava zastupnika u Europskom parlamentu o svijesti o sukobu interesa @hr
alternative label: Dichiarazione dei deputati al Parlamento europeo sulla consapevolezza dei conflitti di interesse @it
alternative label: Declaración de los diputados al Parlamento Europeo sobre el conocimiento de los conflictos de intereses @es
preferred label: Izjava o ozaveščenosti glede nasprotja interesov @sl
alternative label: Dikjarazzjoni mill-Membri tal-Parlament Ewropew dwar l-għarfien tal-kunflitti ta' interess @mt
preferred label: Deklaracija dėl žinojimo apie interesų konfliktus @lt

Members' declaration
type: Concept
preferred label: Jäsenten ilmoitus @fi
preferred label: Ledamöternas förklaring @sv
preferred label: Δήλωση των μελών @el
preferred label: Medlemmernes erklæring @da
top concept of: EP taxonomy on document types.
preferred label: Dearbhú ó na Feisirí @ga
deprecated: false
definition: Document completed by Members to declare elements in compliance with the code of conduct.
preferred label: Declaración de los miembros @es
in scheme: EP taxonomy on document types.
created: 2025-02-28
preferred label: Narių deklaracija @lt
preferred label: Vyhlásenie členov @sk
preferred label: Oświadczenie członków @pl
preferred label: Parlamendiliikmete deklaratsioon @et
preferred label: Izjava poslancev @sl
preferred label: Declarația deputaților @ro
preferred label: Dikjarazzjoni tal-Membri @mt
preferred label: Izjava zastupnika @hr
preferred label: A tagok nyilatkozata @hu
preferred label: Verklaring van de leden @nl
preferred label: Déclaration des membres @fr
preferred label: Prohlášení členů @cs
preferred label: Dichiarazione dei membri @it
preferred label: Locekļu deklarācija @lv
preferred label: Декларация на членовете @bg
preferred label: Erklärung der Mitglieder @de
preferred label: Declaração dos membros @pt

Parliamentary committee opinion on respect for fundamental rights
type: Concept
definition: Statement about the procedure's respect for fundamental rights given by the LIBE committee for opinion to the responsible committee.
in scheme: EP taxonomy on document types.
created: 2025-08-31
preferred label: Mnenje parlamentarnega odbora o spoštovanju temeljnih pravic @sl
preferred label: Parlamento komiteto nuomonė dėl pagarbos pagrindinėms teisėms @lt
preferred label: Avis de la commission parlementaire sur le respect des droits fondamentaux @fr
preferred label: Parlamentsutskottets yttrande om respekten för de grundläggande rättigheterna @sv
preferred label: Advies van de parlementaire commissie over de eerbiediging van de grondrechten @nl
preferred label: A parlamenti bizottság véleménye az alapvető jogok tiszteletben tartásáról @hu
preferred label: Становище на парламентарната комисия относно зачитането на основните права @bg
preferred label: Γνωμοδότηση της κοινοβουλευτικής επιτροπής σχετικά με τον σεβασμό των θεμελιωδών δικαιωμάτων @el
deprecated: false
preferred label: Stanovisko parlamentního výboru k dodržování základních práv @cs
preferred label: Parecer da comissão parlamentar sobre o respeito dos direitos fundamentais @pt
preferred label: Avizul comisiei parlamentare privind respectarea drepturilor fundamentale @ro
preferred label: Parlamenta komitejas atzinums par pamattiesību ievērošanu @lv
preferred label: Parere della commissione parlamentare sul rispetto dei diritti fondamentali @it
preferred label: Stellungnahme des Parlamentsausschusses zur Achtung der Grundrechte @de
preferred label: Parlamentin valiokunnan lausunto perusoikeuksien kunnioittamisesta @fi
type: WorkType
broader: Opinion
preferred label: Parlamentsudvalgets udtalelse om respekt for de grundlæggende rettigheder @da
preferred label: Parlamendikomisjoni arvamus põhiõiguste austamise kohta @et
preferred label: Tuairim ón gcoiste parlaiminteach maidir le hurraim do chearta bunúsacha @ga
preferred label: Stanovisko parlamentného výboru k dodržiavaniu základných práv @sk
preferred label: Opinjoni tal-kumitat parlamentari dwar ir-rispett għad-drittijiet fundamentali @mt
preferred label: Mišljenje parlamentarnog odbora o poštovanju temeljnih prava @hr
preferred label: Opinión de la comisión parlamentaria sobre el respeto de los derechos fundamentales @es
preferred label: Opinia komisji parlamentarnej w sprawie poszanowania praw podstawowych @pl

Opinion
type: Concept
definition: Instrument allowing the institutions to make a statement in a non-binding fashion, in other words without imposing any legal obligation.
top concept of: EP taxonomy on document types.
alternative label: Mnenja @sl
alternative label: Nuomonės @lt
preferred label: Становище @bg
alternative label: Adviezen @nl
alternative label: Γνωμοδοτήσεις @el
alternative label: Stanoviska @cs
deprecated: false
created: 2023-10-31
preferred label: Stellungnahme @de
preferred label: Aviz @ro
alternative label: Lausunnot @fi
preferred label: Parere @it
alternative label: Становища @bg
preferred label: Opinia @pl
alternative label: Arvamused @et
alternative label: Opinjonijiet @mt
alternative label: Pareri @it
alternative label: Atzinumi @lv
preferred label: Yttrande @sv
preferred label: Γνωμοδότηση @el
alternative label: Opinions
preferred label: Avis @fr
alternative label: Stellungnahmen @de
alternative label: Tuairimí @ga
preferred label: Atzinums @lv
preferred label: Mišljenje @hr
alternative label: Stanoviská @sk
preferred label: Opinjoni @mt
preferred label: Advies @nl
alternative label: Udtalelser @da
alternative label: Avize @ro
preferred label: Stanovisko @sk
preferred label: Tuairim @ga
alternative label: Opinie @pl
preferred label: Dictamen @es
preferred label: Mnenje @sl
preferred label: Lausunto @fi
alternative label: Pareceres @pt
preferred label: Parecer @pt
alternative label: Vélemények @hu
preferred label: Vélemény @hu
alternative label: Dictámenes @es
alternative label: Mišljenja @hr
preferred label: Udtalelse @da
preferred label: Arvamus @et
in scheme: EP taxonomy on document types.
preferred label: Nuomonė @lt

EP calendar of part-sessions
type: Concept
preferred label: Az EP ülésnaptára @hu
preferred label: График на месечните сесии на ЕП @bg
broader: Tagesordnung
preferred label: Europaparlamentets sammanträdeskalender @sv
preferred label: EP's mødekalender @da
preferred label: Tagungskalender des EP @de
preferred label: Calendario de los períodos parciales de sesiones del PE @es
preferred label: Calendario delle tornate del PE @it
preferred label: Calendário dos períodos de sessões do PE @pt
deprecated: false
definition: European Parliament calendar of part-sessions.
preferred label: Kalendarju tas-sessjonijiet parzjali tal-PE @mt
preferred label: EP sesiju kalendārs @lv
in scheme: EP taxonomy on document types.
preferred label: Calendarul perioadelor de sesiune ale PE @ro
preferred label: Vergaderrooster van het EP @nl
created: 2023-10-31
preferred label: EP mėnesinių sesijų kalendorius @lt
preferred label: Χρονοδιάγραμμα των περιόδων συνόδου του ΕΚ @el
preferred label: Časovni razpored delnih zasedanj Evropskega parlamenta @sl
preferred label: Kalendarz sesji miesięcznych PE @pl
preferred label: Féilire PE na bpáirtseisiún @ga
preferred label: Kalendar sjednica EP-a @hr
preferred label: Ep:n istuntokalenteri @fi
preferred label: Harmonogram dílčích zasedání EP @cs
preferred label: Euroopa Parlamendi osaistungjärkude kalender @et
preferred label: Kalendár schôdzí EP @sk
preferred label: Calendrier des périodes de session du PE @fr

Parliamentary committee opinion
type: Concept
preferred label: Parecer de uma comissão parlamentar @pt
preferred label: Tuairim ó Choiste Parlaiminteach @ga
preferred label: Parlamendikomisjoni arvamus @et
preferred label: Udtalelse fra et parlamentarisk udvalg @da
preferred label: Advies van een parlementaire commissie @nl
preferred label: Parere di una commissione parlamentare @it
preferred label: Stellungnahme eines parlamentarischen Ausschusses @de
preferred label: Stanovisko parlamentného výboru @sk
broader: Opinion
preferred label: Parlamento komiteto nuomonė @lt
preferred label: Opinia komisji parlamentarnej @pl
preferred label: Mišljenje parlamentarnog odbora @hr
preferred label: Mnenje parlamentarnega odbora @sl
preferred label: Yttrande från ett parlamentsutskott @sv
preferred label: Становище на парламентарна комисия @bg
created: 2023-10-31
preferred label: Opinjoni ta’ Kumitat Parlamentari @mt
preferred label: Valiokunnan lausunto @fi
preferred label: Opinion de commission parlementaire @fr
preferred label: Parlamenti bizottság véleménye @hu
preferred label: Γνωμοδότηση κοινοβουλευτικής επιτροπής @el
preferred label: Opinión de comisión parlamentaria @es
definition: Statement usually containing amendments to the proposal given by a parliamentary committee for opinion to the responsible committee.
in scheme: EP taxonomy on document types.
deprecated: false
preferred label: Stanovisko parlamentního výboru @cs
preferred label: Parlamenta komitejas atzinums @lv
type: WorkType
preferred label: Aviz al comisiei parlamentare @ro

EP plenary sitting roll-call votes
type: WorkType
preferred label: EP plenārsēdes balsošana pēc saraksta @lv
preferred label: Votazioni per appello nominale della seduta plenaria del PE @it
preferred label: Hlasovanie podľa mien na plenárnom rokovaní EP @sk
preferred label: Поименно гласуване на пленарно заседание на ЕП @bg
created: 2023-10-31
preferred label: Hoofdelijke stemming ter plenaire vergadering van het EP @nl
preferred label: Poimensko glasovanje na plenarni seji EP @sl
definition: Results of roll-call votes in the written record of a plenary sitting of the European Parliament.
broader: Minutes
preferred label: PE Résultat des votes par appel nominal de la plénière @fr
preferred label: EP-plenarmødeafstemning ved navneopråb @da
preferred label: Poimenična glasovanja dnevne plenarne sjednice EP-a @hr
preferred label: EP täiskogu istungi nimeline hääletus @et
preferred label: EP plenáris ülésnap: név szerinti szavazás @hu
preferred label: Vótálacha le glaoch rolla de shuí iomlánach PE @ga
deprecated: false
preferred label: Votação nominal em sessão diária plenária do PE @pt
preferred label: Votazzjoni b‘sejħa tal-ismijiet tas-seduta plenarja tal-PE @mt
preferred label: Votaciones nominales de la sesión plenaria del PE @es
preferred label: Głosowanie imienne na posiedzeniu plenarnym PE @pl
preferred label: Ψηφοφορίες δι' ονομαστικής κλήσεως της συνεδρίασης της Ολομέλειας του ΕΚ @el
preferred label: EP plenarinio posėdžio vardiniai balsavimai @lt
preferred label: Namentliche Abstimmungen der Plenarsitzung des EP @de
type: Concept
preferred label: Omröstning med namnupprop i EP plenarsammanträden @sv
preferred label: Výsledky jmenovitého hlasování z plenárního zasedání EP @cs
preferred label: EP:n täysistunnon nimenhuutoäänestys @fi
in scheme: EP taxonomy on document types.
preferred label: Voturile prin apel nominal din cadrul ședinței plenare a PE @ro

Strategic non-legislative report
type: Concept
top concept of: enrich
preferred label: Strateginen muu kuin lainsäädäntömietintö @fi
definition: Text drawn up on the own initiative of the European Parliament on a non-legislative subject in a view of a debate and a vote with strategic impact.
preferred label: Strategisch niet-wetgevingsverslag @nl
preferred label: Στρατηγική μη νομοθετική έκθεση @el
preferred label: Strateško nezakonodavno izvješće @hr
preferred label: Raport strategic fără caracter legislativ @ro
preferred label: Strategiskt betänkande som inte avser lagstiftning @sv
preferred label: Strategischer nichtlegislativer Bericht @de
preferred label: Relazione strategica non legislativa @it
preferred label: Strategisk ikke-lovgivningsmæssig betænkning @da
preferred label: Stratégiai nem jogalkotási jelentés @hu
preferred label: Stratēģisks nenormatīvs ziņojums @lv
preferred label: Rapport stratégique non législatif @fr
preferred label: Strategická nelegislatívna správa @sk
preferred label: Strateško nezakonodajno poročilo @sl
preferred label: Стратегически незаконодателен доклад @bg
deprecated: false
preferred label: Informe estratégico no legislativo @es
preferred label: Strateegiline muu kui seadusandlik raport @et
created: 2025-04-30
preferred label: Strategiczne sprawozdanie nieustawodawcze @pl
preferred label: Rapport strateġiku mhux leġiżlattiv @mt
preferred label: Strategická nelegislativní zpráva @cs
preferred label: Strateginis ne teisėkūros pranešimas @lt
broader: Own initiative report
in scheme: EP taxonomy on document types.
in scheme: enrich
preferred label: Relatório estratégico não legislativo @pt
preferred label: Tuarascáil neamhreachtach straitéiseach @ga

Own initiative report
type: Concept
preferred label: Sprawozdanie z własnej inicjatywy @pl
in scheme: enrich
preferred label: Saját kezdeményezésű jelentés @hu
preferred label: Relatório de iniciativa @pt
preferred label: Raport din proprie inițiativă @ro
preferred label: Zpráva z vlastního podnětu @cs
deprecated: false
preferred label: Initiativbetænkning @da
preferred label: Initiativbericht @de
in scheme: EP taxonomy on document types.
definition: Text drawn up on the own initiative of the European Parliament on a subject in a view of a debate and a vote.
preferred label: Initiatiefverslag @nl
top concept of: enrich
preferred label: Omaalgatuslik raport @et
preferred label: Samoiniciativno poročilo @sl
preferred label: Izvješće o vlastitoj inicijativi @hr
preferred label: Relazione d'iniziativa @it
preferred label: Доклад по собствена инициатива @bg
preferred label: Betänkande på eget initiativ @sv
preferred label: Rapport d'initiative @fr
preferred label: Valiokunta-aloitteinen mietintö @fi
preferred label: Pranešimas savo iniciatyva @lt
preferred label: Rapport fuq inizjattiva proprja @mt
created: 2025-04-30
preferred label: Έκθεση πρωτοβουλίας @el
preferred label: Tuarascáil féintionscnaimh @ga
preferred label: Patstāvīgais ziņojums @lv
broader: Report
preferred label: Informe de propia iniciativa @es
preferred label: Iniciatívna správa @sk

Draft parliamentary committee opinion
type: WorkType
preferred label: Parlamenti bizottság véleménytervezete @hu
definition: Draft statement usually containing amendments to the proposal given by a parliamentary committee for opinion to the responsible committee.
preferred label: Förslag till yttrande från ett parlamentsutskott @sv
broader: Opinion
preferred label: Parlamento komiteto nuomonės projektas @lt
preferred label: Návrh stanoviska parlamentního výboru @cs
preferred label: Abbozz ta’ opinjoni ta’ Kumitat Parlamentari @mt
preferred label: Návrh stanoviska parlamentného výboru @sk
in scheme: EP taxonomy on document types.
preferred label: Parlamendikomisjoni arvamuse projekt @et
preferred label: Proiect de aviz al comisiei parlamentare @ro
preferred label: Dréacht-tuairim ó Choiste Parlaiminteach @ga
preferred label: Osnutek mnenja parlamentarnega odbora @sl
preferred label: Parlamenta komitejas atzinuma projekts @lv
preferred label: Σχέδιο γνωμοδότησης κοινοβουλευτικής επιτροπής @el
type: Concept
preferred label: Proyecto de informe de comisión parlamentaria @es
preferred label: Nacrt mišljenja parlamentarnog odbora @hr
preferred label: Projekt opinii komisji parlamentarnej @pl
preferred label: Progetto di parere di una commissione parlamentare @it
deprecated: false
preferred label: Ontwerpadvies van een parlementaire commissie @nl
preferred label: Projeto de parecer de uma comissão parlamentar @pt
preferred label: Valiokunnan lausuntoluonnos @fi
preferred label: Projet d‘opinion de commission parlementaire @fr
created: 2023-10-31
preferred label: Udkast til udtalelse fra et parlamentarisk udvalg @da
preferred label: Проект на становище на парламентарна комисия @bg
preferred label: Entwurf einer Stellungnahme eines parlamentarischen Ausschusses @de

EP plenary sitting minutes
type: Concept
preferred label: Protokół posiedzenia plenarnego PE @pl
created: 2023-10-31
preferred label: Processo verbale della seduta plenaria del PE @it
preferred label: EP plenarinio posėdžio protokolas @lt
preferred label: PE procès-verbal de la plénière @fr
preferred label: Zápis z plenárního zasedání EP @cs
preferred label: Miontuairiscí shuí iomlánach PE @ga
preferred label: Zapisnik sa dnevne plenarne sjednice EP-a @hr
preferred label: Protokoll från EP plenarsammanträden @sv
definition: European Parliament plenary sitting minutes
preferred label: Ata da sessão diária plenária do PE @pt
preferred label: Actas de la sesión plenaria del PE @es
preferred label: Protokoll der Plenarsitzung des EP @de
preferred label: EP:n täysistunnon kokouspöytäkirja @fi
preferred label: Протокол от пленарно заседание на ЕП @bg
preferred label: Notulen van de plenaire vergadering van het EP @nl
preferred label: EP plenáris ülésnap jegyzőkönyve @hu
preferred label: EP-mødeprotokol @da
preferred label: Procesele-verbale ale ședinței plenare a PE @ro
in scheme: EP taxonomy on document types.
preferred label: Zápisnica z plenárneho rokovania EP @sk
deprecated: false
broader: Minutes
preferred label: EP plenārsēdes protokols @lv
type: WorkType
preferred label: Συνοπτικά πρακτικά συνεδρίασης της Ολομέλειας του ΕΚ @el
preferred label: EP täiskogu istungi protokoll @et
preferred label: Minuti tas-seduta plenarja tal-PE @mt
preferred label: Zapisnik plenarne seje EP @sl

Draft regulation
type: Concept
preferred label: Návrh nariadenia @sk
preferred label: Utkast till förordning @sv
preferred label: Σχέδιο κανονισμού @el
deprecated: false
in scheme: EP taxonomy on document types.
preferred label: Asetusluonnos @fi
preferred label: Projeto de regulamento @pt
preferred label: Projekt rozporządzenia @pl
preferred label: Progetto di regolamento @it
preferred label: Osnutek uredbe @sl
preferred label: Project de regulament @ro
preferred label: Abbozz ta' regolament @mt
broader: Regulation
preferred label: Reglamento projektas @lt
definition: Draft binding legislative act which must be applied in its entirety across the EU.
preferred label: Udkast til forordning @da
preferred label: Rendelettervezet @hu
preferred label: Regulas projekts @lv
preferred label: Proyecto de reglamento @es
preferred label: Проекторегламент @bg
preferred label: Ontwerpverordening @nl
preferred label: Předloha nařízení @cs
preferred label: Projet de règlement @fr
created: 2023-10-31
preferred label: Nacrt uredbe @hr
preferred label: Dréachtrialachán @ga
preferred label: Määruse eelnõu @et
preferred label: Entwurf einer Verordnung @de

Regulation
type: Concept
preferred label: Förordning @sv
preferred label: Rozporządzenie @pl
preferred label: Regolament @mt
preferred label: Uredba @sl
preferred label: Κανονισμός @el
preferred label: Reglamento @es
deprecated: false
preferred label: Verordening @nl
preferred label: Règlement @fr
preferred label: Regula @lv
in scheme: EP taxonomy on document types.
created: 2023-10-31
preferred label: Regolamento @it
preferred label: Nařízení @cs
top concept of: EP taxonomy on document types.
preferred label: Regulamento @pt
preferred label: Регламент @bg
preferred label: Määrus @et
preferred label: Reglamentas @lt
preferred label: Asetus @fi
preferred label: Forordning @da
preferred label: Nariadenie @sk
preferred label: Verordnung @de
preferred label: Regulament @ro
preferred label: Rendelet @hu
preferred label: Rialachán @ga
definition: Binding legislative act which must be applied in its entirety across the EU.

Reasoned opinion of national Parliament
type: Concept
preferred label: Odôvodnené stanovisko národného parlamentu @sk
preferred label: Tuairim réasúnaithe ó Pharlaimint náisiúnta @ga
preferred label: Obrazloženo mnenje nacionalnega parlamenta @sl
preferred label: Avis motivé d’un parlement national @fr
preferred label: Parecer fundamentado do Parlamento nacional @pt
preferred label: Αιτιολογημένη γνώμη εθνικού κοινοβουλίου @el
preferred label: Parere motivato di un parlamento nazionale @it
deprecated: false
preferred label: Dictamen motivado de un parlamento nacional @es
preferred label: Pagrįsta nacionalinio parlamento nuomonė @lt
preferred label: Obrazloženo mišljenje nacionalnog parlamenta @hr
in scheme: EP taxonomy on document types.
definition: Reasoned opinion of national Parliament
preferred label: Avizul motivat al parlamentului național @ro
broader: Opinion
preferred label: Kansallisen parlamentin perusteltu lausunto @fi
preferred label: A nemzeti parlament indokolással ellátott véleménye @hu
preferred label: Motiverat yttrande från ett nationellt parlament @sv
preferred label: Uzasadniona opinia parlamentu narodowego @pl
preferred label: Мотивирано становище на национален парламент @bg
preferred label: Gemotiveerd advies nationaal parlement @nl
preferred label: Odůvodněné stanovisko vnitrostátního parlamentu @cs
preferred label: Liikmesriigi parlamendi põhjendatud arvamus @et
preferred label: Begründete Stellungnahme eines nationalen Parlaments @de
preferred label: Valsts parlamenta pamatots atzinums @lv
preferred label: Begrundet udtalelse fra et nationalt parlament @da
created: 2023-10-31
preferred label: Opinjoni motivata tal-Parlament nazzjonali @mt

Budgetary assessment
type: Concept
preferred label: Budžeta novērtējums @lv
preferred label: Proračunska procjena @hr
preferred label: Avaliação orçamental @pt
created: 2025-04-30
preferred label: Valutazzjoni baġitarja @mt
preferred label: Evaluación presupuestari @es
top concept of: enrich
preferred label: Budgetbedömning @sv
preferred label: Biudžeto vertinimas @lt
preferred label: Ocena proračuna @sl
preferred label: Бюджетна оценка @bg
deprecated: false
in scheme: EP taxonomy on document types.
preferred label: Posouzení rozpočtu @cs
in scheme: enrich
preferred label: Költségvetési értékelés @hu
preferred label: Eelarve hindamine @et
definition: Text drawn up for budgetary assessment of a procedure.
preferred label: Haushaltsbewertung @de
preferred label: Valutazione di bilancio @it
preferred label: Begrotingsevaluatie @nl
preferred label: Ocena budżetowa @pl
preferred label: Measúnú buiséadach @ga
preferred label: Budgetmæssig vurdering @da
preferred label: Évaluation budgétaire @fr
preferred label: Δημοσιονομική αξιολόγηση @el
preferred label: Evaluare bugetară @ro
preferred label: Talousarvion arviointi @fi
preferred label: Posúdenie rozpočtu @sk

Declaration of private interests
type: Concept
alternative label: Declaración relativa a los intereses privados de los diputados @es
alternative label: Nyilatkozat a képviselők magánérdekeltségeiről @hu
alternative label: Deputātu privāto interešu deklarācija @lv
alternative label: Förklaring av Europaparlamentets ledamöter om deras inkomster, olika intressen och andra naturförmåner @sv
alternative label: Dichiarazione dei deputati al Parlamento europeo relativa al reddito, ai vari interessi e a qualsiasi altra prestazione di natura @it
definition: Document completed by Members to declare their private interests in compliance with the code of conduct.
preferred label: Erklärung über private Interessen @de
alternative label: Izjava poslancev Evropskega parlamenta o njihovih dohodkih, različnih interesih in drugih ugodnostih @sl
preferred label: Prohlášení o soukromých zájmech @cs
alternative label: Euroopa Parlamendi liikmete deklaratsioon nende sissetuleku, erinevate huvide ja muude hüvede kohta @et
alternative label: Declaração dos deputados ao Parlamento Europeu sobre os seus rendimentos, interesses diversos e quaisquer outras prestações de natureza @pt
alternative label: Parlamento nario privačių interesų deklaracija @lt
preferred label: Declaração de interesses privados @pt
alternative label: Declaration of Members' private interests
deprecated: false
alternative label: Az európai parlamenti képviselők nyilatkozata jövedelmükről, különböző érdekeltségeikről és egyéb természetű juttatásaikról @hu
alternative label: Δήλωση των βουλευτών του Ευρωπαϊκού Κοινοβουλίου σχετικά με το εισόδημά τους, τα διάφορα συμφέροντά τους και τυχόν άλλες παροχές που έχουν χαρακτήρα @el
alternative label: Opgave van de particuliere belangen van de leden @nl
preferred label: Δηλώσεις ιδιωτικών συμφερόντων @el
alternative label: Déclaration d’intérêts privés des députés @fr
preferred label: Dearbhú maidir le leasanna príobháideacha @ga
alternative label: Déclaration des députés au Parlement européen sur leurs revenus, leurs intérêts divers et tout autre avantage de nature @fr
alternative label: Izjava zastupnika u Europskom parlamentu o njihovim prihodima, različitim interesima i svim drugim povlasticama po prirodi @hr
preferred label: Izjave o privatnim interesima @hr
alternative label: Declarația deputaților în Parlamentul European privind veniturile lor, diversele interese și orice alte prestații de natură @ro
alternative label: Dichiarazione degli interessi privati dei deputati @it
preferred label: Privāto interešu deklarācijas @lv
alternative label: Декларация на членовете на Европейския парламент относно техните доходи, различни интереси и всякакви други обезщетения от естество @bg
preferred label: Izjave o zasebnih interesih @sl
preferred label: Декларации за частни интереси @bg
alternative label: Verklaring van de leden van het Europees Parlement over hun inkomen, diverse belangen en andere voordelen van aard @nl
preferred label: Declarații de interese personale @ro
preferred label: Erahuvide deklaratsioon @et
alternative label: Erklæring fra medlemmer af Europa-Parlamentet om deres indkomst, forskellige interesser og andre fordele @da
alternative label: Erklæring om medlemmernes private interesser @da
alternative label: Declaração de interesses privados dos deputados @pt
alternative label: Prohlášení poslanců Evropského parlamentu o jejich příjmech, různých zájmech a jakýchkoli jiných výhodách @cs
alternative label: Izjava o privatnim interesima zastupnika @hr
alternative label: Δηλωση ιδιωτικων συμφεροντων των βουλευτων @el
in scheme: EP taxonomy on document types.
preferred label: Dichiarazioni di interessi privati @it
preferred label: Förklaring om privata intressen @sv
created: 2025-02-28
alternative label: Dearbhú ó Fheisirí Pharlaimint na hEorpa maidir lena n-ioncam, lena leasanna éagsúla agus le haon sochair eile de chineál ar bith @ga
preferred label: Vyhlásenia o súkromných záujmoch @sk
alternative label: Euroopan parlamentin jäsenten ilmoitus tuloistaan, etuuksistaan ja muista luontoisetuuksistaan @fi
alternative label: Erklärung über die privaten Interessen der Mitglieder @de
alternative label: Ilmoitus jäsenen yksityisistä sidonnaisuuksista @fi
alternative label: Prohlášení o soukromých zájmech poslanců @cs
alternative label: Declarație privind interesele personale ale deputaților @ro
alternative label: Erklärung der Mitglieder des Europäischen Parlaments zu ihren Einkünften, verschiedenen Interessen und sonstigen Vorteilen @de
alternative label: Eiropas Parlamenta deputātu deklarācija par viņu ienākumiem, dažādām interesēm un jebkādiem citiem pabalstiem pēc būtības @lv
preferred label: Ilmoitukset yksityisistä sidonnaisuuksista @fi
alternative label: Parlamendiliikmete erahuvide deklaratsioon @et
alternative label: Oświadczenie posłów do Parlamentu Europejskiego w sprawie ich dochodów, różnych interesów i wszelkich innych korzyści o charakterze @pl
broader: Members' declaration
alternative label: Oświadczenie o interesach prywatnych posłów @pl
preferred label: Magánérdekeltségekről szóló nyilatkozat @hu
preferred label: Erklæringer om private interesser @da
preferred label: Oświadczenia o interesach prywatnych @pl
alternative label: Декларация за частни интереси на членовете на ЕП @bg
preferred label: Déclarations d’intérêts privés @fr
alternative label: Dikjarazzjoni mill-Membri tal-Parlament Ewropew dwar l-introjtu, id-diversi interessi u kwalunkwe benefiċċju ieħor tagħhom fin-natura @mt
alternative label: Declaration by Members of the European Parliament on their income, various interests and any other benefits in nature
alternative label: Vyhlásenie o súkromných záujmoch poslancov @sk
alternative label: Dikjarazzjoni tal-interessi privati tal-membri @mt
alternative label: Izjava o zasebnih interesih poslancev @sl
alternative label: Förklaring om ledamöternas privata intressen @sv
preferred label: Declaración relativa a los intereses privados @es
alternative label: Europos Parlamento narių deklaracija dėl jų pajamų, įvairių interesų ir bet kokios kitos naudos @lt
preferred label: Opgaven van particuliere belangen @nl
alternative label: Vyhlásenie poslancov Európskeho parlamentu o ich príjmoch, rôznych záujmoch a akýchkoľvek iných výhodách @sk
alternative label: Declaración de los diputados al Parlamento Europeo sobre sus ingresos, intereses diversos y cualquier otra prestación de carácter @es
preferred label: Privačių interesų deklaracija @lt
preferred label: Dikjarazzjonijiet tal-interessi privati @mt

Question at question time
type: Concept
preferred label: Jautājums jautājumu izskatīšanas laikā @lv
preferred label: Otázka v čase kladenia otázok @sk
alternative label: Pitanja u vremenu za pitanja @hr
preferred label: Vprašanje v času za vprašanja @sl
alternative label: Fragen während der Fragestunde @de
preferred label: Dotaz v dotazovacím čase @cs
in scheme: EP taxonomy on document types.
alternative label: Questions à l’heure des questions @fr
preferred label: Pitanje u vremenu za pitanja @hr
preferred label: Ερώτηση της ώρας των ερωτήσεων @el
preferred label: Frage während der Fragestunde @de
preferred label: Kyselytunnilla tehty kysymys @fi
preferred label: Interrogazione durante il tempo delle interrogazioni @it
preferred label: Frågestunden @sv
alternative label: Questions at question time
broader: EP question and interpellation
deprecated: false
preferred label: Pergunta do período de perguntas @pt
preferred label: Zapytanie podczas tury pytań @pl
preferred label: Azonnali kérdések órájában feltett kérdés @hu
preferred label: Spørgsmål til spørgetiden @da
preferred label: Pregunta en el turno de preguntas @es
alternative label: Preguntas en el turno de preguntas @es
preferred label: Mistoqsija fil-ħin għall-mistoqsijiet @mt
type: WorkType
preferred label: Infotunnis esitatud küsimus @et
preferred label: Question à l’heure des questions @fr
preferred label: Ceist ag tráth na gceisteanna @ga
preferred label: Въпрос във време за въпроси @bg
definition: Question tabled to question time of the plenary sitting of the European Parliament.
alternative label: Perguntas do período de perguntas @pt
preferred label: Per Klausimų valandą pateikiamas klausimas @lt
preferred label: Întrebare în timpul afectat întrebărilor @ro
created: 2023-10-31
alternative label: Azonnali kérdések órájában feltett kérdések @hu
preferred label: Vraag tijdens het vragenuur @nl

Referral letter
type: Concept
preferred label: Konsulteerimistaotlus @et
preferred label: Kreipimosi laiškas @lt
preferred label: Lausuntopyyntökirje @fi
preferred label: Litir tarchurtha @ga
preferred label: Remiss @sv
preferred label: Henvisningsbrev @da
preferred label: Verwijskaart @nl
preferred label: Wniosek o konsultacje @pl
preferred label: Lettera di consultazione @it
preferred label: Felkérő levél @hu
preferred label: Befassungsschreiben @de
deprecated: false
definition: Letter to officialise exchange of a text in view of its further examination by the adressees.
preferred label: Consulta por carta @pt
in scheme: EP taxonomy on document types.
preferred label: Carta de consulta @es
preferred label: Pismo za mišljenje @hr
created: 2023-10-31
preferred label: Lettre de saisine @fr
preferred label: Писмо за сезиране @bg
preferred label: Scrisoare de sesizare @ro
preferred label: Doporučující dopis @cs
broader: Letter
preferred label: Pieprasījuma vēstule @lv
preferred label: Ittra ta’ riferiment @mt
preferred label: Napotitveno pismo @sl
preferred label: Σχετική επιστολή @el
preferred label: Odporúčací list @sk

Written answer to an EP minor interpellation
type: Concept
preferred label: Písomná odpoveď na menšiu interpeláciu EP @sk
preferred label: Resposta escrita a uma interpelação breve do PE @pt
preferred label: Писмен отговор на кратко запитване на ЕП @bg
preferred label: Kirjallinen vastaus EP:n toissijaiseen tiedusteluun @fi
preferred label: Skriftligt svar på en mindre EP-forespørgsel @da
preferred label: Risposta scritta ad una interpellanza minore del PE @it
preferred label: Schriftliche Antwort auf eine kleine Anfrage des EP @de
preferred label: EP kisebb interpellációra adott írásbeli válasz @hu
preferred label: Schriftelijk antwoord op een EP beperkte interpellatie @nl
preferred label: Rakstiska atbilde uz EP īsu interpelāciju @lv
preferred label: Réponses aux petites interpellations du PE @fr
preferred label: Tweġiba bil-miktub għal interpellanza minuri tal-PE @mt
definition: Written answer to an European Parliament minor interpellation.
preferred label: Respuesta escrita a una interpelación menor del PE @es
preferred label: Răspuns scris la o interpelare minoră a PE @ro
created: 2023-10-31
preferred label: Odpowiedź na piśmie na interpelację PE dotyczącą kwestii drugorzędnych @pl
preferred label: Skriftligt svar på en mindre EP interpellation @sv
preferred label: Γραπτή απάντηση σε ήσσονος σημασίας επερώτηση του ΕΚ @el
preferred label: Pisani odgovor na kraće pitanje za pisani odgovor EP-a @hr
in scheme: EP taxonomy on document types.
preferred label: Pisni odgovor na manjšo interpelacijo EP @sl
preferred label: Kirjalik vastus EP lühemale arupärimisele @et
preferred label: Atsakymas raštu į EP neesminį paklausimą @lt
type: WorkType
preferred label: Písemná odpověď na na parlamentní méně závažnou interpelaci @cs
deprecated: false
broader: EP question and interpellation
preferred label: Freagra i scríbhinn ar mhion-trascheist PE @ga

Study
type: WorkType
preferred label: Studija @hr
in scheme: EP taxonomy on document types.
preferred label: Študija @sl
preferred label: Tanulmány @hu
preferred label: Undersøgelse @da
preferred label: Štúdia @sk
preferred label: Staidéar @ga
preferred label: Estudio @es
preferred label: Étude @fr
preferred label: Учене @bg
preferred label: Studio @it
preferred label: Badanie @pl
preferred label: Studie @cs
type: Concept
preferred label: L-istudju @mt
created: 2024-02-21
preferred label: Pētījums @lv
broader: EP supporting analysis
preferred label: Studiu @ro
preferred label: Estudo @pt
preferred label: Uuring @et
deprecated: false
preferred label: Μελέτη @el
preferred label: Tyrimas @lt
preferred label: Undersökning @sv
preferred label: Tutkimus @fi
definition: Written document examining a subject in details.

EP supporting analysis
type: Concept
preferred label: Podpůrná analýza EP @cs
preferred label: EP parama analizei @lt
preferred label: Analiza wspierająca PE @pl
preferred label: Potporna analiza EP-a @hr
preferred label: Analisi di sostegno del PE @it
preferred label: Analyse d'appui du PE @fr
preferred label: Podporná analýza zo strany EP @sk
preferred label: Подкрепящ анализ от страна на ЕП @bg
preferred label: Analiżi tal-appoġġ tal-PE @mt
definition: European Parliament supporting analysis.
preferred label: Análise do apoio do PE @pt
preferred label: Ανάλυση υποστήριξης του ΕΚ @el
top concept of: EP taxonomy on document types.
preferred label: Analiză de sprijin din partea PE @ro
in scheme: EP taxonomy on document types.
preferred label: EP atbalsta analīze @lv
deprecated: false
preferred label: Análisis de apoyo del PE @es
preferred label: Ondersteunende analyse van het EP @nl
preferred label: EP's støtteanalyse @da
preferred label: EP-Unterstützungsanalyse @de
preferred label: Az EP támogató elemzése @hu
preferred label: Podporna analiza EP @sl
preferred label: Euroopan parlamentti tukee analyysia @fi
created: 2024-02-21
preferred label: Anailís tacaíochta PE @ga
preferred label: Euroopa Parlamendi toetav analüüs @et
preferred label: Europaparlamentets stöd till analysen @sv

Declaration of general expenditure allowance
type: Concept
preferred label: Ilmoitus yleisestä kulukorvauksesta @fi
alternative label: Εθελοντική δήλωση των βουλευτών του Ευρωπαϊκού Κοινοβουλίου σχετικά με τη χρήση της αποζημίωσης γενικών εξόδων από μέρους τους @el
preferred label: Bendroms išlaidoms kompensuoti skirtos išmokos deklaravimas @lt
alternative label: Freiwillige Erklärung der Mitglieder des Europäischen Parlaments zur Verwendung der allgemeinen Kostenvergütung @de
preferred label: Erklärung über die allgemeine Kostenvergütung @de
preferred label: Déclaration relative à l'indemnité de frais généraux @fr
alternative label: Dichiarazione volontaria dei deputati al Parlamento europeo sull'utilizzo dell'indennità per spese generali @it
preferred label: Izjava o naknadi za opće troškove @hr
alternative label: Declarația voluntară a deputaților în Parlamentul European privind utilizarea indemnizației pentru cheltuieli generale @ro
preferred label: Nyilatkozat az általános költségtérítésről @hu
preferred label: Декларация за надбавката за общи разходи @bg
alternative label: Voluntary declaration by Members of the European Parliament on their use of the General Expenditure Allowance
preferred label: Dearbhú liúntais caiteachais ghinearálta @ga
alternative label: Dobrovoľné vyhlásenie poslancov Európskeho parlamentu o využívaní príspevku na všeobecné výdavky @sk
alternative label: Dobrowolne oświadczenie posłów do Parlamentu Europejskiego w sprawie korzystania z dodatku z tytułu kosztów ogólnych @pl
deprecated: false
preferred label: Verklaring inzake de vergoeding voor algemene uitgaven @nl
created: 2025-02-28
preferred label: Príspevok vo vyhlásení o všeobecných výdavkoch @sk
preferred label: Deklaracja dotycząca dodatku z tytułu kosztów ogólnych @pl
alternative label: Dikjarazzjoni volontarja mill-Membri tal-Parlament Ewropew dwar l-użu tagħhom tal-Allowance għall-Ispejjeż Ġenerali @mt
alternative label: Dearbhú deonach ó Fheisirí de Pharlaimint na hEorpa maidir leis an úsáid a bhaineann siad as an Liúntas Caiteachais Ghinearálta @ga
broader: Members' declaration
alternative label: Europos Parlamento narių savanoriška deklaracija dėl bendroms išlaidoms kompensuoti skirtos išmokos naudojimo @lt
alternative label: Declaración voluntaria de los diputados al Parlamento Europeo sobre su utilización de las dietas para gastos generales @es
preferred label: Dikjarazzjoni tal-allowance għall-ispejjeż ġenerali @mt
alternative label: Euroopa Parlamendi liikmete vabatahtlik deklaratsioon üldkulude hüvitise kasutamise kohta @et
alternative label: Frivillig förklaring från Europaparlamentets ledamöter om deras användning av ersättningen för allmänna utgifter @sv
alternative label: Euroopan parlamentin jäsenten vapaaehtoinen ilmoitus yleisen kulukorvauksen käytöstä @fi
alternative label: Dobrovoljna izjava zastupnika u Europskom parlamentu o korištenju naknade za opće troškove @hr
preferred label: Výkaz příspěvku na všeobecné výdaje @cs
alternative label: Prostovoljna izjava poslancev Evropskega parlamenta o uporabi nadomestila splošnih stroškov @sl
preferred label: Δήλωση αποζημίωσης γενικών εξόδων @el
preferred label: Piemaksas par vispārējiem izdevumiem deklarēšana @lv
in scheme: EP taxonomy on document types.
preferred label: Declarație privind indemnizația pentru cheltuieli generale @ro
preferred label: Ersättning för allmänna utgifter @sv
preferred label: Üldkulude hüvitise deklaratsioon @et
preferred label: Declaración de dietas para gastos generales @es
alternative label: Declaração voluntária dos deputados ao Parlamento Europeu sobre a sua utilização do subsídio para despesas gerais @pt
definition: Document completed by Members to confirm that their use of the General Expenditure Allowance complies with the applicable rules of the Statute for Members and its implementing measures.
alternative label: Az európai parlamenti képviselők önkéntes nyilatkozata az általános költségtérítés felhasználásáról @hu
alternative label: Frivillig erklæring fra medlemmer af Europa-Parlamentet om deres anvendelse af godtgørelsen for generelle udgifter @da
alternative label: Déclaration volontaire des députés au Parlement européen sur leur utilisation de l'indemnité de frais généraux @fr
alternative label: Eiropas Parlamenta deputātu brīvprātīga deklarācija par piemaksas par vispārējiem izdevumiem izmantošanu @lv
preferred label: Dichiarazione di indennità per spese generali @it
preferred label: Declaração de subsídio para despesas gerais @pt
preferred label: Erklæring om godtgørelse for generelle udgifter @da
alternative label: Доброволна декларация на членовете на Европейския парламент относно използването от тяхна страна на надбавката за общи разноски @bg
alternative label: Vrijwillige verklaring van leden van het Europees Parlement over hun gebruik van de vergoeding voor algemene uitgaven @nl
alternative label: Dobrovolné prohlášení poslanců Evropského parlamentu o využití příspěvku na všeobecné výdaje @cs
preferred label: Izjava o nadomestilu splošnih stroškov @sl

Catalog
type: WorkType
preferred label: Catálogo @es
preferred label: kataloog @et
created: 2024-02-21
preferred label: Katalóg @sk
preferred label: katalog @sl
preferred label: Katalog @sv
type: Concept
preferred label: Catalóg @ga
preferred label: Luettelo @fi
preferred label: Katalógus @hu
broader: EP supporting analysis
preferred label: katalogas @lt
preferred label: Katalgu @mt
preferred label: Κατάλογος @el
preferred label: Katalogs @lv
definition: Listing of available items.
preferred label: Каталог @bg
deprecated: false
in scheme: EP taxonomy on document types.

Text consolidated
type: Concept
preferred label: Konsoliduotas tekstas @lt
preferred label: Text consolidat @ro
preferred label: Test konsolidat @mt
broader: Annex
preferred label: Téacs comhdhlúite @ga
preferred label: Tekst skonsolidowany @pl
deprecated: false
definition: Text presenting an initial (or more) act(s) with all its subsequent amendments in a single document.
preferred label: Geconsolideerde tekst @nl
preferred label: Консолидиран текст @bg
preferred label: Konsolidovaný text @cs
preferred label: Konsolidierter Text @de
preferred label: Konsoliderad text @sv
preferred label: Konsolideeritud tekst @et
preferred label: Texte consolidé @fr
preferred label: Egységes szerkezetbe foglalt szöveg @hu
preferred label: Testo consolidato @it
preferred label: Konsolidoitu teksti @fi
preferred label: Konsolidirano besedilo @sl
preferred label: Texto consolidado @pt
preferred label: Konsolideret tekst @da
in scheme: EP taxonomy on document types.
preferred label: Ενοποιημένο κείμενο @el
preferred label: Konsolidēts teksts @lv
preferred label: Pročišćeni tekst @hr
preferred label: Konsolidované znenie @sk
created: 2023-10-31

EP motion for resolution – oral questions
type: Concept
preferred label: Návrh usnesení – otázky k ústnímu zodpovězení EP @cs
preferred label: Projekt rezolucji PE – pytania ustne @pl
preferred label: EP resolutionsförslag – muntliga frågor @sv
deprecated: false
alternative label: Motion for resolution – oral questions
preferred label: EP pasiūlymas dėl rezoliucijos – klausimai žodžiu @lt
preferred label: EP állásfoglalási indítvány – szóbeli választ igénylő kérdések @hu
preferred label: Propuesta de resolución del PE – preguntas orales @es
preferred label: EP:n päätöslauselmaesitys – suulliset kysymykset @fi
preferred label: EP-beslutningsforslag – mundtlige spørgsmål @da
definition: Motion for resolution grouping the oral questions tabled to a sitting of the European Parliament.
preferred label: Entschließungsantrag – mündliche Anfragen des EP @de
preferred label: Tairiscint i gcomhair rúin PE – ceisteanna ó bhéal @ga
preferred label: Mozzjoni għal riżoluzzjoni tal-PE — mistoqsijiet orali @mt
type: WorkType
preferred label: Предложение за резолюция на ЕП — устни въпроси @bg
created: 2023-10-31
broader: EP question and interpellation
preferred label: Návrh uznesenia EP — ústne otázky @sk
preferred label: Πρόταση ψηφίσματος του ΕΚ – προφορικές ερωτήσεις @el
preferred label: PE proposition de résolution – question orales @fr
preferred label: EP-ontwerpresolutie — mondelinge vragen @nl
preferred label: Prijedlog rezolucije EP-a – pitanja za usmeni odgovor @hr
preferred label: Proposta di risoluzione del PE – interrogazioni orali @it
preferred label: Propunere de rezoluție a PE - întrebări cu solicitare de răspuns oral @ro
preferred label: EP resolutsiooni ettepanek – suulised küsimused @et
preferred label: Predlog resolucije EP — vprašanja za ustni odgovor @sl
in scheme: EP taxonomy on document types.
preferred label: EP rezolūcijas priekšlikums – jautājumi, uz kuriem jāatbild mutiski @lv
preferred label: Proposta de resolução do PE - perguntas orais @pt

EP plenary sitting attendance list
type: WorkType
preferred label: Lista de presenças da sessão diária plenária do PE @pt
preferred label: EP täiskogu istungi kohalolijate nimekiri @et
preferred label: Anwesenheitsliste der Plenarsitzung des EP @de
preferred label: Liosta tinrimh shuí iomlánach PE @ga
preferred label: Prezenční listina z plenárního zasedání EP @cs
preferred label: EP plenáris ülésnap: jelenléti ív @hu
preferred label: Närvarolista för EP plenarsammanträden @sv
preferred label: Lista obecności na posiedzeniu plenarnym PE @pl
preferred label: EP plenārsēdes apmeklējumu saraksts @lv
preferred label: EP-liste over mødedeltagere @da
in scheme: EP taxonomy on document types.
preferred label: Lista ta‘ attendenza tas-seduta plenarja tal-PE @mt
deprecated: false
preferred label: Присъствен списък от пленарно заседание на ЕП @bg
preferred label: Lista de asistencia a la sesión plenaria del PE @es
preferred label: Seznam navzočih poslancev na plenarni seji EP @sl
definition: List of members attending a plenary sitting of the European Parliament.
preferred label: EP:n täysistunnon läsnäololista @fi
preferred label: EP plenarinio posėdžio dalyvių sąrašas @lt
preferred label: Zoznam prítomných na plenárnom rokovaní EP @sk
broader: Minutes
preferred label: Elenco dei partecipanti alla seduta plenaria del PE @it
preferred label: Popis zastupnika nazočnih na dnevnoj plenarnoj sjednici EP-a @hr
created: 2023-10-31
preferred label: PE liste de présence de la plénière @fr
type: Concept
preferred label: Κατάλογος παρουσίας της συνεδρίασης της Ολομέλειας του ΕΚ @el
preferred label: Presentielijst van de plenaire vergadering van het EP @nl
preferred label: Lista de participare la ședința plenară a PE @ro

Informazzjoni
type: WorkType
in scheme: EP taxonomy on document types.
broader: EP supporting analysis
preferred label: Briefing
preferred label: Tiedotustilaisuus @fi
preferred label: Unterrichtung @de
preferred label: Séance d'information @fr
preferred label: Ενημέρωση @el
preferred label: Brīfings @lv
preferred label: Informacinis pranešimas @lt
preferred label: Genomgång @sv
preferred label: Orientering @da
preferred label: Ülevaade @et
definition: Written document examining a subject in a brief manner.
preferred label: Informazioni @it
preferred label: Informare @ro
preferred label: Sesión informativa @es
preferred label: Kratko izvješće @hr
preferred label: Sessão de informação @pt
preferred label: brífing @sk
type: Concept
preferred label: Informační schůzka @cs
preferred label: Брифинг @bg
preferred label: Tájékoztató @hu
preferred label: Informativni sestanek @sl
created: 2024-02-21
deprecated: false
preferred label: Faisnéisiú @ga

Written answer to an EP question or interpellation
type: Concept
broader: EP question and interpellation
preferred label: Atsakymas raštu į EP klausimą ar paklausimą @lt
definition: Written answer to an European Parliament question or interpellation.
preferred label: Tweġiba bil-miktub għal mistoqsija jew interpellanza tal-PE @mt
preferred label: Réponse écrite à une question ou interpellation du PE @fr
preferred label: Pisni odgovor na vprašanje ali interpelacijo EP @sl
preferred label: Písomná odpoveď na otázku alebo interpeláciu EP @sk
created: 2023-10-31
preferred label: Písemná odpověď na parlamentní otázku nebo interpelaci @cs
preferred label: Schriftelijk antwoord op een EP-vraag of -interpellatie @nl
preferred label: Skriftligt svar på en EP fråga eller interpellation @sv
preferred label: Pisani odgovor na pitanje ili pitanje za pisani odgovor EP-a @hr
preferred label: Писмен отговор на въпрос или запитване на ЕП @bg
preferred label: Răspuns scris la o întrebare sau interpelare a PE @ro
deprecated: false
preferred label: Kirjalik vastus EP küsimusele või arupärimisele @et
preferred label: Resposta escrita a uma pergunta ou interpelação do PE @pt
preferred label: Risposta scritta ad una interrogazione o interpellanza del PE @it
preferred label: Schriftliche Antwort auf eine Anfrage des EP @de
preferred label: Respuesta escrita a una pregunta o interpelación del PE @es
preferred label: Rakstiska atbilde uz EP jautājumu vai interpelāciju @lv
preferred label: Γραπτή απάντηση σε ερώτηση ή επερώτηση του ΕΚ @el
preferred label: Freagra i scríbhinn ar cheist nó trascheist PE @ga
in scheme: EP taxonomy on document types.
preferred label: Kirjallinen vastaus EP:n kysymykseen tai tiedusteluun @fi
preferred label: Skriftligt svar på en EP-forespørgsel @da
preferred label: EP kérdésre vagy interpellációra adott írásbeli válasz @hu
preferred label: Odpowiedź na piśmie na pytanie lub interpelację PE @pl

EP priority written question
type: Concept
preferred label: Mistqosija bil-miktub ta‘ prijorità tal-PE @mt
preferred label: Priorytetowe pytanie pisemne PE @pl
preferred label: EP prioritārs jautājums, uz kuru jāatbild rakstiski @lv
alternative label: Priority written question
preferred label: EP írásbeli választ igénylő elsőbbségi kérdés @hu
preferred label: Ceist tosaíochta i scríbhinn PE @ga
in scheme: EP taxonomy on document types.
preferred label: Писмен въпрос от първостепенна важност на ЕП @bg
preferred label: Interrogazione scritta prioritaria del PE @it
preferred label: Prioritní otázky EP k písemnému zodpovězení @cs
deprecated: false
preferred label: Γραπτή ερώτηση προτεραιότητας του ΕΚ @el
preferred label: Pregunta escrita prioritaria del PE @es
preferred label: EP prioriteetne kirjalikult vastatav küsimus @et
broader: EP question and interpellation
preferred label: EP:n kirjallisesti vastattava ensisijainen kysymys @fi
definition: Priority question in a written form.
preferred label: EP schriftelijke vraag met voorrang @nl
type: WorkType
preferred label: Prioritná písomná otázka EP @sk
preferred label: Prioritetno pitanje za pisani odgovor EP-a @hr
preferred label: Pergunta escrita prioritária do PE @pt
created: 2023-10-31
preferred label: Schriftliche Anfrage mit Vorrang des EP @de
preferred label: EP prioritetinis klausimas žodžiu @lt
preferred label: PE question écrite prioritaire @fr
preferred label: Prioriteret skriftlig EP-forespørgsel @da
preferred label: EP prioriterade skriftliga frågor @sv
preferred label: Prednostno vprašanje za pisni odgovor EP @sl
preferred label: Întrebare scrisă prioritară a PE @ro

EP plenary part-session draft final agenda
type: Concept
preferred label: Proyecto de orden del día definitivo del período parcial de sesiones del PE @es
preferred label: Проект на окончателен дневен ред на пленарната сесия на ЕП @bg
preferred label: Projeto de ordem do dia definitiva do período de sessões do PE @pt
preferred label: Abbozz ta’ aġenda finali tas-sessjoni plenarja tal-PE @mt
deprecated: false
definition: European Parliament plenary part-session draft final agenda.
preferred label: EP plenarinės sesijos galutinės darbotvarkės projektas @lt
preferred label: Euroopan parlamentin istuntojakson lopullinen esityslistaluonnos @fi
preferred label: Σχέδιο τελικής ημερήσιας διάταξης της περιόδου συνόδου ολομέλειας του ΕΚ @el
preferred label: Förslag till slutlig föredragningslista för Europaparlamentets sammanträdesperiod @sv
preferred label: EP plenārsesijas galīgās darba kārtības projekts @lv
preferred label: Ostateczny projekt porządku obrad sesji plenarnej PE @pl
preferred label: Ontwerp van de definitieve agenda van de plenaire vergadering van het EP @nl
preferred label: Dréachtchlár oibre críochnaitheach do pháirtseisiún iomlánach Pharlaimint na hEorpa @ga
preferred label: Návrh konečného pořadu jednání plenárního zasedání EP @cs
created: 2023-10-31
preferred label: Prijedlog konačnog dnevnog reda plenarne sjednice EP-a @hr
broader: Tagesordnung
preferred label: Proiectul de ordine de zi definitivă a sesiunii plenare a PE @ro
preferred label: Návrh konečného programu plenárnej schôdze EP @sk
preferred label: Forslag til endelig dagsorden for EP's plenarmødeperiode @da
preferred label: Entwurf der endgültigen Tagesordnung für die Plenartagung des EP @de
preferred label: Projet d’ordre du jour définitif de la session plénière du PE @fr
in scheme: EP taxonomy on document types.
preferred label: Az EP plenáris ülésének végleges napirendtervezete @hu
preferred label: Euroopa Parlamendi täiskogu osaistungjärgu lõpliku päevakorra projekt @et
preferred label: Osnutek končnega dnevnega reda plenarnega zasedanja EP @sl
preferred label: Progetto di ordine del giorno definitivo della tornata plenaria del PE @it

Parliamentary committee amendment to the draft budget of the European Union
type: WorkType
preferred label: Europos Sąjungos biudžeto projekto Parlamento komiteto pakeitimas @lt
definition: Amendment proposed by a parliamentary committee to the draft budget of the European Union.
preferred label: Poprawka komisji parlamentarnej do projektu budżetu Unii Europejskiej @pl
preferred label: Pozměňovací návrh parlamentního výboru k návrhu rozpočtu Evropské unie @cs
preferred label: Abänderung des Parlamentsausschusses zum Entwurf des Haushaltsplans der Europäischen Union @de
preferred label: Parlamenti bizottsági módosítás az Európai Unió költségvetési tervezetéhez @hu
preferred label: Amendement de commission parlementaire au projet de budget de l'Union européenne @fr
in scheme: EP taxonomy on document types.
created: 2025-10-31
preferred label: Parlamentets udvalgsændring af forslaget til Den Europæiske Unions budget @da
preferred label: Leasú ón gcoiste parlaiminteach ar dhréachtbhuiséad an Aontais Eorpaigh @ga
preferred label: Sprememba predloga proračuna Evropske unije, ki jo je predlagal parlamentarni odbor @sl
preferred label: Parlamendikomisjoni muudatusettepanek Euroopa Liidu eelarve projekti kohta @et
preferred label: Изменение на проектобюджета на Европейския съюз, внесено от парламентарна комисия @bg
preferred label: Τροπολογία κοινοβουλευτικής επιτροπής στο σχέδιο προϋπολογισμού της Ευρωπαϊκής Ένωσης @el
preferred label: Amendamentul comisiei parlamentare la proiectul de buget al Uniunii Europene @ro
preferred label: Amandman parlamentarnog odbora na nacrt proračuna Europske unije @hr
preferred label: Parlamentin valiokunnan tarkistus Euroopan unionin talousarvioesitykseen @fi
preferred label: Emendamento della commissione parlamentare al progetto di bilancio dell'Unione europea @it
broader: Amendment
preferred label: Emenda tal-kumitat parlamentari għall-abbozz ta' baġit tal-Unjoni Ewropea @mt
preferred label: Pozmeňujúci a doplňujúci návrh parlamentného výboru k návrhu rozpočtu Európskej únie @sk
type: Concept
deprecated: false
preferred label: Parlamentariskt utskottsändringsförslag till förslaget till Europeiska unionens budget @sv
preferred label: Parlamenta komitejas grozījums Eiropas Savienības budžeta projektā @lv
preferred label: Amendement van de parlementaire commissie op de ontwerpbegroting van de Europese Unie @nl
preferred label: Alteração da comissão parlamentar ao projeto de orçamento da União Europeia @pt
preferred label: Enmienda de la comisión parlamentaria al proyecto de presupuesto de la Unión Europea @es

Parliamentary committee opinion on the use of delegated or implementating act
type: Concept
preferred label: Parlamenta komitejas atzinums par deleģētā vai īstenošanas akta izmantošanu @lv
preferred label: Parlamentin valiokunnan lausunto delegoidun säädöksen tai täytäntöönpanosäädöksen käytöstä @fi
preferred label: Stanovisko parlamentního výboru k používání aktu v přenesené pravomoci nebo prováděcího aktu @cs
preferred label: Mišljenje parlamentarnog odbora o primjeni delegiranog ili provedbenog akta @hr
preferred label: Γνωμοδότηση της κοινοβουλευτικής επιτροπής σχετικά με τη χρήση κατ’ εξουσιοδότηση ή εκτελεστικής πράξης @el
preferred label: A parlamenti bizottság véleménye a felhatalmazáson alapuló vagy végrehajtási jogi aktus alkalmazásáról @hu
preferred label: Stellungnahme des Parlamentsausschusses zur Anwendung von delegierten Rechtsakten oder Durchführungsrechtsakten @de
definition: Statement about the use of delegated act and conferral of implementign powers given by the JURI committee for opinion to the responsible committee.
preferred label: Mnenje parlamentarnega odbora o uporabi delegiranega ali izvedbenega akta @sl
preferred label: Становище на парламентарната комисия относно използването на делегиран акт или акт за изпълнение @bg
in scheme: EP taxonomy on document types.
broader: Opinion
preferred label: Opinjoni tal-kumitat parlamentari dwar l-użu ta’ att delegat jew ta’ implimentazzjoni @mt
preferred label: Parlamentsudvalgets udtalelse om anvendelsen af delegerede retsakter eller gennemførelsesretsakter @da
preferred label: Avis de la commission parlementaire sur le recours à l’acte délégué ou à l’acte d’exécution @fr
preferred label: Opinia komisji parlamentarnej w sprawie stosowania aktu delegowanego lub wykonawczego @pl
preferred label: Avizul comisiei parlamentare privind utilizarea actului delegat sau de punere în aplicare @ro
preferred label: Tuairim ón gcoiste parlaiminteach maidir le gníomh tarmligthe nó gníomh cur chun feidhme a úsáid @ga
preferred label: Parlamentsutskottets yttrande om användningen av delegerade akter eller genomförandeakter @sv
type: WorkType
preferred label: Advies van de parlementaire commissie over het gebruik van gedelegeerde handelingen of uitvoeringshandelingen @nl
created: 2025-08-31
preferred label: Parecer da comissão parlamentar sobre o recurso a atos delegados ou de execução @pt
preferred label: Opinión de las comisiones parlamentarias sobre el uso de actos delegados o de ejecución @es
preferred label: Stanovisko parlamentného výboru k používaniu delegovaného alebo vykonávacieho aktu @sk
preferred label: Parere della commissione parlamentare sull'uso di atti delegati o di esecuzione @it
preferred label: Parlamendikomisjoni arvamus delegeeritud õigusakti või rakendusakti kasutamise kohta @et
deprecated: false
preferred label: Parlamento komiteto nuomonė dėl deleguotųjų ar įgyvendinimo aktų naudojimo @lt

EP plenary sitting results of votes
type: WorkType
preferred label: PE résultats des votes de la plénière @fr
preferred label: Resultatet af EP-plenarafstemningen @da
preferred label: Výsledky hlasování z plenárního zasedání EP @cs
preferred label: Torthaí vótála shuí iomlánach PE @ga
preferred label: Резултати от гласуването на пленарно заседание на ЕП @bg
preferred label: Izid glasovanja na plenarni seji EP @sl
preferred label: Risultati delle votazioni della seduta plenaria del PE @it
broader: Minutes
definition: Results of votes in the written record of a plenary sitting of the European Parliament.
preferred label: Wyniki głosowania na posiedzeniu plenarnym PE @pl
preferred label: EP plenarinio posėdžio balsavimų rezultatai @lt
preferred label: Uitslag van de stemming ter plenaire vergadering van het EP @nl
in scheme: EP taxonomy on document types.
preferred label: EP:n täysistunnon äänestystulokset @fi
preferred label: Rezultatele votului în ședința plenară a PE @ro
preferred label: Výsledky hlasovania plenárneho rokovania EP @sk
preferred label: Riżultati tal-voti tas-seduta plenarja tal-PE @mt
type: Concept
created: 2023-10-31
preferred label: Αποτελέσματα ψηφοφοριών της συνεδρίασης της Ολομέλειας του ΕΚ @el
deprecated: false
preferred label: Omröstningsresultat från EP plenarsammanträden @sv
preferred label: Rezultati glasovanja dnevne plenarne sjednice EP-a @hr
preferred label: EP plenáris ülésnap: a szavazások eredménye @hu
preferred label: EP plenārsēdes balsojuma rezultāti @lv
preferred label: Resultados de las votaciones de la sesión plenaria del PE @es
preferred label: EP täiskogu istungi hääletustulemused @et
preferred label: Resultado das votações da sessão diária plenária do PE @pt
preferred label: Abstimmungsergebnisse der Plenarsitzung des EP @de

Draft budgetary assessment
type: WorkType
preferred label: Entwurf der haushaltspolitischen Bewertung @de
definition: Draft text drawn up for budgetary assessment of a procedure.
preferred label: Költségvetési értékelés tervezete @hu
preferred label: Eelarvekava hinnang @et
type: Concept
preferred label: Σχέδιο δημοσιονομικής αξιολόγησης @el
preferred label: Proyecto de evaluación presupuestaria @es
preferred label: Nacrt proračunske procjene @hr
preferred label: Utkast till budgetbedömning @sv
created: 2025-06-30
preferred label: Проект на бюджетна оценка @bg
preferred label: Abbozz ta' valutazzjoni baġitarja @mt
deprecated: false
preferred label: Projeto de avaliação orçamental @pt
preferred label: Ontwerpbegrotingsbeoordeling @nl
preferred label: Projekt oceny budżetowej @pl
preferred label: Dréachtmheasúnú buiséadach @ga
preferred label: Návrh rozpočtového posúdenia @sk
preferred label: Projet d'évaluation budgétaire @fr
preferred label: Alustava talousarvioarvio @fi
preferred label: Návrh rozpočtového posouzení @cs
preferred label: Osnutek proračunske ocene @sl
preferred label: Documento di valutazione di bilancio @it
preferred label: Proiect de evaluare bugetară @ro
preferred label: Udkast til budgetmæssig vurdering @da
preferred label: Biudžeto vertinimo projektas @lt
preferred label: Budžeta novērtējuma projekts @lv
in scheme: EP taxonomy on document types.

Declaration of Members’ attendance pursuant to an invitation at events organised by third parties
type: Concept
alternative label: Verklaring van de leden van het Europees Parlement over hun deelname, op uitnodiging en in de uitoefening van hun functie, aan door derden georganiseerde evenementen waarbij reis-, verblijf- en verblijfkosten worden vergoed of rechtstreeks worden betaald @nl
preferred label: Erklæring om medlemmers deltagelse efter indbydelse i en begivenhed arrangeret af tredjeparter @da
preferred label: Obrazec za obveščanje o darilih, ki jih prejmejo poslanci pri opravljanju uradnih dolžnosti predstavljanja parlamenta @sl
alternative label: Euroopan parlamentin jäsenten ilmoitus osallistumisestaan kutsun perusteella ja tehtäviään hoitaessaan kolmansien osapuolten järjestämiin tapahtumiin, joissa matka-, majoitus- ja oleskelukulut korvataan tai maksetaan suoraan @fi
preferred label: Ilmoitus jäsenen osallistumisesta kutsusta kolmansien osapuolten järjestämiin tilaisuuksiin @fi
preferred label: Déclaration de participation de députés à des manifestations organisées par des tiers @fr
alternative label: Dearbhú ó Fheisirí Pharlaimint na hEorpa maidir lena bhfreastal, de bhun cuireadh a fháil agus le linn dóibh a ndualgais a chomhlíonadh, ag imeachtaí arna n-eagrú ag tríú páirtithe ina ndéantar speansais taistil, chóiríochta agus chothaithe a aisíoc nó a íoc go díreach @ga
alternative label: Oświadczenie posłów do Parlamentu Europejskiego dotyczące ich udziału, na zaproszenie i w ramach pełnienia obowiązków służbowych, w wydarzeniach organizowanych przez osoby trzecie, w przypadku których koszty podróży, zakwaterowania i pobytu są zwracane lub bezpośrednio wypłacane @pl
preferred label: Dichiarazione di partecipazione dei deputati sulla base di un invito a eventi organizzati da terzi @it
alternative label: Declaration by Members of the European Parliament on their attendance, pursuant to an invitation and in the performance of their duties, at events organised by third parties where travel, accommodation and subsistence expenses are reimbursed or directly paid
alternative label: Euroopa Parlamendi liikmete deklaratsioon kutse alusel ja ametiülesannete täitmisel kolmandate isikute korraldatud üritustel osalemise kohta, mille puhul sõidu-, majutus- ja elamiskulud hüvitatakse või makstakse otse @et
alternative label: Izjava poslancev Evropskega parlamenta o njihovi udeležbi na prireditvah, ki jih organizirajo tretje strani in za katere se povrnejo ali neposredno plačajo potni stroški, stroški nastanitve in dnevnice, na podlagi povabila in pri opravljanju svojih dolžnosti @sl
alternative label: Förklaring från Europaparlamentets ledamöter om deras deltagande, på inbjudan och under tjänsteutövning, i evenemang som anordnas av tredje part där kostnader för resa, logi och uppehälle ersätts eller betalas direkt @sv
alternative label: Declaración de los diputados al Parlamento Europeo sobre su asistencia, previa invitación y en el ejercicio de sus funciones, a actos organizados por terceros en los que se reembolsen o paguen directamente los gastos de viaje, alojamiento y estancia @es
alternative label: Europos Parlamento narių deklaracija dėl jų dalyvavimo trečiųjų šalių organizuojamuose renginiuose gavus kvietimą ir jiems vykdant savo pareigas, kai kompensuojamos arba tiesiogiai apmokamos kelionės, apgyvendinimo ir pragyvenimo išlaidos @lt
alternative label: Δήλωση των βουλευτών του Ευρωπαϊκού Κοινοβουλίου σχετικά με την παρουσία τους, κατόπιν πρόσκλησης και κατά την άσκηση των καθηκόντων τους, σε εκδηλώσεις που διοργανώνονται από τρίτους, στις οποίες επιστρέφονται ή καταβάλλονται απευθείας τα έξοδα ταξιδίου, διαμονής και διαμονής @el
in scheme: EP taxonomy on document types.
definition: Document completed by Members to declare, in compliance with the code of conduct, that their travel costs have been reimbursed or paid by a third party.
alternative label: Vyhlásenie poslancov Európskeho parlamentu o ich účasti na podujatiach organizovaných tretími stranami na základe pozvania a pri výkone ich povinností, na ktorých sa uhrádzajú alebo priamo uhrádzajú cestovné náklady, náklady na ubytovanie a diéty @sk
preferred label: Erklärung über die Teilnahme eines Mitglieds an von dritten organisierten Veranstaltungen auf Einladung @de
alternative label: Prohlášení poslanců Evropského parlamentu o jejich účasti na akcích pořádaných třetími stranami, na nichž jsou hrazeny nebo přímo hrazeny cestovní výdaje, výdaje na ubytování a pobyt, a to na základě pozvání a při plnění jejich povinností @cs
alternative label: Erklärung der Mitglieder des Europäischen Parlaments über ihre Teilnahme auf Einladung und in Ausübung ihres Amtes an von Dritten organisierten Veranstaltungen, bei denen Reise-, Unterbringungs- und Aufenthaltskosten erstattet oder direkt gezahlt werden @de
preferred label: Parlamento narių dalyvavimo trečiųjų asmenų organizuojamuose renginiuose, į kuriuos jie buvo pakviesti, deklaracija @lt
broader: Members' declaration
alternative label: Az Európai Parlament képviselőinek nyilatkozata arról, hogy meghívás alapján és feladataik ellátása során részt vesznek harmadik felek által szervezett olyan rendezvényeken, amelyek esetében az utazási, szállás- és tartózkodási költségeket megtérítik vagy közvetlenül kifizetik @hu
preferred label: Verklaring betreffende de aanwezigheid van leden, als gevolg van een uitnodiging, op door derden georganiseerde evenementen @nl
preferred label: A képviselők harmadik fél által szervezett eseményeken való részvételére vonatkozó nyilatkozat @hu
preferred label: Deklaratsioon parlamendiliikmete osalemise kohta kutse alusel kolmandate isikute korraldatud üritustel @et
preferred label: Declarație de participare a deputaților, în urma unei invitații, la evenimente organizate de terți @ro
alternative label: Eiropas Parlamenta deputātu deklarācija par piedalīšanos trešo personu rīkotos pasākumos pēc ielūguma un pildot savus pienākumus, ja tiek atlīdzināti vai tieši apmaksāti ceļa, izmitināšanas un uzturēšanās izdevumi @lv
created: 2025-02-28
preferred label: Declaração de participação de deputados em eventos organizados por terceiros na sequência de um convite @pt
preferred label: Izjava o prisustvovanju zastupnika događanjima koja je organizirala treća strana @hr
alternative label: Declarația deputaților în Parlamentul European privind participarea lor, ca urmare a unei invitații și în exercitarea atribuțiilor lor, la evenimente organizate de părți terțe în cadrul cărora cheltuielile de deplasare, de cazare și de ședere sunt rambursate sau plătite direct @ro
preferred label: Dearbhú maidir le tinreamh na bhFeisirí de bhun cuireadh ag imeachtaí arna n-eagrú ag tríú páirtithe @ga
preferred label: Prohlášení poslance o účasti na akci pořádané třetími osobami na základě pozvání @cs
preferred label: Declaración de asistencia de los diputados por invitación y en el ejercicio de sus funciones a actos organizados por terceros @es
alternative label: Dichiarazione dei deputati al Parlamento europeo sulla loro partecipazione, su invito e nell'esercizio delle loro funzioni, a eventi organizzati da terzi in cui le spese di viaggio, alloggio e soggiorno sono rimborsate o pagate direttamente @it
preferred label: Dikjarazzjoni tal-attendenza ta’ membri fuq stedina għal avvenimenti organizzati minn partijiet terzi @mt
alternative label: Déclaration des députés au Parlement européen relative à leur participation, sur invitation et dans l'exercice de leurs fonctions, à des manifestations organisées par des tiers dans le cadre desquelles les frais de voyage, d'hébergement et de séjour sont remboursés ou directement payés @fr
alternative label: Izjava zastupnika u Europskom parlamentu o sudjelovanju na događanjima koja organiziraju treće strane na kojima se nadoknađuju ili izravno plaćaju putni troškovi, troškovi smještaja i dnevnice na temelju poziva i pri obavljanju dužnosti @hr
preferred label: Deklarācija par deputātu dalību trešo personu rīkotos pasākumos pēc šo personu uzaicinājuma @lv
preferred label: Oświadczenie o udziale posłów w wydarzeniach organizowanych przez strony trzecie i na zaproszenie stron trzecich @pl
preferred label: Vyhlásenie poslanca o účasti na podujatí organizovanom tretími stranami na základe pozvania @sk
alternative label: Dikjarazzjoni mill-Membri tal-Parlament Ewropew dwar l-attendenza tagħhom, fuq stedina u fil-qadi ta' dmirijiethom, f'avvenimenti organizzati minn partijiet terzi fejn l-ispejjeż tal-ivvjaġġar, tal-akkomodazzjoni u tas-sussistenza jiġu rimborżati jew imħallsa direttament @mt
preferred label: Förklaring om ledamöternas närvaro till följd av en inbjudan till evenemang som anordnas av en tredje part @sv
alternative label: Декларация на членовете на Европейския парламент относно тяхното присъствие, по покана и при изпълнение на техните задължения, на прояви, организирани от трети страни, на които пътните, квартирните и дневните разноски се възстановяват или се изплащат пряко @bg
deprecated: false
preferred label: Декларация за присъствието на членове на ЕП вследствие на покана на събития, организирани от трети страни @bg
alternative label: Declaração dos deputados ao Parlamento Europeu relativa à sua participação, na sequência de um convite e no exercício das suas funções, em eventos organizados por terceiros em que as despesas de viagem, alojamento e estadia são reembolsadas ou pagas diretamente @pt
preferred label: Δηλωση συμμετοχης των βουλευτων σε εκδηλωσεις που οργανωνονται απο τριτους @el
alternative label: Erklæring fra medlemmer af Europa-Parlamentet om deres deltagelse, efter indbydelse og under udøvelsen af deres hverv, i arrangementer arrangeret af tredjeparter, hvor rejse-, hotel- og opholdsudgifter godtgøres eller betales direkte @da

Parliamentary committee amendment
type: Concept
preferred label: Valiokunnan tarkistus @fi
preferred label: Amendement de commission parlementaire @fr
preferred label: Amandmani parlamentarnog odbora @hr
preferred label: Ændringsforslag fra et parlamentarisk udvalg @da
preferred label: Pozmeňovací návrh parlamentného výboru @sk
preferred label: Изменение на парламентарна комисия @bg
in scheme: EP taxonomy on document types.
preferred label: Alteração de uma comissão parlamentar @pt
definition: Amendment tabled to a Parliamentary committee.
preferred label: Τροπολογία κοινοβουλευτικής επιτροπής @el
deprecated: false
preferred label: Enmienda de comisión parlamentaria @es
preferred label: Parlamendikomisjoni muudatusettepanek @et
preferred label: Parlamenti bizottság módosítása @hu
preferred label: Amendement van een parlementaire commissie @nl
preferred label: Leasú ó Choiste Parlaiminteach @ga
preferred label: Poprawka komisji parlamentarnej @pl
created: 2023-10-31
preferred label: Amendament al comisiei parlamentare @ro
preferred label: Emendamento di una commissione parlamentare @it
preferred label: Parlamenta komitejas grozījums @lv
preferred label: Emenda ta’ Kumitat Parlamentari @mt
preferred label: Ändringsförslag från ett parlamentsutskott @sv
preferred label: Parlamento komiteto pakeitimas @lt
broader: Amendment
preferred label: Pozměňovací návrh parlamentního výboru @cs
preferred label: Änderungsantrag eines parlamentarischen Ausschusses @de
preferred label: Predlog spremembe parlamentarnega odbora @sl

Motion for a resolution
type: WorkType
deprecated: false
preferred label: Mozzjoni għal riżoluzzjoni @mt
preferred label: Rezolūcijas priekšlikums @lv
preferred label: Tairiscint i gcomhair rúin @ga
preferred label: Predlog resolucije @sl
preferred label: Ontwerpresolutie @nl
preferred label: Förslag till resolution @sv
preferred label: Πρόταση ψηφίσματος @el
created: 2023-10-31
preferred label: Resolutsiooni ettepanek @et
preferred label: Návrh usnesení @cs
preferred label: Pasiūlymas dėl rezoliucijos @lt
preferred label: Päätöslauselmaesitys @fi
preferred label: Entschließungsantrag @de
preferred label: Állásfoglalásra irányuló indítvány @hu
preferred label: Prijedlog rezolucije @hr
preferred label: Proposta di risoluzione @it
preferred label: Projekt rezolucji @pl
preferred label: Proposta de resolução @pt
preferred label: Propunere de rezoluție @ro
in scheme: EP taxonomy on document types.
preferred label: Propuesta de resolución @es
type: Concept
preferred label: Proposition de résolution @fr
preferred label: Návrh uznesenia @sk
preferred label: Forslag til beslutning @da
preferred label: Предложение за резолюция @bg
broader: Resolution
definition: Text declaring European Parliament's opinion on a matter tabled on a topical issue, at the request of a committee, a political group or members and voted in plenary.

In-depth analysis
type: Concept
preferred label: Poglobljena analiza @sl
preferred label: Análisis en profundidad @es
preferred label: Padziļināta analīze @lv
preferred label: Diepgaande analyse @nl
preferred label: Analiză aprofundată @ro
created: 2024-02-21
preferred label: Dogłębna analiza @pl
in scheme: EP taxonomy on document types.
preferred label: Hloubková analýza @cs
preferred label: Grinnanailís @ga
preferred label: Задълбочен анализ @bg
definition: Written document investigating a problem or issue in great detail.
preferred label: Analyse approfondie @fr
broader: EP supporting analysis
preferred label: Detaljna analiza @hr
preferred label: Išsami analizė @lt
type: WorkType
preferred label: Põhjalik analüüs @et
preferred label: Analiżi fil-fond @mt
preferred label: Εις βάθος ανάλυση @el
preferred label: Analisi approfondita @it
preferred label: Perusteellinen analyysi @fi
preferred label: Ausführliche Analyse @de
preferred label: Análise aprofundada @pt
preferred label: Részletes elemzés @hu
preferred label: Dybdegående analyse @da
deprecated: false
preferred label: Hĺbková analýza @sk
preferred label: Fördjupad analys @sv

EP plenary report
type: Concept
preferred label: Relazione di seduta del PE @it
preferred label: Raport Euroopa Parlamendi täiskogule @et
alternative label: Betänkande framlagt för Europaparlamentets plenarsammanträde @sv
broader: Report
preferred label: Tuarascáil iomlánach Pharlaimint na hEorpa @ga
alternative label: Rapport imressaq għall-plenarja tal-PE @mt
definition: Text drawn up by a member, a group of members or a parliamentary committee on a subject in a view of a debate and a vote by the European Parliament plenary.
preferred label: Έκθεση της ολομέλειας του ΕΚ @el
alternative label: Sprawozdanie złożone na sesję plenarną PE @pl
alternative label: Informe presentado al Pleno del PE @es
in scheme: EP taxonomy on document types.
preferred label: EP plenārsēdes ziņojums @lv
alternative label: Η έκθεση κατατέθηκε στην ολομέλεια του ΕΚ @el
alternative label: Доклад, внесен за пленарната сесия на ЕП @bg
preferred label: Betænkning til behandling på EP's plenarmøde @da
preferred label: Доклад от пленарното заседание на ЕП @bg
alternative label: Mietintö jätetty EP:n täysistuntoon @fi
alternative label: Betænkning indgivet til EP's plenarforsamling @da
preferred label: Poročilo o plenarnem zasedanju Evropskega parlamenta @sl
preferred label: EP:n täysistuntomietintö @fi
preferred label: Rapport de plénière du Parlement Européen @fr
preferred label: Verslag voor de plenaire vergadering van het EP @nl
alternative label: Zpráva předložená na plenárním zasedání EP @cs
alternative label: Euroopa Parlamendi täiskogule esitatud raport @et
deprecated: false
alternative label: Pranešimas pateiktas EP plenarinei sesijai @lt
preferred label: Betänkande för behandling vid parlamentets plenarsammanträde @sv
alternative label: Tuarascáil curtha síos do sheisiún iomlánach Pharlaimint na hEorpa @ga
alternative label: Report tabled for EP plenary
alternative label: Poročilo predloženo za plenarno zasedanje EP @sl
alternative label: Izvješće podneseno na plenarnoj sjednici EP-a @hr
alternative label: Ziņojums iesniegts EP plenārsēdei @lv
preferred label: Sprawozdanie na posiedzenie plenarne PE @pl
alternative label: A jelentés előterjesztése az EP plenáris ülésére @hu
preferred label: Relatório da sessão plenária do PE @pt
preferred label: Izvješće s plenarne sjednice EP-a @hr
alternative label: Für die Sitzung des EP vorgelegter Bericht @de
alternative label: Verslag ingediend voor de plenaire vergadering van het EP @nl
preferred label: Az EP plenáris ülése elé terjesztett jelentés @hu
type: WorkType
preferred label: EP plenarinio posėdžio pranešimas @lt
alternative label: Relazione presentata per la plenaria del PE @it
preferred label: Rapport tal-plenarja tal-PE @mt
alternative label: Rapport déposé pour la plénière du PE @fr
alternative label: Správa predložená na plenárne zasadnutie EP @sk
alternative label: Raport depus pentru sesiunea plenară a PE @ro
preferred label: Dem Plenum des EP vorgelegter Bericht @de
preferred label: Zpráva z plenárního zasedání EP @cs
preferred label: Správa z plenárneho zasadnutia EP @sk
preferred label: Raport adoptat în plenul PE @ro
preferred label: Informe del Pleno del Parlamento Europeo @es
created: 2023-10-31
alternative label: Relatório apresentado na sessão plenária do PE @pt

Official Journal
type: Concept
top concept of: EP taxonomy on document types.
preferred label: Официален вестник @bg
preferred label: Ġurnal Uffiċjali @mt
created: 2023-10-31
preferred label: Oficialusis leidinys @lt
preferred label: Iris Oifigiúil @ga
preferred label: Úradný vestník @sk
preferred label: Jurnalul Oficial @ro
preferred label: Oficiālais Vēstnesis @lv
preferred label: Uradni list @sl
preferred label: EU:s officiella tidning @sv
preferred label: Euroopa Liidu Teataja @et
preferred label: Publicatieblad @nl
preferred label: Journal officiel @fr
preferred label: EU-Tidende @da
preferred label: Gazzetta ufficiale @it
preferred label: Επίσημη Εφημερίδα @el
in scheme: EP taxonomy on document types.
preferred label: Dziennik Urzędowy @pl
preferred label: Službeni list @hr
preferred label: Jornal Oficial @pt
preferred label: Virallinen lehti @fi
definition: Official gazette publishing daily the core part of the EU law.
preferred label: Amstblatt @de
deprecated: false
preferred label: Diario Oficial @es
preferred label: Úřední věstník @cs
preferred label: Hivatalos Lap @hu

Corrigendum
type: WorkType
preferred label: Ispravak @hr
preferred label: Parandus @et
preferred label: Rectificare @ro
preferred label: Berigtigelse @da
broader: Annex
preferred label: Retificação @pt
preferred label: Helyesbítés @hu
preferred label: Korigendum @sk
preferred label: Sprostowanie @pl
preferred label: Popravek @sl
definition: Document presenting the corrections to be read in a text.
preferred label: Поправка @bg
preferred label: Berichtigung @de
preferred label: Rettifica @it
preferred label: Klaidų ištaisymas @lt
preferred label: Rättelse @sv
in scheme: EP taxonomy on document types.
type: Concept
preferred label: Rectificatie @nl
preferred label: Oprava @cs
deprecated: false
preferred label: Rectificatif @fr
created: 2023-10-31
preferred label: Ceartúchán @ga
preferred label: Corrección de errores @es
preferred label: Διορθωτικό @el
preferred label: Rettifika @mt
preferred label: Kļūdu labojums @lv
preferred label: Oikaisu @fi

Written question
type: WorkType
preferred label: Pismeno pitanje @hr
preferred label: Rakstisks jautājums @lv
preferred label: Pregunta escrita @es
preferred label: Písomná otázka @sk
in scheme: EP taxonomy on document types.
preferred label: Pergunta escrita @pt
deprecated: false
alternative label: Questions écrites @fr
preferred label: Interrogazione scritta @it
preferred label: Pisno vprašanje @sl
alternative label: Schriftliche Anfragen @de
created: 2023-10-31
alternative label: Írásbeli kérdések @hu
preferred label: Skriftlig forespørgsel @da
preferred label: Mistoqsija bil-miktub @mt
preferred label: Question écrite @fr
alternative label: Perguntas escritas @pt
preferred label: Kirjalik küsimus @et
preferred label: Întrebare scrisă @ro
preferred label: Писмен въпрос @bg
broader: EP question and interpellation
definition: Question in a written form.
alternative label: Preguntas escritas @es
preferred label: Skriftlig fråga @sv
preferred label: Ceist scríofa @ga
preferred label: Schriftliche Anfrage @de
preferred label: Písemný dotaz @cs
alternative label: Pismena pitanja @hr
preferred label: Schriftelijke vraag @nl
preferred label: Pisemne zapytanie @pl
type: Concept
alternative label: Written questions
preferred label: Γραπτή ερώτηση @el
preferred label: Klausimas raštu @lt
preferred label: Kirjallinen kysymys @fi
preferred label: Írásbeli kérdés @hu

Parliamentary committee opinion in the form of a letter
type: WorkType
in scheme: EP taxonomy on document types.
definition: Statement given in form of a letter by a parliamentary committee for opinion to the responsible committee.
preferred label: Становище на парламентарна комисия под формата на писмо @bg
preferred label: Mišljenje parlamentarnog odbora u obliku pisma @hr
preferred label: Aviz sub formă de scrisoare al comisiei parlamentare @ro
preferred label: Udtalelse i form af en skrivelse fra et parlamentarisk udvalg @da
preferred label: Valiokunnan lausunto kirjeen muodossa @fi
preferred label: Opinia komisji parlamentarnej w formie pisma @pl
preferred label: Yttrande i form av en skrivelse från ett parlamentsutskott @sv
type: Concept
preferred label: Parlamenti bizottság levél formájában megfogalmazott véleménye @hu
preferred label: Γνωμοδότηση κοινοβουλευτικής επιτροπής υπό μορφή επιστολής @el
preferred label: Parecer sob a forma de carta de uma comissão parlamentar @pt
preferred label: Opinión en forma de carta de comisión parlamentaria @es
preferred label: Parlamendikomisjoni kirja vormis esitatav arvamus @et
deprecated: false
preferred label: Stellungnahme eines parlamentarischen Ausschusses in Form eines Schreibens @de
broader: Opinion
preferred label: Parlamenta komitejas atzinums vēstules veidā @lv
preferred label: Stanovisko parlamentného výboru vo forme listu @sk
preferred label: Stanovisko parlamentního výboru ve formě dopisu @cs
preferred label: Parere sotto forma di lettera di una commissione parlamentare @it
preferred label: Ontwerpadvies in briefvorm van een parlementaire commissie @nl
created: 2023-10-31
preferred label: Tuairim ó Choiste Parlaiminteach i bhfoirm litreach @ga
preferred label: Opinjoni fil-forma ta’ ittra ta’ Kumitat Parlamentari @mt
preferred label: Opinion sous forme de lettre de commission parlementaire @fr
preferred label: Parlamento komiteto nuomonė laiško forma @lt
preferred label: Mnenje parlamentarnega odbora v obliki pisma @sl

Parliamentary committee opinion on the recasting technique
type: WorkType
deprecated: false
preferred label: Parlamento komiteto nuomonė dėl išdėstymo nauja redakcija metodo @lt
preferred label: Opinión de las comisiones parlamentarias sobre la técnica de la refundición @es
preferred label: Mnenje parlamentarnega odbora o tehniki prenovitve @sl
in scheme: EP taxonomy on document types.
preferred label: Parlamendikomisjoni arvamus uuesti sõnastamise tehnika kohta @et
preferred label: Opinia komisji parlamentarnej w sprawie techniki przekształcania @pl
preferred label: Opinjoni tal-kumitat parlamentari dwar it-teknika tar-riformulazzjoni @mt
definition: Statement about the procedure's recasting technique given by the JURI committee for opinion to the responsible committee.
preferred label: Avis de la commission parlementaire sur la technique de refonte @fr
preferred label: Udtalelse fra Europa-Parlamentets udvalg om omarbejdningsteknikken @da
type: Concept
created: 2025-09-30
preferred label: Tuairim ón gcoiste parlaiminteach maidir le teicníc an athmhúnlaithe @ga
preferred label: Advies van de parlementaire commissie over de herschikking @nl
preferred label: Parecer da comissão parlamentar sobre a técnica de reformulação @pt
broader: Opinion
preferred label: Parere della commissione parlamentare sulla tecnica di rifusione @it
preferred label: Avizul comisiei parlamentare privind tehnica de reformare @ro
preferred label: Становище на парламентарната комисия относно техниката за преработване @bg
preferred label: Parlamentin valiokunnan lausunto uudelleenlaatimistekniikasta @fi
preferred label: Parlamenta komitejas atzinums par pārstrādāšanas metodi @lv
preferred label: Γνωμοδότηση της κοινοβουλευτικής επιτροπής σχετικά με την τεχνική της αναδιατύπωσης @el
preferred label: A parlamenti bizottság véleménye az átdolgozási technikáról @hu
preferred label: Stanovisko parlamentného výboru k technike prepracovania @sk
preferred label: Parlamentsutskottets yttrande om omarbetningstekniken @sv
preferred label: Stanovisko parlamentního výboru k metodě přepracování @cs
preferred label: Stellungnahme des Parlamentsausschusses zur Technik der Neufassung @de
preferred label: Mišljenje parlamentarnog odbora o tehnici preinake @hr

Papildinājums
type: Concept
preferred label: Добавка @bg
preferred label: Addendum
preferred label: Papildymas @lt
preferred label: Dodatek @sl
in scheme: EP taxonomy on document types.
deprecated: false
preferred label: Aguisín @ga
created: 2024-07-01
preferred label: Προσθήκη @el
preferred label: Dopuna @hr
broader: Annex
preferred label: Dodatok @sk
definition: Document presenting the corrections to be read in a text.
preferred label: Lisäys @fi
preferred label: Adenda @pt
preferred label: Kiegészítés @hu

Estimates of the European Parliament for the financial year
type: Concept
preferred label: Etat buadgétaire prévisionnel du Parlement Européen @fr
preferred label: Odhad příjmů a výdajů Evropského parlamentu na rozpočtový rok @cs
preferred label: Haushaltsvoranschlag des Europäischen Parlaments für das Haushaltsjahr @de
type: WorkType
preferred label: Procjena Europskog parlamenta za financijsku godinu @hr
in scheme: EP taxonomy on document types.
preferred label: Eiropas Parlamenta tāme finanšu gadam @lv
preferred label: Europa-Parlamentets overslag for regnskabsåret @da
preferred label: Raming van het Europees Parlement voor het begrotingsjaar @nl
broader: Annex
deprecated: false
preferred label: Az Európai Parlament tervezett költségvetése a pénzügyi évre @hu
preferred label: Meastacháin Pharlaimint na hEorpa don bhliain airgeadais @ga
preferred label: Europaparlamentets budgetberäkning för budgetåret @sv
preferred label: Euroopan parlamentin ennakkoarvio varainhoitovuodeksi @fi
preferred label: Estimi tal-Parlament Ewropew għas-sena finanzjarja @mt
preferred label: Euroopa Parlamendi eelarvestus eelarveaastaks @et
created: 2023-10-31
preferred label: Бюджетна прогноза на Европейския парламент за финансовата година @bg
preferred label: Previsão de receitas e despesas do Parlamento Europeu para o exercício @pt
preferred label: Preliminarz budżetowy Parlamentu Europejskiego na rok budżetowy @pl
definition: Plenary annex on provisional budget of the European Parliament.
preferred label: Stato di previsione del Parlamento europeo per l'esercizio @it
preferred label: Estimarea bugetului Parlamentului European pentru exercițiul financiar @ro
preferred label: Europos Parlamento finansinių metų sąmata @lt
preferred label: Estado de previsiones del Parlamento Europeo para el ejercicio @es
preferred label: Načrt prihodkov in odhodkov Evropskega parlamenta za proračunsko leto @sl
preferred label: Odhad rozpočtu Európskeho parlamentu na rozpočtový rok @sk
preferred label: Κατάσταση προβλέψεων του Ευρωπαϊκού Κοινοβουλίου για το οικονομικό έτος @el

Parliamentary committee agenda
type: WorkType
preferred label: Dnevni red parlamentarnega odbora @sl
preferred label: Дневен ред на парламентарна комисия @bg
preferred label: Ordem do dia de uma comissão parlamentar @pt
preferred label: Aġenda ta’ Kumitat Parlamentari @mt
deprecated: false
preferred label: Clár oibre Coiste Pharlaimintigh @ga
preferred label: Valiokunnan esityslista @fi
preferred label: Pořad jednání parlamentního výboru @cs
type: Concept
preferred label: Föredragningslista för ett utskottssammanträde @sv
preferred label: Porządek dzienny posiedzenia komisji parlamentarnej @pl
preferred label: Ημερήσια διάταξη κοινοβουλευτικής επιτροπής @el
definition: Agenda of a parliamentary committee meeting.
preferred label: Ordine de zi a comisiei parlamentare @ro
preferred label: Dnevni red parlamentarnog odbora @hr
preferred label: Parlamenta komitejas darba kārtība @lv
preferred label: Parlamenti bizottság ülésének napirendje @hu
preferred label: Parlamento komiteto posėdžio darbotvarkė @lt
preferred label: Agenda voor een vergadering van een parlementaire commissie @nl
preferred label: Parlamendikomisjoni koosoleku päevakord @et
preferred label: Agenda de commission parlementaire @fr
preferred label: Tagesordnung eines parlamentarischen Ausschusses @de
preferred label: Orden del día de comisión parlamentaria @es
in scheme: EP taxonomy on document types.
preferred label: Program rokovania parlamentného výboru @sk
preferred label: Dagsorden for et parlamentarisk udvalg @da
preferred label: Ordine del giorno di una commissione parlamentare @it
created: 2023-10-31
broader: Tagesordnung

Proposal for an Union Act
type: Concept
preferred label: Wniosek dotyczący aktu prawnego Unii @pl
preferred label: Propuesta de Acta de la Unión @es
preferred label: Pasiūlymas dėl Sąjungos akto @lt
preferred label: Predlog akta Unije @sl
preferred label: Návrh aktu Unie @cs
preferred label: Proposta għal Att tal-Unjoni @mt
created: 2025-10-31
preferred label: Vorschlag für einen Rechtsakt der Union @de
preferred label: Ehdotus unionin säädökseksi @fi
preferred label: Návrh aktu Únie @sk
definition: Proposal for an Union Act.
broader: Resolution
preferred label: Voorstel voor een handeling van de Unie @nl
preferred label: Ettepanek võtta vastu liidu õigusakt @et
preferred label: Propunere de act al Uniunii @ro
preferred label: Togra le haghaidh Gníomh Aontais @ga
preferred label: Savienības akta priekšlikums @lv
deprecated: true
preferred label: Proposta di atto dell'Unione @it
preferred label: Förslag till unionsakt @sv
preferred label: Prijedlog akta Unije @hr
type: WorkType
preferred label: Предложение за акт на Съюза @bg
preferred label: Πρόταση πράξης της Ένωσης @el
in scheme: EP taxonomy on document types.
preferred label: Forslag til EU-retsakt @da
preferred label: Proposta de ato da União @pt
preferred label: Uniós jogi aktusra irányuló javaslat @hu
preferred label: Proposition d'acte de l'Union @fr

EP plenary sitting result of a vote
type: Concept
preferred label: Uitslag van de stemming in de plenaire vergadering van het EP @nl
narrow match: PLENARY VOTES RESULTS EP
preferred label: Výsledok hlasovania na plenárnej schôdzi EP @sk
preferred label: Αποτέλεσμα ψηφοφορίας στην ολομέλεια του ΕΚ @el
preferred label: Резултат от гласуването на пленарно заседание на ЕП @bg
preferred label: Resultatet av en omröstning vid Europaparlamentets plenarsammanträde @sv
preferred label: Rezultatul votului în plen al PE @ro
created: 2023-10-31
preferred label: Euroopa Parlamendi täiskogu istungi hääletustulemus @et
preferred label: Resultado de uma votação na sessão plenária do PE @pt
preferred label: Izid glasovanja na plenarnem zasedanju EP @sl
preferred label: Az EP plenáris ülésének eredménye szavazás @hu
preferred label: Riżultat ta’ votazzjoni fis-seduta plenarja tal-PE @mt
broader: Minutes
preferred label: Suí iomlánach na Parlaiminte mar thoradh ar vótáil @ga
preferred label: Résultat d’un vote en séance plénière du PE @fr
preferred label: Resultat af en afstemning på plenarmødet i EP @da
preferred label: Výsledek hlasování na plenárním zasedání EP @cs
preferred label: Ep:n täysistunnon äänestystulos @fi
deprecated: false
preferred label: Resultado de la votación en sesión plenaria del PE @es
preferred label: Esito di una votazione in seduta plenaria del PE @it
preferred label: Ergebnis einer Abstimmung im Plenum des EP @de
preferred label: Rezultat glasovanja na plenarnoj sjednici EP-a @hr
preferred label: EP plenārsēdes balsojuma rezultāts @lv
definition: Result of a vote in the written record of a plenary sitting of the European Parliament.
preferred label: EP plenarinio posėdžio rezultatai @lt
preferred label: Wynik głosowania na posiedzeniu plenarnym PE @pl
in scheme: EP taxonomy on document types.

EP plenary sitting agenda
type: Concept
preferred label: EP plenarinio posėdžio darbotvarkė @lt
preferred label: Agenda van de plenaire vergadering van het EP @nl
preferred label: Agenda della seduta plenaria del PE @it
in scheme: EP taxonomy on document types.
preferred label: Dnevni red dnevne plenarne sjednice EP-a @hr
preferred label: Porządek dzienny posiedzenia plenarnego PE @pl
preferred label: EP:n täysistunnon esityslista @fi
preferred label: Дневен ред на пленарно заседание на ЕП @bg
preferred label: Ordinea de zi a ședinței plenare a PE @ro
preferred label: Aġenda tas-seduta plenarja tal-PE @mt
definition: European Parliament plenary sitting agenda.
preferred label: EP täiskogu istungi päevakord @et
broader: Tagesordnung
preferred label: Orden del día de la sesión plenaria del PE @es
preferred label: Pořad jednání plenárního zasedání EP @cs
preferred label: Föredragningslista för EP plenarsammanträden @sv
preferred label: EP plenáris ülésnap napirendje @hu
preferred label: EP plenārsēdes darba kārtība @lv
preferred label: Clár oibre do shuí iomlánach PE @ga
deprecated: false
preferred label: PE ordre du jour quotidien de la plénière @fr
created: 2023-10-31
preferred label: Ordem do dia da sessão diária plenária do PE @pt
preferred label: Program plenárneho rokovania EP @sk
preferred label: Dnevni red plenarne seje EP @sl
preferred label: Ημερήσια διάταξη συνεδρίασης της Ολομέλειας του ΕΚ @el
preferred label: EP-mødeperiodedagsorden @da
type: WorkType
preferred label: Tagesordnung der Plenarsitzung des EP @de

Amendments to the draft general budget of the European Union
type: Concept
preferred label: Emendi għall-abbozz tal-baġit ġenerali tal-Unjoni Ewropea @mt
preferred label: Τροποποιήσεις στο σχέδιο γενικού προϋπολογισμού της ευρωπαϊκής Ένωσης @el
preferred label: Ændringer til forslaget til Den Europæiske Unions almindelige budget @da
definition: Plenary annex containing amendments to the draft general budget of the European Union.
preferred label: Alterações ao projeto de orçamento geral da União Europeia @pt
preferred label: Euroopa Liidu üldeelarve projekti muudatused @et
preferred label: Abänderungsentwürfe zum Entwurf des Gesamthaushaltsplans der Europäischen Union @de
type: WorkType
in scheme: EP taxonomy on document types.
preferred label: Izmjene nacrta općeg proračuna Europske unije @hr
preferred label: Poprawki do projektu budżetu ogólnego Unii Europejskiej @pl
preferred label: Zmeny návrhu všeobecného rozpočtu Európskej únie @sk
preferred label: Grozījumi Eiropas Savienības vispārējā budžeta projektā @lv
broader: Amendment
preferred label: Emendamenti al progetto di bilancio generale dell'Unione europea @it
preferred label: Изменения на проекта на общ бюджет на Европейския съюз @bg
broader: Annex
created: 2023-10-31
preferred label: Europos Sąjungos bendrojo biudžeto projekto pakeitimai @lt
preferred label: Spremembe predloga splošnega proračuna Evropske unije @sl
preferred label: Az Európai Unió általános költségvetési tervezetének módosításai @hu
preferred label: Ändringar av förslaget till Europeiska unionens allmänna budget @sv
deprecated: false
preferred label: Změny návrhu souhrnného rozpočtu Evropské unie @cs
preferred label: Amendements au projet de budget général de l'union européenne @fr
preferred label: Enmiendas al proyecto de presupuesto general de la Unión Europea @es
preferred label: Tarkistukset esitykseen Euroopan unionin yleiseksi talousarvioksi @fi
preferred label: Amendamente la proiectul de buget general al Uniunii Europene @ro
preferred label: Leasuithe ar dhréachtbhuiséad ginearálta an Aontais Eorpaigh @ga
preferred label: Wijzigingen van het ontwerp van algemene begroting van de Europese Unie @nl

Written declaration
type: Concept
preferred label: Kirjalik deklaratsioon @et
preferred label: Pisana izjava @hr
preferred label: Schriftliche Erklärung @de
definition: Official statement in written form.
preferred label: Declaración por escrito @es
preferred label: Pisemna deklaracja @pl
preferred label: Rašytinė deklaracija @lt
preferred label: Declarație scrisă @ro
preferred label: Rakstiska deklarācija @lv
preferred label: Писмена декларация @bg
preferred label: Déclaration écrite @fr
preferred label: Písemné prohlášení @cs
created: 2023-10-31
preferred label: Declaração escrita @pt
deprecated: false
preferred label: Pisna izjava @sl
preferred label: Skriftlig erklæring @da
preferred label: Γραπτή δήλωση @el
in scheme: EP taxonomy on document types.
preferred label: Písomné vyhlásenie @sk
preferred label: Skriftlig förklaring @sv
preferred label: Dichiarazione scritta @it
preferred label: Írásbeli nyilatkozat @hu
preferred label: Dikjarazzjoni bil-miktub @mt
broader: Declaration
preferred label: Kirjallinen ilmoitus @fi
preferred label: Dearbhú i scríbhinn @ga
preferred label: Schriftelijke verklaring @nl

Declaration
type: Concept
preferred label: Izjava @sl
preferred label: Deklaracija @lt
definition: Official statement.
preferred label: Declaração @pt
preferred label: Förklaring @sv
preferred label: Dichiarazione @it
preferred label: Deklarácia @sk
preferred label: Dearbhú @ga
preferred label: Déclaration @fr
deprecated: false
preferred label: Nyilatkozat @hu
preferred label: Verklaring @nl
preferred label: Erklärung @de
created: 2023-10-31
preferred label: Deklarace @cs
preferred label: Dikjarazzjoni @mt
preferred label: Julistus @fi
preferred label: Erklæring @da
preferred label: Declaración @es
preferred label: Declarație @ro
top concept of: EP taxonomy on document types.
in scheme: EP taxonomy on document types.
preferred label: Декларация @bg
preferred label: Δήλωση @el
preferred label: Deklaracja @pl
preferred label: Deklarācija @lv
preferred label: Deklaratsioon @et

Draft decision
type: Concept
preferred label: Proyecto de decisión @es
preferred label: Projet de décision @fr
preferred label: Проектопредложение @bg
preferred label: Nacrt odluke @hr
created: 2023-10-31
preferred label: Návrh rozhodnutia @sk
preferred label: Sprendimo projektas @lt
preferred label: Otsuse eelnõu @et
preferred label: Ontwerpbesluit @nl
preferred label: Osnutek sklepa @sl
preferred label: Határozattervezet @hu
preferred label: Abbozz ta' deċiżjoni @mt
deprecated: false
preferred label: Dréachtchinneadh @ga
preferred label: Progetto di decisione @it
in scheme: EP taxonomy on document types.
preferred label: Entwurf eines Beschlusses @de
preferred label: Lēmuma projekts @lv
preferred label: Projekt decyzji @pl
preferred label: Udkast til afgørelse @da
definition: Draft text binding on those to whom it is addressed and is directly applicable.
preferred label: Σχέδιο απόφασης @el
preferred label: Project de decizie @ro
broader: Decision
preferred label: Projeto de decisão @pt
preferred label: Päätösluonnos @fi
preferred label: Předloha rozhodnutí @cs
preferred label: Utkast till beslut @sv

Oral question
type: WorkType
preferred label: Pregunta oral @es
preferred label: Προφορική ερώτηση @el
preferred label: Устен въпрос @bg
alternative label: Usmena pitanja @hr
alternative label: Mündliche Anfragen @de
preferred label: Interrogazione orale @it
alternative label: Questions orales @fr
preferred label: Mondelinge vraag @nl
alternative label: Perguntas orais @pt
preferred label: Question orale @fr
alternative label: Preguntas orales @es
preferred label: Ceist ó bhéal @ga
preferred label: Szóbeli kérdés @hu
preferred label: Ústna otázka @sk
preferred label: Mutisks jautājums @lv
preferred label: Pergunta oral @pt
created: 2023-10-31
preferred label: Întrebare orală @ro
alternative label: Szóbeli kérdések @hu
type: Concept
broader: EP question and interpellation
preferred label: Klausimas žodžiu @lt
in scheme: EP taxonomy on document types.
preferred label: Slovní dotaz @cs
preferred label: Suullinen kysymys @fi
alternative label: Oral questions
preferred label: Mundtlig forespørgsel @da
deprecated: false
preferred label: Ustne zapytanie @pl
preferred label: Usmeno pitanje @hr
definition: Oral question tabled to the plenary of the European Parliament.
preferred label: Muntlig fråga @sv
preferred label: Mündliche Anfrage @de
preferred label: Mistoqsija orali @mt
preferred label: Ustno vprašanje @sl
preferred label: Suuline küsimus @et

EP plenary amendment
type: Concept
deprecated: false
preferred label: Amendement en plénière du PE @fr
definition: Amendment tabled to the European Parliament plenary.
preferred label: Amandman na plenarnoj sjednici EP-a @hr
preferred label: Изменение на пленарната сесия на ЕП @bg
preferred label: Az EP plenáris ülésének módosítása @hu
preferred label: Amendement voor de plenaire vergadering van het EP @nl
preferred label: Predlog spremembe na plenarnem zasedanju EP @sl
preferred label: Alteração em sessão plenária do PE @pt
preferred label: Amendamentul în plen al PE @ro
preferred label: Ændringsforslag fra EP's plenarforsamling @da
in scheme: EP taxonomy on document types.
preferred label: Τροπολογία στην ολομέλεια του ΕΚ @el
broader: Amendment
preferred label: Změna na plenárním zasedání EP @cs
preferred label: Ändringsförslag vid Europaparlamentets plenarsammanträde @sv
preferred label: Euroopa Parlamendi täiskogu muudatusettepanek @et
preferred label: Pozmeňujúci a doplňujúci návrh EP na plenárnej schôdzi @sk
created: 2023-10-31
preferred label: Emendamento in plenaria del PE @it
preferred label: Leasú i suí iomlánach PE @ga
preferred label: Emenda tal-plenarja tal-PE @mt
preferred label: EP plenarinio posėdžio pakeitimas @lt
preferred label: Ep:n täysistuntotarkistus @fi
preferred label: Abänderung des EP-Plenums @de
preferred label: Enmienda del Pleno del PE @es
preferred label: Poprawka PE na posiedzeniu plenarnym @pl
preferred label: EP plenārsēdes grozījums @lv

Parliamentary committee opinion on the legal basis
type: Concept
preferred label: Parere della commissione parlamentare sulla base giuridica @it
preferred label: Stellungnahme des Parlamentsausschusses zur Rechtsgrundlage @de
preferred label: Mnenje parlamentarnega odbora o pravni podlagi @sl
preferred label: Parlamentsutskottets yttrande om den rättsliga grunden @sv
preferred label: Tuairim ón gcoiste parlaiminteach maidir leis an mbunús dlí @ga
preferred label: A parlamenti bizottság véleménye a jogalapról @hu
preferred label: Opinia komisji parlamentarnej w sprawie podstawy prawnej @pl
preferred label: Parlamenta komitejas atzinums par juridisko pamatu @lv
preferred label: Parlamendikomisjoni arvamus õigusliku aluse kohta @et
preferred label: Parecer da comissão parlamentar sobre a base jurídica @pt
broader: Opinion
preferred label: Opinjoni tal-kumitat parlamentari dwar il-bażi legali @mt
preferred label: Avis de la commission parlementaire sur la base juridique @fr
preferred label: Становище на парламентарната комисия относно правното основание @bg
in scheme: EP taxonomy on document types.
created: 2025-08-31
deprecated: false
preferred label: Opinión de las comisiones parlamentarias sobre el fundamento jurídico @es
preferred label: Stanovisko parlamentního výboru k právnímu základu @cs
preferred label: Γνωμοδότηση της κοινοβουλευτικής επιτροπής σχετικά με τη νομική βάση @el
preferred label: Parlamento komiteto nuomonė dėl teisinio pagrindo @lt
preferred label: Parlamentin valiokunnan lausunto oikeusperustasta @fi
preferred label: Avizul comisiei parlamentare privind temeiul juridic @ro
preferred label: Mišljenje parlamentarnog odbora o pravnoj osnovi @hr
definition: Statement about the procedure's legal basis given by the JURI committee for opinion to the responsible committee.
preferred label: Parlamentsudvalgets udtalelse om retsgrundlaget @da
type: WorkType
preferred label: Advies van de parlementaire commissie over de rechtsgrondslag @nl
preferred label: Stanovisko parlamentného výboru k právnemu základu @sk

Draft recommendation
type: Concept
preferred label: Udkast til henstilling @da
preferred label: Předloha doporučení @cs
preferred label: Osnutek priporočil @sl
preferred label: Ieteikuma projekts @lv
broader: Recommendation
preferred label: Nacrt preporuke @hr
in scheme: EP taxonomy on document types.
preferred label: Rekomendacijos projektas @lt
preferred label: Utkast till rekommendation @sv
preferred label: Soovituse eelnõu @et
preferred label: Projet de recommandation @fr
preferred label: Progetto di raccomandazione @it
definition: Draft text allowing the institutions to make their views known and to suggest a line of action without imposing any legal obligation on those to whom it is addressed.
preferred label: Entwurf einer Empfehlung @de
preferred label: Ontwerpaanbeveling @nl
preferred label: Projeto de recomendação @pt
preferred label: Project de recomandare @ro
preferred label: Proyecto de recomendación @es
preferred label: Suositusluonnos @fi
preferred label: RAbbozz ta' rakkomandazzjoni @mt
created: 2023-10-31
preferred label: Dréachtmholadh @ga
preferred label: Ajánlástervezet @hu
preferred label: Návrh odporúčania @sk
deprecated: false
preferred label: Σχέδιο σύστασης @el
preferred label: Проектопрепоръка @bg
preferred label: Projetk zalecenia @pl

Factsheet
type: Concept
broader: EP supporting analysis
preferred label: Ficha informativa @es
type: WorkType
preferred label: Informativní přehled @cs
preferred label: Scheda informativa @it
preferred label: Informativni pregled @sl
preferred label: Teabeleht @et
preferred label: Informacijos suvestinė @lt
preferred label: Skeda informattiva @mt
preferred label: Faktu lapa @lv
preferred label: Informačný prehľad @sk
deprecated: false
preferred label: Infoblatt @de
preferred label: Tietokooste @fi
preferred label: Informativni članak @hr
in scheme: EP taxonomy on document types.
definition: Written document containing useful information and facts on a given topic.
preferred label: Bileog eolais @ga
preferred label: Fișă informativă @ro
preferred label: Ενημερωτικό δελτίο @el
created: 2023-10-31
preferred label: Информационен документ @bg
preferred label: Zestawienie informacji @pl
preferred label: Faktablad @da
preferred label: Tájékoztató @hu
preferred label: Fiche d’information @fr

At a glance study
type: Concept
preferred label: Iš pirmo žvilgsnio tyrimas @lt
preferred label: Με μια ματιά μελέτη @el
preferred label: En översiktsstudie @sv
preferred label: Na prvý pohľad štúdia @sk
preferred label: Mad-daqqa t’għajn, l-istudju @mt
created: 2024-02-21
preferred label: Tutkimukset yhdellä silmäyksellä @fi
preferred label: Lühiülevaade uuringust @et
preferred label: Auf einen Blick Studie @de
preferred label: Īsumā par pētījumu @lv
definition: Written document giving immediate information on a subject with only a quick look.
preferred label: Oversigtsundersøgelse @da
preferred label: Sracfhéachaint ar staidéar @ga
preferred label: Estudo de relance @pt
preferred label: Badanie na pierwszy rzut oka @pl
in scheme: EP taxonomy on document types.
deprecated: false
preferred label: En un coup d'œil étude @fr
preferred label: Pillantás a tanulmányra @hu
preferred label: In een oogopslag studie @nl
preferred label: Studiu pe scurt @ro
preferred label: De un vistazo estudio @es
preferred label: Studija na prvi pogled @hr
preferred label: С един поглед проучване @bg
type: WorkType
preferred label: Na první pohled studie @cs
preferred label: A colpo d'occhio studio @it
preferred label: Na kratko študija @sl
broader: EP supporting analysis

Declaration on appropriate behaviour
type: Concept
alternative label: Az Európai Parlament képviselőinek nyilatkozata a megfelelő magatartási kódexhez való csatlakozásukról @hu
broader: Members' declaration
preferred label: Декларация за подходящо поведение @bg
preferred label: Deklaracja o właściwym zachowaniu @pl
alternative label: Izjava zastupnika u Europskom parlamentu o pridržavanju Kodeksa primjerenog ponašanja @hr
deprecated: false
preferred label: Declaración sobre el comportamiento apropiado @es
alternative label: Dikjarazzjoni mill-Membri tal-Parlament Ewropew dwar l-adeżjoni tagħhom mal-kodiċi ta' mġiba xierqa @mt
alternative label: Vyhlásenie poslancov Európskeho parlamentu o ich dodržiavaní kódexu vhodného správania @sk
alternative label: Erklæring fra medlemmer af Europa-Parlamentet om deres tilslutning til adfærdskodeksen @da
alternative label: Декларация на членовете на Европейския парламент относно присъединяването им към кодекса за подходящо поведение @bg
alternative label: Dichiarazione dei deputati al Parlamento europeo sulla loro adesione al codice di condotta appropriata @it
preferred label: Dichiarazione sul comportamento appropriato @it
preferred label: Ilmoitus asianmukaisesta käyttäytymisestä @fi
preferred label: Nyilatkozat a megfelelő magatartásról @hu
alternative label: Verklaring van de leden van het Europees Parlement over hun gehechtheid aan de gedragscode @nl
preferred label: Δήλωση σχετικά με την κατάλληλη συμπεριφορά @el
alternative label: Δήλωση των βουλευτών του Ευρωπαϊκού Κοινοβουλίου σχετικά με την προσχώρησή τους στον κώδικα κατάλληλης συμπεριφοράς @el
preferred label: Dearbhú maidir le hiompar iomchuí @ga
in scheme: EP taxonomy on document types.
alternative label: Declarația deputaților în Parlamentul European privind aderarea lor la codul comportamentului adecvat @ro
alternative label: Euroopa Parlamendi liikmete deklaratsioon sobiva käitumise juhendi järgimise kohta @et
preferred label: Verklaring over passend gedrag @nl
preferred label: Deklaracija dėl tinkamo elgesio @lt
preferred label: Deklarācija par pienācīgu uzvedību @lv
preferred label: Izjava o primernem vedenju @sl
alternative label: Europos Parlamento narių deklaracija dėl jų prisijungimo prie tinkamo elgesio kodekso @lt
alternative label: Dearbhú ó Fheisirí de Pharlaimint na hEorpa maidir lena gcloí leis an gcód iompair iomchuí @ga
preferred label: Försäkran om lämpligt uppträdande @sv
alternative label: Déclaration des députés au Parlement européen sur leur adhésion au code de conduite approprié @fr
alternative label: Erklärung der Mitglieder des Europäischen Parlaments zur Einhaltung des Verhaltenskodex @de
preferred label: Prohlášení o vhodném chování @cs
preferred label: Erklärung über angemessenes Verhalten @de
preferred label: Déclaration sur le comportement approprié @fr
alternative label: Declaración de los diputados al Parlamento Europeo sobre su adhesión al código de conducta adecuada @es
preferred label: Declaração relativa ao comportamento adequado @pt
alternative label: Euroopan parlamentin jäsenten julistus heidän sitoutumisestaan asianmukaista käyttäytymistä koskeviin sääntöihin @fi
preferred label: Izjava o primjerenom ponašanju @hr
alternative label: Oświadczenie posłów do Parlamentu Europejskiego w sprawie przestrzegania kodeksu właściwego postępowania @pl
alternative label: Declaração dos deputados ao Parlamento Europeu sobre a sua adesão ao código de conduta @pt
definition: Document completed by Members to confirm their commitment to comply with the code of appropriate behaviour.
alternative label: Izjava poslancev Evropskega parlamenta o spoštovanju kodeksa primernega vedenja @sl
preferred label: Declarație privind comportamentul adecvat @ro
alternative label: Prohlášení poslanců Evropského parlamentu o jejich dodržování kodexu vhodného chování @cs
preferred label: Dikjarazzjoni dwar imġiba xierqa @mt
preferred label: Vyhlásenie o vhodnom správaní @sk
preferred label: Deklaratsioon sobiva käitumise kohta @et
alternative label: Eiropas Parlamenta deputātu deklarācija par pievienošanos pienācīgas uzvedības kodeksam @lv
preferred label: Erklæring om passende adfærd @da
alternative label: Förklaring från Europaparlamentets ledamöter om deras anslutning till uppförandekoden @sv
alternative label: Declaration by Members of the European Parliament on their adhesion to the code of appropriate behaviour
created: 2025-02-28

Speech
type: Concept
preferred label: Kõne @et
preferred label: Toespraak @nl
preferred label: Discurso @pt
preferred label: Puhe @fi
broader: EP plenary sitting verbatim report of proceedings
created: 2023-10-31
preferred label: Discurs @ro
preferred label: Реч @bg
in scheme: EP taxonomy on document types.
preferred label: Ομιλία @el
preferred label: Runa @lv
preferred label: Tale @da
preferred label: Projev @cs
preferred label: Przemówienie @pl
preferred label: Discours @fr
deprecated: false
preferred label: Beszéd @hu
definition: Speech in the European Parliament plenary sitting verbatim report of proceedings.
preferred label: Óráid @ga
preferred label: Diskors @mt
preferred label: Rede @de
preferred label: Govor @sl
preferred label: Pranešimas @lt
preferred label: Prejav @sk
preferred label: Discorso @it
preferred label: Tal @sv

EP plenary sitting verbatim report of proceedings
type: WorkType
created: 2023-10-31
in scheme: EP taxonomy on document types.
preferred label: EP:n täysistunnon sanatarkka istuntoselostus @fi
preferred label: EP plenarinio posėdžio stenograma @lt
preferred label: EP plenáris ülésnap szó szerinti jegyzőkönyve @hu
preferred label: Ausführlicher Bericht der Plenarsitzung des EP @de
preferred label: Pełne sprawozdanie z obrad w ramach posiedzenia plenarnego PE @pl
preferred label: PE compte-rendu in extenso de la plénière @fr
preferred label: Doslovný zápis z plenárneho rokovania EP @sk
preferred label: Doslovný záznam z plenárního zasedání EP @cs
preferred label: Dobesedni zapis plenarne seje EP @sl
preferred label: Πλήρη πρακτικά συζητήσεων της Ολομέλειας του ΕΚ @el
deprecated: false
preferred label: Acta literal de los debates de la sesión plenaria del PE @es
preferred label: Tuarascáil focal ar fhocal d'imeachtaí shuí iomlánach PE @ga
preferred label: Fullständigt förhandlingsreferat från EP plenarsammanträden @sv
preferred label: EP fuldstændigt forhandlingsreferat @da
preferred label: Doslovno izvješće rada dnevne plenarne sjednice EP-a @hr
preferred label: Пълен стенографски протокол от пленарно заседание на ЕП @bg
preferred label: Rapport verbatim tal-proċeduri tas-seduta plenarja tal-PE @mt
preferred label: EP plenārsēdes debašu stenogramma @lv
preferred label: Stenograma dezbaterilor din cadrul ședinței plenare a PE @ro
preferred label: Resoconto integrale delle discussioni in seduta plenaria del PE @it
preferred label: EP täiskogu istungi stenogramm @et
preferred label: Relato integral dos debates em sessão diária plenária do PE @pt
definition: European Parliament plenary sitting verbatim report of proceedings.
top concept of: EP taxonomy on document types.
type: Concept
preferred label: Volledig verslag van de beraadslagingen van de plenaire vergadering van het EP @nl

Amendments to the draft general budget of the European Union
type: WorkType
preferred label: Ändringar av förslaget till Europeiska unionens allmänna budget @sv
deprecated: false
definition: Amendment presented in its consolidated version.
preferred label: Alterações ao projeto de orçamento geral da União Europeia @pt
preferred label: Spremembe predloga splošnega proračuna Evropske unije @sl
preferred label: Euroopa Liidu üldeelarve projekti muudatused @et
preferred label: Emendamenti al progetto di bilancio generale dell'Unione europea @it
broader: Amendment
preferred label: Europos Sąjungos bendrojo biudžeto projekto pakeitimai @lt
in scheme: EP taxonomy on document types.
preferred label: Muutokset esitykseen Euroopan unionin yleiseksi talousarvioksi @fi
preferred label: Wijzigingen van het ontwerp van algemene begroting van de Europese Unie @nl
preferred label: Změny návrhu souhrnného rozpočtu Evropské unie @cs
type: Concept
preferred label: Ændringer til forslaget til Den Europæiske Unions almindelige budget @da
preferred label: Pozmeňujúce a doplňujúce návrhy k návrhu všeobecného rozpočtu Európskej únie @sk
narrow match: AMEND EP CMT
preferred label: Leasuithe ar dhréachtbhuiséad ginearálta an Aontais Eorpaigh @ga
preferred label: Amendements au projet de budget général de l'Union européenne @fr
preferred label: Az Európai Unió általános költségvetési tervezetének módosításai @hu
preferred label: Emendi għall-abbozz tal-baġit ġenerali tal-Unjoni Ewropea @mt
preferred label: Poprawki do projektu budżetu ogólnego Unii Europejskiej @pl
preferred label: Modificări ale proiectului de buget general al Uniunii Europene @ro
preferred label: Änderungen des Entwurfs des Gesamthaushaltsplans der Europäischen Union @de
preferred label: Enmiendas al proyecto de presupuesto general de la Unión Europea @es
preferred label: Grozījumi Eiropas Savienības vispārējā budžeta projektā @lv
preferred label: Τροποποιήσεις στο σχέδιο γενικού προϋπολογισμού της Ευρωπαϊκής Ένωσης @el
preferred label: Izmjene nacrta općeg proračuna Europske unije @hr
created: 2025-10-31
preferred label: Изменения на проекта на общ бюджет на Европейския съюз @bg

EP document C reference
type: Concept
preferred label: Numer C dokumentu PE @pl
created: 2023-10-31
preferred label: Sklicna številka na dokument C EP @sl
preferred label: Documento del PE referencia C @es
preferred label: EP C-dokumenthänvisning @sv
preferred label: Dokument tal-PE Referenza C @mt
preferred label: Riferimento C a documento del PE @it
in scheme: EP taxonomy on document types.
deprecated: false
preferred label: EP dokumento C nuoroda @lt
preferred label: PE document C référence @fr
broader: Document
preferred label: Αναφορά εγγράφου C του ΕΚ @el
preferred label: Referința C a documentului PE @ro
preferred label: C referentni broj EP-a @hr
preferred label: EP verwijzing C-document @nl
preferred label: Tagairt do dhoiciméad C de chuid PE @ga
preferred label: EP dokumendi C-viide @et
preferred label: Referência do documento C do PE @pt
preferred label: EP C-dokumenthenvisning @da
definition: European Parliament's reference for a document emitted by another institution.
preferred label: C-Dokument Verweis des EP @de
preferred label: Odkaz na C dokument EP @cs
preferred label: EP dokumentum C hivatkozási száma @hu
preferred label: EP:n asiakirjan C viite @fi
preferred label: Документ на ЕП с референтен номер C @bg
preferred label: Atsauce uz EP dokumentu C @lv

Parliamentary delegation minutes
type: Concept
preferred label: Miontuairiscí Toscaireachta Parlaimintí @ga
preferred label: Parlamento delegacijos posėdžio protokolas @lt
created: 2023-10-31
preferred label: Protokoll einer Sitzung einer parlamentarischen Delegation @de
preferred label: Procès-verbal de délégation parlementaire @fr
preferred label: Minuti ta’ Delegazzjoni Parlamentari @mt
broader: Minutes
preferred label: Parlamenta delegācijas protokols @lv
preferred label: Parlamendi delegatsiooni koosoleku protokoll @et
deprecated: false
preferred label: Valtuuskunnan pöytäkirja @fi
definition: Written record of a parliamentary delegation meeting.
preferred label: Parlamenti küldöttség ülésének jegyzőkönyve @hu
preferred label: Ata de uma delegação parlamentar @pt
preferred label: Zápis z jednání parlamentní delegace @cs
preferred label: Протокол от заседание на парламентарна делегация @bg
preferred label: Zápisnica parlamentnej delegácie @sk
preferred label: Notulen van een parlementaire delegatie @nl
preferred label: Πρακτικά κοινοβουλευτικής αντιπροσωπείας @el
preferred label: Processo verbale di una delegazione parlamentare @it
preferred label: Protokół posiedzenia delegacji parlamentarnej @pl
preferred label: Proces-verbal al delegației parlamentare @ro
preferred label: Acta de delegación parlamentaria @es
preferred label: Zapisnik parlamentarnog izaslanstva @hr
preferred label: Protokol fra et møde i en parlamentarisk delegation @da
in scheme: EP taxonomy on document types.
preferred label: Protokoll från ett delegationssammanträde @sv
preferred label: Zapisnik parlamentarne delegacije @sl

Notice to Members in the context of petitions
type: Concept
preferred label: Teade parlamendiliikmetele seoses petitsioonidega @et
preferred label: Oznámenie poslancom v súvislosti s petíciami @sk
created: 2025-10-31
preferred label: Съобщение до членовете на ЕП в контекста на петициите @bg
preferred label: Paziņojums deputātiem saistībā ar lūgumrakstiem @lv
preferred label: Communication aux députés dans le cadre des pétitions @fr
preferred label: Komunikat dla posłów w kontekście petycji @pl
in scheme: EP taxonomy on document types.
broader: Notice to Members
preferred label: Pranešimas Parlamento nariams, susijęs su peticijomis @lt
preferred label: Ilmoitus jäsenille vetoomusten yhteydessä @fi
preferred label: Közlemény a képviselők számára a petíciókkal összefüggésben @hu
preferred label: Meddelelse til medlemmerne i forbindelse med andragender @da
preferred label: Mitteilung an die Mitglieder im Zusammenhang mit Petitionen @de
preferred label: Meddelande till ledamöterna i samband med framställningar @sv
preferred label: Kennisgeving aan de leden in het kader van verzoekschriften @nl
preferred label: Comunicare către deputați în contextul petițiilor @ro
preferred label: Comunicazione ai deputati nel contesto delle petizioni @it
preferred label: Avviż lill-Membri fil-kuntest tal-petizzjonijiet @mt
deprecated: false
preferred label: Sdělení poslancům v souvislosti s peticemi @cs
preferred label: Obavijest zastupnicima u kontekstu predstavki @hr
preferred label: Comunicación a los diputados en el contexto de las peticiones @es
definition: Communication to Members in the context of petitions.
preferred label: Ανακοίνωση προς τους βουλευτές στο πλαίσιο των αναφορών @el
preferred label: Fógra do na Feisirí i gcomhthéacs achainíocha @ga
preferred label: Obvestilo poslancem v zvezi s peticijami @sl
preferred label: Comunicação aos deputados no contexto das petições @pt

Notice to Members
type: Concept
preferred label: Tájékoztatás a képviselők számára @hu
preferred label: Avviż lill-Membri @mt
deprecated: false
in scheme: EP taxonomy on document types.
preferred label: Съобщение до членовете на ЕП @bg
preferred label: Meddelelse til medlemmerne @da
preferred label: Pranešimas Parlamento nariams @lt
preferred label: Mitteilung an die Mitglieder @de
preferred label: Avis aux députés @fr
type: WorkType
preferred label: Comunicare către membri @ro
preferred label: Comunicación a los diputados @es
preferred label: Paziņojums deputātiem @lv
preferred label: Obvestilo poslancem @sl
preferred label: Teade parlamendiliikmetele @et
preferred label: Komunikat dla posłów @pl
broader: Document
created: 2025-10-31
preferred label: Ilmoitus jäsenille @fi
preferred label: Fógra do na Feisirí @ga
preferred label: Kennisgeving aan de leden @nl
preferred label: Oznámenie poslancom @sk
preferred label: Obavijest zastupnicima @hr
definition: Communication to Members.
preferred label: Comunicação aos Membros @pt
preferred label: Meddelande till ledamöterna @sv
preferred label: Ανακοίνωση προς τα μέλη @el
preferred label: Sdělení poslancům @cs
preferred label: Avviso ai deputati @it