Special Committee on Organised Crime, Corruption and Money Laundering
type: Concept
created: 2023-10-31
deprecated: true
alternative label: Organised Crime, Corruption and Money Laundering
alternative label: Organizovaná trestná činnost, korupce a praní peněz @cs
alternative label: Szervezett bűnözés, korrupció és pénzmosás @hu
alternative label: Organiseret Kriminalitet, Korruption og Hvidvaskning af Penge @da
alternative label: Организирана престъпност, корупция и изпиране на пари @bg
alternative label: Coireacht eagraithe, éilliú agus sciúradh airgid @ga
alternative label: Criminalità organizzata, corruzione e riciclaggio di denaro @it
alternative label: Georganiseerde misdaad, corruptie en witwassen @nl
alternative label: Crimă organizată, corupție și spălare de bani @ro
alternative label: Kuritegevus, korruptsioon ja rahapesu @et
alternative label: Criminalité organisée, corruption et blanchiment de capitaux @fr
alternative label: Delincuencia Organizada, Corrupción y Blanqueo de Dinero @es
alternative label: Il-kriminalità organizzata, il-korruzzjoni u l-ħasil tal-flus @mt
alternative label: Organisiertes Verbrechen, Korruption und Geldwäsche @de
alternative label: Organizirani kriminal, korupcija i pranje novca @hr
alternative label: Przestępczość zorganizowana, korupcja i pranie pieniędzy @pl
alternative label: Järjestäytynyt rikollisuus, korruptio ja rahanpesu @fi
alternative label: A Criminalidade Organizada, a Corrupção e o Branqueamento de Capitais @pt
alternative label: Organizuotas nusikalstamumas, korupcija ir pinigų plovimas @lt
alternative label: Organizovaná trestná činnosť,korupcia, pranie špinavých peňazí @sk
alternative label: Organizirani kriminal, korupcija in pranje denarja @sl
alternative label: Organiserad brottslighet, korruption och penningtvätt @sv
alternative label: Organizētā noziedzība, korupcija un naudas atmazgāšana @lv
alternative label: Οργανωμένο έγκλημα, διαφθορά και νομιμοποίηση εσόδων από εγκλήματα @el
broader: Special parliamentary committee
definition: Its purpose is both to study and analyse these criminal activities and to draw up a comprehensive, structured plan to combat the organised crime, mafias and criminal systems at EU level.
in scheme: EP taxonomy on entities.
preferred label: Specialusis kovos su organizuotu nusikalstamumu, korupcija ir pinigų plovimu komitetas @lt
preferred label: Osobitný výbor pre organizovanú trestnú činnosť, korupciu a pranie špinavých peňazí @sk
preferred label: Ειδική επιτροπή για το οργανωμένο έγκλημα, τη διαφθορά και τη νομιμοποίηση εσόδων από εγκληματικές ενέργειες @el
preferred label: Sonderausschuss gegen organisiertes Verbrechen, Korruption und Geldwäsche @de
preferred label: Bijzondere Commissie georganiseerde misdaad, corruptie en witwassen @nl
preferred label: Det Særlige Udvalg om Organiseret Kriminalitet, Korruption og Hvidvaskning af Penge @da
preferred label: Organiseeritud kuritegevuse, korruptsiooni ja rahapesu tõkestamise erikomisjon @et
preferred label: Särskilda utskottet för frågor om organiserad brottslighet, korruption och penningtvätt @sv
preferred label: Zvláštní výbor pro organizovanou trestnou činnost, korupci a praní peněz @cs
preferred label: Comissão Especial sobre a Criminalidade Organizada, a Corrupção e o Branqueamento de Capitais @pt
preferred label: A Szervezett Bűnözés, a Korrupció és a Pénzmosás Problémájával Foglalkozó Különbizottság @hu
preferred label: Komisja Specjalna ds. Przestępczości Zorganizowanej, Korupcji i Prania Pieniędzy @pl
preferred label: Commissione speciale sulla criminalità organizzata, la corruzione e il riciclaggio di denaro @it
preferred label: Commission spéciale sur la criminalité organisée, la corruption et le blanchiment de capitaux @fr
preferred label: Posebnega odbora za organizirani kriminal, korupcijo in pranje denarja @sl
preferred label: Īpašā komiteja organizētās noziedzības, korupcijas un naudas atmazgāšanas jautājumos @lv
preferred label: Kumitat speċjali dwar il-kriminalità organizzata, il-korruzzjoni u l-ħasil tal-flus @mt
preferred label: Posebni odbor za organizirani kriminal, korupciju i pranje novca @hr
preferred label: Comisión Especial sobre la Delincuencia Organizada, la Corrupción y el Blanqueo de Dinero @es
preferred label: An coiste speisialta um choireacht eagraithe, um éilliú agus um sciúradh airgid @ga
preferred label: Järjestäytynyttä rikollisuutta, korruptiota ja rahanpesua käsittelevä erityisvaliokunta @fi
preferred label: Comisia specială pentru crimă organizată, corupție și spălare de bani @ro
preferred label: Специална комисия по организираната престъпност, корупцията и изпирането на пари @bg

EU interinstitutional service
type: Concept
created: 2023-10-31
deprecated: false
alternative label: Servicii interinstituționale ale UE @ro
alternative label: Servicios interinstitucionales de la UE @es
alternative label: ES tarpinstitucinės tarnybos @lt
alternative label: Serviços interinstitucionais da UE @pt
alternative label: Servizzi interistituzzjonali tal-UE @mt
alternative label: Medziinštitucionálne služby EÚ @sk
alternative label: Διοργανικές υπηρεσίες της ΕΕ @el
alternative label: Međuinstitucijske usluge EU-a @hr
alternative label: Services interinstitutionnels de l’UE @fr
alternative label: Służby międzyinstytucjonalne UE @pl
alternative label: Interinstitutionele diensten van de EU @nl
alternative label: Medinstitucionalne službe EU @sl
alternative label: Servizi interistituzionali dell’UE @it
alternative label: EU:n toimielinten keskinäiset palvelut @fi
alternative label: EU interinstitutional services
alternative label: Interinstitutionelle Dienste der EU @de
alternative label: EU’s interinstitutionelle tjenester @da
alternative label: Междуинституционални служби на ЕС @bg
alternative label: ELi institutsioonidevahelised talitused @et
alternative label: ES starpiestāžu dienesti @lv
alternative label: EU intézményközi szolgálatok @hu
alternative label: Seirbhísí idirinstitiúideacha an Aontais Eorpaigh @ga
definition: Service administrated by the European Commission under governance of all the EU institutions.
in scheme: EP taxonomy on entities.
preferred label: EU:n toimielinten keskinäinen palvelu @fi
preferred label: Servizio interistituzionale dell’UE @it
preferred label: Interinstitutioneller Dienst der EU @de
preferred label: ELi institutsioonidevaheline talitus @et
preferred label: Service interinstitutionnel de l’UE @fr
preferred label: EU:s interinstitutionella tjänster @sv
preferred label: EU intézményközi szolgálat @hu
preferred label: Medziinštitucionálna služba EÚ @sk
preferred label: Serviço interinstitucional da UE @pt
preferred label: Seirbhís idirinstitiúideach AE @ga
preferred label: Servicio interinstitucional de la UE @es
preferred label: ES starpiestāžu dienests @lv
preferred label: Servizz interistituzzjonali tal-UE @mt
preferred label: Διοργανική υπηρεσία της ΕΕ @el
preferred label: Medinstitucionalna služba EU @sl
preferred label: EU’s interinstitutionelle tjeneste @da
preferred label: Međuinstitucijska služba EU-a @hr
preferred label: Serviciu interinstituțional al UE @ro
preferred label: ES tarpinstitucinė tarnyba @lt
preferred label: Interinstitutionele dienst van de EU @nl
preferred label: Interinstitucionální služby EU @cs
preferred label: Междуинституционална служба на ЕС @bg
preferred label: Służba międzyinstytucjonalna UE @pl
top concept of: EP taxonomy on entities.

Joint committee procedure - EMPL and FEMM
type: Concept
created: 2023-10-31
deprecated: false
alternative label: Joint EMPL - FEMM
alternative label: EMPL und FEMM @de
alternative label: Commissions conjointes EMPL - FEMM @fr
broader: Joint parliamentary committees
definition: Joint committee procedure - EMPL and FEMM.
in scheme: EP taxonomy on entities.
preferred label: Gemeinsames Ausschussverfahren - EMPL und FEMM @de
preferred label: Procédure avec commissions conjointes - EMPL et FEMM @fr

Joint committee procedure - AFET - DEVE - BUDG
type: Concept
created: 2023-10-31
deprecated: false
alternative label: AFET - DEVE - BUDG @de
alternative label: Joint AFET - DEVE - BUDG
alternative label: Commissions conjointes AFET - DEVE - BUDG @fr
broader: Joint parliamentary committees
definition: Joint committee procedure - AFET - DEVE - BUDG.
in scheme: EP taxonomy on entities.
preferred label: Procédure avec commissions conjointes - AFET - DEVE - BUDG @fr
preferred label: Gemeinsames Ausschussverfahren - AFET - DEVE - BUDG @de

Joint committee procedure - JURI and FEMM
type: Concept
created: 2023-10-31
deprecated: false
alternative label: JURI und FEMM @de
alternative label: Commissions conjointes JURI - FEMM @fr
alternative label: Joint JURI - FEMM
broader: Joint parliamentary committees
definition: Joint committee procedure - JURI and FEMM.
in scheme: EP taxonomy on entities.
preferred label: Procédure avec commissions conjointes - JURI et FEMM @fr
preferred label: Gemeinsames Ausschussverfahren - JURI und FEMM @de

Delegation for Northern cooperation and for relations with Switzerland and Norway and to the EU-Iceland Joint Parliamentary Committee and the European Economic Area (EEA) Joint Parliamentary Committee
type: Concept
created: 2023-10-31
deprecated: false
alternative label: EOG/EFTA i Północ @pl
alternative label: EWR/EFTA und der Norden @de
alternative label: EES/Efta och region Nord @sv
alternative label: ΕΟΧ/ΕΖΕΣ και Βορράς @el
alternative label: SEE/EFTA e il Nord @it
alternative label: SEE/AELS și Nordul @ro
alternative label: EEA/EFTA and the North
alternative label: EEZ/EBTA un ziemeļi @lv
alternative label: LEE/CSTE agus an Tuaisceart @ga
alternative label: EMP/EFTA ja põhjapoolsed riigid @et
alternative label: EØS/EFTA og Norden @da
alternative label: EEE/AELC y el Norte @es
alternative label: EEE/EFTA e o Norte @pt
alternative label: ЕИП/ЕАСТ и Север @bg
alternative label: EHP/EZVO a sever @sk
alternative label: EGT/EFTA és az északi országok @hu
alternative label: ETA/EFTA ja pohjoinen alue @fi
alternative label: EGP/EFTA i Sjever @hr
alternative label: EER/EVA en het Noorden @nl
alternative label: EEE/AELE et le Nord @fr
alternative label: EHP/ESVO a Sever @cs
alternative label: države EEA/EFTA in Sever @sl
alternative label: ŻEE/EFTA u t-Tramuntana @mt
alternative label: EEE / ELPA ir Šiaurė @lt
broader: Parliamentary delegation
definition: Delegation for Northern cooperation and for relations with Switzerland and Norway and to the EU-Iceland Joint Parliamentary Committee and the European Economic Area (EEA) Joint Parliamentary Committee.
in scheme: EP taxonomy on entities.
preferred label: Delegazione per la cooperazione settentrionale e per le relazioni con la Svizzera e la Norvegia, alla commissione parlamentare mista UE-Islanda e alla commissione parlamentare mista dello Spazio economico europeo (SEE) @it
preferred label: Delegácia pre severnú spoluprácu a pre vzťahy so Švajčiarskom a Nórskom, pri Spoločnom parlamentnom výbore EÚ – Island a pri Spoločnom parlamentnom výbore Európskeho hospodárskeho priestoru (EHP) @sk
preferred label: Delegação para a Cooperação Setentrional e para as Relações com a Suíça e a Noruega, à Comissão Parlamentar Mista UE-Islândia e à Comissão Parlamentar Mista do Espaço Económico Europeu (EEE) @pt
preferred label: Αντιπροσωπεία για τη Συνεργασία στην περιοχή της Αρκτικής και για τις σχέσεις με την Ελβετία και τη Νορβηγία και στη Μικτή Κοινοβουλευτική Επιτροπή ΕΕ-Ισλανδίας, καθώς και στη Μικτή Κοινοβουλευτική Επιτροπή για τον Ευρωπαϊκό Οικονομικό Χώρο (ΕΟΧ) @el
preferred label: Pohjoisesta yhteistyöstä ja suhteista Sveitsiin ja Norjaan vastaava sekä EU:n ja Islannin parlamentaarisessa sekavaliokunnassa ja Euroopan talousalueen (ETA) parlamentaarisessa sekavaliokunnassa toimiva valtuuskunta @fi
preferred label: Delegația pentru cooperare nordică și pentru relațiile cu Elveția și Norvegia, precum și la Comisia parlamentară mixtă UE-Islanda și la Comisia parlamentară mixtă a Spațiului Economic European (SEE) @ro
preferred label: Delegacja do spraw Współpracy w ramach Wymiaru Północnego i do spraw Stosunków ze Szwajcarią i Norwegią, do Wspólnej Komisji Parlamentarnej UE–Islandia oraz do Wspólnej Komisji Parlamentarnej Europejskiego Obszaru Gospodarczego (EOG) @pl
preferred label: Délégation pour la coopération septentrionale et pour les relations avec la Suisse et la Norvège, à la commission parlementaire mixte UE-Islande et à la commission parlementaire mixte de l'Espace économique européen (EEE) @fr
preferred label: An Toscaireacht don chomhar ó Thuaidh agus don chaidreamh leis an Eilvéis agus leis an Iorua, agus chun an Chomhchoiste Pharlaimintigh idir AE agus an Íoslainn agus chun Comhchoiste Parlaiminteach an Limistéir Eorpaigh Eacnamaíoch (LEE) @ga
preferred label: Делегация за сътрудничество със Севера и за връзки с Швейцария и Норвегия в Съвместния парламентарен комитет ЕС – Исландия и в Съвместния парламентарен комитет на Европейското икономическо пространство (ЕИП) @bg
preferred label: Az északi együttműködésért felelős, a Svájccal és Norvégiával fenntartott kapcsolatokért felelős és az EU–Izland Parlamenti Vegyes Bizottságba és az Európai Gazdasági Térség (EGT) Parlamenti Vegyes Bizottságába delegált küldöttség @hu
preferred label: Delegācija ziemeļvalstu sadarbībai un attiecībām ar Šveici un Norvēģiju, kā arī ES un Islandes apvienotajā parlamentārajā komitejā un Eiropas Ekonomikas zonas (EEZ) apvienotajā parlamentārajā komitejā @lv
preferred label: Izaslanstvo za sjevernu suradnju i za odnose sa Švicarskom i Norveškom te u Zajedničkom parlamentarnom odboru EU-a i Islanda i Zajedničkom parlamentarnom odboru Europskog gospodarskog prostora (EGP) @hr
preferred label: Delegace pro severní spolupráci a pro vztahy se Švýcarskem a Norskem, ve Smíšeném parlamentním výboru EU-Island a ve Smíšeném parlamentním výboru Evropského hospodářského prostoru @cs
preferred label: Delegazzjoni għall-kooperazzjoni tat-Tramuntana u għar-relazzjonijiet mal-Iżvizzera u n-Norveġja u għall-Kumitat Parlamentari Konġunt UE-Iżlanda u għall-Kumitat Parlamentari Konġunt taż-Żona Ekonomika Ewropea (ŻEE) @mt
preferred label: Delegación para la Cooperación Septentrional y para las Relaciones con Suiza y Noruega, en la Comisión Parlamentaria Mixta UE-Islandia y en la Comisión Parlamentaria Mixta del Espacio Económico Europeo (EEE) @es
preferred label: Delegationen for Nordisk Samarbejde og for Forbindelserne med Schweiz og Norge, til Det Blandede Parlamentariske Udvalg EU-Island og til Det Blandede EØS-Parlamentarikerudvalg @da
preferred label: Delegacija bendradarbiavimo su Šiaurės šalimis klausimais bei ryšiams su Šveicarija ir Norvegija, taip pat ES ir Islandijos jungtiniame parlamentiniame komitete ir Europos ekonominės erdvės (EEE) jungtiniame parlamentiniame komitete @lt
preferred label: Delegatie voor noordelijke samenwerking en voor de betrekkingen met Zwitserland en Noorwegen, in de Gemengde Parlementaire Commissie EU-IJsland en in de Gemengde Parlementaire Commissie van de Europese Economische Ruimte (EER) @nl
preferred label: Delegatsioon põhjamõõtme koostööks ning Šveitsi ja Norraga suhtlemiseks ning ELi–Islandi parlamentaarses ühiskomisjonis ja Euroopa Majanduspiirkonna (EMP) parlamentaarses ühiskomisjonis @et
preferred label: Delegationen för samarbete i norr och för förbindelserna med Schweiz och Norge, till den gemensamma parlamentarikerkommittén EU–Island och till EES gemensamma parlamentarikerkommitté @sv
preferred label: Delegacija za severno sodelovanje in odnose s Švico in Norveško ter delegacija v skupnem parlamentarnem odboru EU-Islandija in v skupnem parlamentarnem odboru Evropskega gospodarskega prostora (EGP) @sl
preferred label: Delegation für die Zusammenarbeit im Norden und für die Beziehungen zur Schweiz und zu Norwegen, im Gemischten Parlamentarischen Ausschuss EU-Island und im Gemischten Parlamentarischen Ausschuss Europäischer Wirtschaftsraum (EWR) @de

European Food Safety Authority
type: Concept
created: 2023-10-31
deprecated: false
broader: Decentralised agency
definition: European Food Safety Authority.
in scheme: EP taxonomy on entities.
preferred label: Autorité européenne de sécurité des aliments @fr
preferred label: Eiropas Pārtikas nekaitīguma iestāde @lv
preferred label: Europos maisto saugos tarnyba @lt
preferred label: Európsky úrad pre bezpečnosť potravín @sk
preferred label: Europese Autoriteit voor voedselveiligheid @nl
preferred label: Autorità europea per la sicurezza alimentare @it
preferred label: Euroopa Toiduohutusamet @et
preferred label: Autoridade Europeia para a Segurança dos Alimentos @pt
preferred label: Euroopan elintarviketurvallisuusviranomainen @fi
preferred label: Evropský úřad pro bezpečnost potravin @cs
preferred label: Ευρωπαϊκή Αρχή για την Ασφάλεια των Τροφίμων @el
preferred label: L-Awtorità Ewropea dwar Is-Sigurtà fl-Ikel @mt
preferred label: Europska agencija za sigurnost hrane @hr
preferred label: Европейски орган за безопасност на храните @bg
preferred label: Autoritatea Europeană pentru Siguranța Alimentară @ro
preferred label: Europäische Behörde für Lebensmittelsicherheit @de
preferred label: Europeiska myndigheten för livsmedelssäkerhet @sv
preferred label: Európai Élelmiszerbiztonsági Hatóság @hu
preferred label: Evropska agencija za varnost hrane @sl
preferred label: Europejski Urząd ds. Bezpieczeństwa Żywności @pl
preferred label: An tÚdarás Eorpach um Shábháilteacht Bia @ga
preferred label: Den Europæiske Fødevaresikkerhedsautoritet @da
preferred label: Autoridad Europea de Seguridad Alimentaria @es

Committee on Agriculture and Rural Development
type: Concept
created: 2023-10-31
deprecated: false
alternative label: Lauksaimniecība un lauku attīstība @lv
alternative label: Agricoltura e sviluppo rurale @it
alternative label: Jordbruk och landsbygdens utveckling @sv
alternative label: Rolnictwo i Rozwój Wsi @pl
alternative label: Kmetijstvo in razvoj podeželja @sl
alternative label: Talmhaíocht agus Forbairt Thuaithe @ga
alternative label: Agriculture and Rural Development
alternative label: Poljoprivreda i ruralni razvoj @hr
alternative label: Agrikoltura u Żvilupp Rurali @mt
alternative label: Γεωργία και Ανάπτυξη της Υπαίθρου @el
alternative label: Zemědělství a rozvoj venkova @cs
alternative label: Mezőgazdaság és vidékfejlesztés @hu
alternative label: Landwirtschaft und ländliche Entwicklung @de
alternative label: Landbouw en plattelandsontwikkeling @nl
alternative label: Landbrug og Udvikling af Landdistrikter @da
alternative label: Земеделие и развитие на селските райони @bg
alternative label: Põllumajandus ja maaelu areng @et
alternative label: Agricultură și dezvoltare rurală @ro
alternative label: Agricultura e Desenvolvimento Rural @pt
alternative label: Agricultura y Desarrollo Rural @es
alternative label: Maatalous ja maaseudun kehittäminen @fi
alternative label: Poľnohospodárstvo a rozvoj vidieka @sk
alternative label: Žemės ūkis ir kaimo plėtra @lt
alternative label: Agriculture et développement rural @fr
broader: Standing parliamentary committee
definition: European parliamentary committee on agriculture and rural development.
in scheme: EP taxonomy on entities.
preferred label: Odbor za kmetijstvo in razvoj podeželja @sl
preferred label: Utskottet för jordbruk och landsbygdens utveckling @sv
preferred label: Põllumajanduse ja maaelu arengu komisjon @et
preferred label: Výbor pro zemědělství a rozvoj venkova @cs
preferred label: Maatalouden ja maaseudun kehittämisen valiokunta @fi
preferred label: Udvalget om Landbrug og Udvikling af Landdistrikter @da
preferred label: Mezőgazdasági és Vidékfejlesztési Bizottság @hu
preferred label: Commissione per l'agricoltura e lo sviluppo rurale @it
preferred label: An Coiste um Thalmhaíocht agus um Fhorbairt Tuaithe @ga
preferred label: Επιτροπή Γεωργίας και Ανάπτυξης της Υπαίθρου @el
preferred label: Kumitat għall-Agrikoltura u l-Iżvilupp Rurali @mt
preferred label: Comisia pentru agricultură și dezvoltare rurală @ro
preferred label: Komisja Rolnictwa i Rozwoju Wsi @pl
preferred label: Comisión de Agricultura y Desarrollo Rural @es
preferred label: Ausschuss für Landwirtschaft und ländliche Entwicklung @de
preferred label: Comissão da Agricultura e do Desenvolvimento Rural @pt
preferred label: Lauksaimniecības un lauku attīstības komiteja @lv
preferred label: Комисия по земеделие и развитие на селските райони @bg
preferred label: Žemės ūkio ir kaimo plėtros komitetas @lt
preferred label: Odbor za poljoprivredu i ruralni razvoj @hr
preferred label: Commission de l'agriculture et du développement rural @fr
preferred label: Commissie landbouw en plattelandsontwikkeling @nl
preferred label: Výbor pre poľnohospodárstvo a rozvoj vidieka @sk

Czech Chamber of Deputies
type: Concept
created: 2023-10-31
deprecated: false
broader: National chamber
definition: Czech Chamber of Deputies.
in scheme: EP taxonomy on entities.
preferred label: tschechisches Abgeordnetenhaus @de
preferred label: Камара на депутатите на Чешката република @bg
preferred label: Camera Deputaților din Cehia @ro
preferred label: Câmara dos Deputados checa @pt
preferred label: češka poslanska zbornica @sl
preferred label: Čekijos Respublikos Atstovų Rūmai @lt
preferred label: Chambre des députés tchèque @fr
preferred label: Camera dei deputati ceca @it
preferred label: Kamra tad-Deputati Ċeka @mt
preferred label: Den tjeckiska deputeradekammaren @sv
preferred label: Čehijas parlamenta Deputātu palāta @lv
preferred label: Poslanecká sněmovna Parlamentu České republiky @cs
preferred label: Cámara de Diputados checa @es
preferred label: Izba Poselska Republiki Czeskiej @pl
preferred label: česká Poslanecká snemovňa @sk
preferred label: det tjekkiske Deputeretkammer @da
preferred label: Τσεχική Βουλή @el
preferred label: Tsjechische Kamer van Afgevaardigden @nl
preferred label: Tšekin edustajainhuone @fi
preferred label: cseh képviselőház @hu
preferred label: češki Zastupnički dom @hr
preferred label: Teach Ionadaithe na Seice @ga
preferred label: Tšehhi Esindajatekoda @et

Delegation to the Pacific-EU Parliamentary Assembly
type: Concept
created: 2023-12-31
deprecated: false
alternative label: Paċifiku-UE @mt
alternative label: Pacyfik–UE @pl
alternative label: Tyynenmeren alueen ja EU @fi
alternative label: AE-an tAigéan Ciúin @ga
alternative label: басейн – ЕС @bg
alternative label: Ειρηνικός-ΕΕ @el
alternative label: Stillahavsområdet–EU @sv
alternative label: Pacific-EU
alternative label: Klusā okeāna valstu un ES @lv
alternative label: Pacífico-UE @pt
alternative label: Pacifico-UE @it
alternative label: Tichomoří–EU @cs
alternative label: Stillehavsområdet-EU @da
alternative label: Pazifik-EU @de
alternative label: Stille Oceaan-EU @nl
alternative label: Pacifique-UE @fr
alternative label: Vaikse ookeani piirkonna ja ELi @et
alternative label: Tichomorie – EÚ @sk
alternative label: Pacific-UE @ro
alternative label: a Csendes-óceáni térség–EU @hu
alternative label: Pacifik-EU @hr
alternative label: Ramiojo vandenyno valstybių ir ES @lt
broader: Temporary parliamentary legislative committee
definition: Delegation to the Pacific-EU Parliamentary Assembly.
in scheme: EP taxonomy on entities.
preferred label: Delegazzjoni għall-Assemblea Parlamentari Paċifiku-UE @mt
preferred label: Delegação à Assembleia Parlamentar Pacífico-UE @pt
preferred label: a Csendes-óceáni térség–EU Parlamenti Közgyűlésbe delegált küldöttség @hu
preferred label: Delegation in der Parlamentarischen Versammlung Pazifik-EU @de
preferred label: Delegationen til Den Parlamentariske Forsamling Stillehavsområdet-EU @da
preferred label: Делегация в Парламентарната асамблея Тихоокеански басейн – ЕС @bg
preferred label: Delegācija Klusā okeāna valstu un ES Parlamentārajā asamblejā @lv
preferred label: Delegace v Parlamentním shromáždění Tichomoří–EU @cs
preferred label: Delegacija pri Parlamentarni skupščini Pacifik-EU @sl
preferred label: Delegazione all'Assemblea parlamentare Pacifico-UE @it
preferred label: Délégation à l'Assemblée parlementaire Pacifique-UE @fr
preferred label: Delegacja do Zgromadzenia Parlamentarnego Pacyfik–UE @pl
preferred label: Izaslanstvo u Parlamentarnoj skupštini Pacifik-EU @hr
preferred label: Delegación en la Asamblea Parlamentaria Pacífico-UE @es
preferred label: Valtuuskunta Tyynenmeren alueen ja EU:n parlamentaarisessa edustajakokouksessa @fi
preferred label: Αντιπροσωπεία στην Κοινοβουλευτική Συνέλευση Ειρηνικού-ΕΕ @el
preferred label: Toscaireacht chuig Tionól Parlaiminteach AE-an tAigéan Ciúin @ga
preferred label: Delegácia pri Parlamentnom zhromaždení Tichomorie – EÚ @sk
preferred label: Delegația la Adunarea Parlamentară Pacific-UE @ro
preferred label: Delegationen till den parlamentariska församlingen Stillahavsområdet–EU @sv
preferred label: Delegacija Ramiojo vandenyno valstybių ir ES parlamentinėje asamblėjoje @lt
preferred label: Delegatsioon Vaikse ookeani piirkonna ja ELi parlamentaarses assamblees @et
preferred label: Delegatie in de Parlementaire Vergadering Stille Oceaan-EU @nl

Publications Office of the European Union
type: Concept
created: 2023-10-31
deprecated: false
alternative label: Väljaannete talitus @et
alternative label: Kiadóhivatal @hu
alternative label: Publikationsbyrån @sv
alternative label: Leidinių biuras @lt
alternative label: Ured za publikacije @hr
alternative label: Publikāciju birojs @lv
alternative label: Oifig na bhFoilseachán @ga
alternative label: Bureau voor publicaties @nl
alternative label: Publications Office
alternative label: Úrad pre publikácie @sk
alternative label: Υπηρεσία Εκδόσεων @el
alternative label: Oficiul pentru Publicații @ro
alternative label: Office des publications @fr
alternative label: Urad za publikacije @sl
alternative label: Publikationskontoret @da
alternative label: Serviço das Publicações @pt
alternative label: Служба за публикации @bg
alternative label: L-Uffiċċju tal-Pubblikazzjonijiet @mt
alternative label: Amt für Veröffentlichungen @de
alternative label: Úřad pro publikace @cs
alternative label: Ufficio delle pubblicazioni @it
alternative label: Julkaisutoimisto @fi
alternative label: Oficina de Publicaciones @es
alternative label: Urząd Publikacji @pl
broader: EU interinstitutional service
definition: Publications Office of the European Union.
in scheme: EP taxonomy on entities.
preferred label: Urad za publikacije Evropske unije @sl
preferred label: Oficiul pentru Publicații al Uniunii Europene @ro
preferred label: Úřad pro publikace Evropské unie @cs
preferred label: Euroopa Liidu Väljaannete Talitus @et
preferred label: Úrad pre vydávanie publikácií Európskej únie @sk
preferred label: Служба за публикации на Европейския съюз @bg
preferred label: Ufficio delle pubblicazioni dell’Unione europea @it
preferred label: Euroopan unionin julkaisutoimisto @fi
preferred label: Az Európai Unió Kiadóhivatala @hu
preferred label: Amt für Veröffentlichungen der Europäischen Union @de
preferred label: Ured za publikacije Europske unije @hr
preferred label: Oifig Foilseachán an Aontais Eorpaigh @ga
preferred label: Uffiċċju tal-Pubblikazzjonijiet tal-Unjoni Ewropea @mt
preferred label: Bureau voor publicaties van de Europese Unie @nl
preferred label: Office des publications de l’Union européenne @fr
preferred label: Serviço das Publicações da União Europeia @pt
preferred label: Eiropas Savienības Publikāciju birojs @lv
preferred label: Europeiska unionens publikationsbyrå @sv
preferred label: Oficina de Publicaciones de la Unión Europea @es
preferred label: Europos Sąjungos leidinių biuras @lt
preferred label: Urząd Publikacji Unii Europejskiej @pl
preferred label: Den Europæiske Unions Publikationskontor @da
preferred label: Υπηρεσία Εκδόσεων της Ευρωπαϊκής Ένωσης @el

Joint committee procedure - ENVI and SANT
type: Concept
created: 2025-08-31
deprecated: false
alternative label: Commissions conjointes ENVI - SANT @fr
alternative label: ENVI und SANT @de
alternative label: Joint ENVI - SANT
broader: Joint parliamentary committees
definition: Joint committee procedure - ENVI and SANT.
in scheme: EP taxonomy on entities.
preferred label: Procédure avec commissions conjointes - ENVI et SANT @fr
preferred label: Gemeinsames Ausschussverfahren - ENVI und SANT @de

Circular Bio-based Europe Joint Undertaking
type: Concept
created: 2023-10-31
deprecated: false
broader: EU joint undertaking
definition: Circular Bio-based Europe Joint Undertaking.
in scheme: EP taxonomy on entities.
preferred label: Empresa Común para una Europa Circular de Base Biológica @es
preferred label: Spoločný podnik pre európske obehové hospodárstvo využívajúce biologické materiály @sk
preferred label: Bioressursipõhise ringmajandusega Euroopa ühisettevõte @et
preferred label: Gemeenschappelijke Onderneming “Een circulair biogebaseerd Europa” @nl
preferred label: Europos žiedinės biožaliavinės ekonomikos bendroji įmonė @lt
preferred label: Det gemensamma företaget för ett cirkulärt, biobaserat Europa @sv
preferred label: L-Impriża Konġunta Ewropa Ċirkolari b’Bażi Bijoloġika @mt
preferred label: Fællesforetagendet for et cirkulært biobaseret Europa @da
preferred label: Impresa comune «Europa biocircolare» @it
preferred label: Zajedničko poduzeće za Europu kao kružno biogospodarstvo @hr
preferred label: Wspólne Przedsięwzięcie na rzecz Biotechnologicznej Europy Opartej na Obiegu Zamkniętym @pl
preferred label: Entreprise commune «Une Europe fondée sur la bioéconomie circulaire» @fr
preferred label: Körforgásos és Bioalapú Európai Gazdaság Közös Vállalkozás @hu
preferred label: Gemeinsames Unternehmen für ein kreislauforientiertes biobasiertes Europa @de
preferred label: Euroopan kiertotaloutta ja biopohjaisia ratkaisuja edistävä yhteisyritys @fi
preferred label: An Comhghnóthas um Eoraip Bhithbhunaithe Chiorclach @ga
preferred label: Κοινή επιχείρηση «Μια Ευρώπη που βασίζεται στην κυκλική βιοοικονομία» @el
preferred label: Skupno podjetje za krožno Evropo na biološki osnovi @sl
preferred label: Empresa Comum para uma Europa Circular de Base Biológica @pt
preferred label: Cъвместно предприятие „Кръгова биотехнологична Европа“ @bg
preferred label: Společný podnik pro evropské oběhové biohospodářství @cs
preferred label: Kopuzņēmums “Apritīga biobāzēta Eiropa” @lv
preferred label: Întreprinderea comună pentru bioeconomia circulară în Europa @ro

Delegation to the EU-Croatia Joint Parliamentary Committee
type: Concept
created: 2023-10-31
deprecated: true
alternative label: EU–Horvátország @hu
alternative label: EU-Kroatia @fi
alternative label: UE-Croacia @es
alternative label: UE-Croazia @it
alternative label: UE-Croația @ro
alternative label: ES-Kroatija @lt
alternative label: EÚ – Chorvátsko @sk
alternative label: UE-Croatie @fr
alternative label: AE-an Chróit @ga
alternative label: EU-Kroatië @nl
alternative label: EU-Chorvatsko @cs
alternative label: EU-Croatia
alternative label: UE-Chorwacja @pl
alternative label: ES un Horvātija @lv
alternative label: ΕΕ-Κροατία @el
alternative label: EU-Kroatien @da
alternative label: ЕС-Хърватия @bg
alternative label: EU-Hrvaška @sl
alternative label: UE-Kroazja @mt
alternative label: EL–Horvaatia @et
alternative label: UE-Croácia @pt
alternative label: EU – Hrvatska @hr
broader: Delegation to Joint Parliamentary Committee
definition: Delegation to the EU-Croatia Joint Parliamentary Committee.
in scheme: EP taxonomy on entities.
preferred label: Délégation à la commission parlementaire mixte UE-Croatie @fr
preferred label: Delegace ve Smíšeném parlamentním výboru EU-Chorvatsko @cs
preferred label: Delegationen til Det Blandede Parlamentariske Udvalg EU-Kroatien @da
preferred label: Delegācija ES un Horvātijas Apvienotajā parlamentārajā komitejā @lv
preferred label: Αντιπροσωπεία στη Μικτή Κοινοβουλευτική Επιτροπή ΕΕ-Κροατίας @el
preferred label: Delegación en la Comisión Parlamentaria Mixta UE-Croacia @es
preferred label: Az EU–Horvátország Parlamenti Vegyes Bizottságba delegált küldöttség @hu
preferred label: Delegazzjoni għall-Kumitat Parlamentari Konġunt UE-Kroazja @mt
preferred label: Delegácia pri Spoločnom parlamentnom výbore EÚ – Chorvátsko @sk
preferred label: Delegacja do wspólnej komisji parlamentarnej UE-Chorwacja @pl
preferred label: Delegazione alla commissione parlamentare mista UE-Croazia @it
preferred label: Delegatsioon ELi-Horvaatia parlamentaarses ühiskomisjonis @et
preferred label: Delegacija pri skupnem parlamentarnem odboru EU-Hrvaška @sl
preferred label: Delegația la Comisia parlamentară mixtă UE-Croația @ro
preferred label: Delegationen till den gemensamma parlamentarikerkommittén EU-Kroatien @sv
preferred label: Valtuuskunta EU:n ja Kroatian parlamentaarisessa sekavaliokunnassa @fi
preferred label: Toscaireacht chun an Chomhchoiste Pharlaimintigh den AE agus den Chróit @ga
preferred label: Delegacija ES ir Kroatijos jungtiniame parlamentiniame komitete @lt
preferred label: Delegação à Comissão Parlamentar Mista UE-Croácia @pt
preferred label: Delegation im Gemischten Parlamentarischen Ausschuss EU-Kroatien @de
preferred label: Delegatie in de Gemengde Parlementaire Commissie EU-Kroatië @nl
preferred label: Делегация в Съвместния парламентарен комитет ЕС-Хърватия @bg
preferred label: Izaslanstvo u Zajedničkom parlamentarnom odboru EU-a i Hrvatske @hr

Joint committee procedure - CONT and LIBE
type: Concept
created: 2023-10-31
deprecated: false
alternative label: Joint CONT - LIBE
alternative label: CONT und LIBE @de
alternative label: Commissions conjointes CONT - LIBE @fr
broader: Joint parliamentary committees
definition: Joint committee procedure - CONT and LIBE.
in scheme: EP taxonomy on entities.
preferred label: Procédure avec commissions conjointes - CONT et LIBE @fr
preferred label: Gemeinsames Ausschussverfahren - CONT und LIBE @de

Luxembourg Chamber of Deputies
type: Concept
created: 2023-10-31
deprecated: false
broader: National chamber
definition: Luxembourg Chamber of Deputies.
in scheme: EP taxonomy on entities.
preferred label: Luxemburgin edustajainhuone @fi
preferred label: Liuksemburgo Didžiosios Hercogystės Deputatų Rūmai @lt
preferred label: luksemburški Zastupnički dom @hr
preferred label: Cámara de Diputados luxemburguesa @es
preferred label: Λουξεμβουργιανό Κοινοβούλιο @el
preferred label: Камара на депутатите на Люксембург @bg
preferred label: luksemburška poslanska zbornica @sl
preferred label: luxemburgi képviselőház @hu
preferred label: Luksemburgi Saadikutekoda @et
preferred label: Luxemburgs parlement @nl
preferred label: Câmara dos Deputados luxemburguesa @pt
preferred label: Kamra tad-Deputati Lussemburgiża @mt
preferred label: luxemburgische Abgeordnetenkammer @de
preferred label: Izba Deputowanych Luksemburga @pl
preferred label: lucemburská Poslanecká sněmovna @cs
preferred label: Camera Deputaților din Luxemburg @ro
preferred label: Camera dei deputati lussemburghese @it
preferred label: Luksemburgas Deputātu palāta @lv
preferred label: luxemburská Poslanecká snemovňa @sk
preferred label: Teach Teachtaí Lucsamburg @ga
preferred label: Chambre des députés luxembourgeoise @fr
preferred label: Den luxemburgska deputeradekammaren @sv
preferred label: det luxembourgske Deputeretkammer @da

United Kingdom House of Commons
type: Concept
created: 2023-10-31
deprecated: false
broader: National chamber
definition: United Kingdom House of Commons.
in scheme: EP taxonomy on entities.
preferred label: Βουλή των Κοινοτήτων του Ηνωμένου Βασιλείου @el
preferred label: Dolní sněmovna Spojeného království @cs
preferred label: brit alsóház @hu
preferred label: Yhdistyneen kuningaskunnan parlamentin alahuone @fi
preferred label: Dolná snemovňa Spojeného kráľovstva @sk
preferred label: Izba Gmin @pl
preferred label: Chambre des communes du Royaume-Uni @fr
preferred label: Câmara dos Comuns do Reino Unido @pt
preferred label: Камара на общините на Обединеното кралство @bg
preferred label: Förenade kungarikets underhus @sv
preferred label: Det Forenede Kongeriges Underhus @da
preferred label: spodnji dom parlamenta Združenega kraljestva @sl
preferred label: Apvienotās Karalistes parlamenta Pārstāvju palāta @lv
preferred label: House of Commons tar-Renju Unit @mt
preferred label: Zastupnički dom Ujedinjene Kraljevine @hr
preferred label: Cámara de los Comunes del Reino Unido @es
preferred label: Jungtinės Karalystės Bendruomenių Rūmai @lt
preferred label: Camera Comunelor din Regatul Unit @ro
preferred label: Ühendkuningriigi Parlamendi Alamkoda @et
preferred label: Teach Teachtaí an Ríochta Aontaithe @ga
preferred label: Unterhaus des Vereinigten Königreichs @de
preferred label: Camera dei comuni del Regno Unito @it
preferred label: Lagerhuis van het Verenigd Koninkrijk @nl

Danish Parliament
type: Concept
created: 2023-10-31
deprecated: false
broader: National chamber
definition: Danish Parliament.
in scheme: EP taxonomy on entities.
preferred label: Parlamento dinamarquês @pt
preferred label: Danijos Karalystės Folketingas @lt
preferred label: dánský parlament @cs
preferred label: dänisches Parlament @de
preferred label: Δανικό Κοινοβούλιο @el
preferred label: dán parlament @hu
preferred label: Deens parlement @nl
preferred label: danski parlament @sl
preferred label: Парламент на Кралство Дания @bg
preferred label: Parlamento danese @it
preferred label: parlament Danii @pl
preferred label: Taani Folketing @et
preferred label: Parlamentul Danemarcei @ro
preferred label: Parlamento danés @es
preferred label: Folketinget @da
preferred label: Parlaimint na Danmhairge @ga
preferred label: Tanskan kansankäräjät @fi
preferred label: Parlament Daniż @mt
preferred label: dánsky parlament @sk
preferred label: Danski parlament @hr
preferred label: Dānijas Folketings @lv
preferred label: Parlement danois @fr
preferred label: Det danska folketinget @sv

European Securities and Markets Authority
type: Concept
created: 2023-10-31
deprecated: false
broader: Decentralised agency
definition: European Securities and Markets Authority.
in scheme: EP taxonomy on entities.
preferred label: Ευρωπαϊκή Αρχή Κινητών Αξιών και Αγορών @el
preferred label: Европейски орган за ценни книжа и пазари @bg
preferred label: L-Awtorita’ għat-Titoli u s-Swieq @mt
preferred label: Autoridad Europea de Valores y Mercados @es
preferred label: Euroopan arvopaperimarkkinaviranomainen @fi
preferred label: Autorité européenne des marchés financiers @fr
preferred label: Evropský orgán pro cenné papíry a trhy @cs
preferred label: Autoritatea europeană pentru valori mobiliare și piețe @ro
preferred label: Den Europæiske Værdipapir- og Markedstilsynsmyndighed @da
preferred label: Europeiska värdepappers- och marknadsmyndigheten @sv
preferred label: Eiropas Vērtspapīru un tirgu iestāde @lv
preferred label: Evropski organ za vrednostne papirje in trge @sl
preferred label: An tÚdarás Eorpach um Urrúis agus Margaí @ga
preferred label: Európai Értékpapírpiaci Hatóság @hu
preferred label: Europäische Wertpapier- und Börsenaufsichtsbehörde @de
preferred label: Europsko nadzorno tijelo za vrijednosne papire i tržišta kapitala @hr
preferred label: Europese Autoriteit voor effecten en markten @nl
preferred label: Európsky orgán pre cenné papiere a trhy @sk
preferred label: Europos vertybinių popierių ir rinkų institucija @lt
preferred label: Autorità europea degli strumenti finanziari e dei mercati @it
preferred label: Euroopa Väärtpaberiturujärelevalve @et
preferred label: Europejski Organ Nadzoru Giełd i Papierów Wartościowych @pl
preferred label: Autoridade Europeia para os Mercados Financeiros @pt

Europe of Sovereign Nations Group
type: Concept
created: 2025-01-31
deprecated: false
alternative label: Souveränisten @de
alternative label: Suverenistit @fi
alternative label: Suverenistai @lt
alternative label: Sovranisti @it
alternative label: Suverēnisti @lv
alternative label: Suverenisté @cs
alternative label: Souverainistes @fr
alternative label: Szuverenisták @hu
alternative label: Κυριαρχιστές @el
alternative label: Soberanistas @pt
alternative label: Suveränister @sv
alternative label: Sovereignists
alternative label: Na Ceannasaigh @ga
alternative label: Soevereinisten @nl
alternative label: Suwereniści @pl
alternative label: Suveräänsuslased @et
alternative label: Suverænisterne @da
alternative label: Suverenisti @sl
alternative label: Suveraniști @ro
alternative label: Суверенисти @bg
broader: POLITICAL GROUP
definition: European political group Europe of Sovereign Nations.
in scheme: EP taxonomy on entities.
preferred label: Grupp Ewropa tan-Nazzjonijiet Sovrani @mt
preferred label: Grupo Europa das Nações Soberanas @pt
preferred label: An Grúpa 'Eoraip na Náisiún Ceannasach' @ga
preferred label: Gruppen Europa af Suveræne Nationer @da
preferred label: Ομάδα «Ευρώπη των Κυρίαρχων Εθνών» @el
preferred label: Skupina Evropa suverénních národů @cs
preferred label: Suvereenien kansakuntien Eurooppa -ryhmä @fi
preferred label: Група „Европа на суверенните нации @bg
preferred label: Gruppo "Europa delle Nazioni Sovrane" @it
preferred label: Klub zastupnika Europa suverenih nacija @hr
preferred label: Fractie Europa van Soevereine Naties @nl
preferred label: Grupo Europa de las Naciones Soberanas @es
preferred label: Szuverén Nemzetek Európája képviselőcsoport @hu
preferred label: Skupina Európa suverénnych národov @sl
preferred label: Groupe «L'Europe des nations souveraines» @fr
preferred label: Suverenių tautų Europos frakcija @lt
preferred label: Grupa “Suverēnu nāciju Eiropa” @lv
preferred label: Fraktion Europa der Souveränen Nationen @de
preferred label: Suveräänsete Rahvusriikide Euroopa fraktsioon @et
preferred label: Skupina Evropa suverenih narodov @sk
preferred label: Grupul „Europa Națiunilor Suverane” @ro
preferred label: Gruppen Europa av suveräna nationer @sv
preferred label: Grupa Europa Suwerennych Narodów @pl

Delegation for relations with Japan
type: Concept
created: 2023-10-31
deprecated: false
alternative label: Ġappun @mt
alternative label: Japão @pt
alternative label: An tSeapáin @ga
alternative label: Japāna @lv
alternative label: Ιαπωνία @el
alternative label: Japón @es
alternative label: Japon @fr
alternative label: Япония @bg
alternative label: Japani @fi
alternative label: Japonija @lt
alternative label: Japan
alternative label: Japán @hu
alternative label: Jaapan @et
alternative label: Japonia @pl
alternative label: Japonsko @cs
alternative label: Giappone @it
alternative label: Japonska @sl
broader: Parliamentary delegation
definition: Delegation for relations with Japan.
in scheme: EP taxonomy on entities.
preferred label: Delegācija attiecībām ar Japānu @lv
preferred label: Delegația pentru relațiile cu Japonia @ro
preferred label: Delegatsioon Jaapaniga suhtlemiseks @et
preferred label: Delegationen for Forbindelserne med Japan @da
preferred label: Delegacija za odnose z Japonsko @sl
preferred label: Suhteista Japaniin vastaava valtuuskunta @fi
preferred label: Delegazione per le relazioni con il Giappone @it
preferred label: Αντιπροσωπεία για τις σχέσεις με την Ιαπωνία @el
preferred label: Delegace pro vztahy s Japonskem @cs
preferred label: A Japánnal fenntartott kapcsolatokért felelős küldöttség @hu
preferred label: Делегация за връзки с Япония @bg
preferred label: Delegação para as Relações com o Japão @pt
preferred label: Izaslanstvo za odnose s Japanom @hr
preferred label: Delegation für die Beziehungen zu Japan @de
preferred label: Delegácia pre vzťahy s Japonskom @sk
preferred label: Delegationen för förbindelserna med Japan @sv
preferred label: Delegación para las Relaciones con Japón @es
preferred label: Délégation pour les relations avec le Japon @fr
preferred label: Delegazzjoni għar-relazzjonijiet mal-Ġappun @mt
preferred label: An Toscaireacht don chaidreamh leis an tSeapáin @ga
preferred label: Delegacja do spraw stosunków z Japonią @pl
preferred label: Delegacija ryšiams su Japonija @lt
preferred label: Delegatie voor de betrekkingen met Japan @nl

European Data Protection Board
type: Concept
created: 2023-10-31
deprecated: false
broader: European Union corporate body
definition: European Data Protection Board.
in scheme: EP taxonomy on entities.
preferred label: Europejska Rada Ochrony Danych @pl
preferred label: Европейски комитет по защита на данните @bg
preferred label: Europees Comité voor gegevensbescherming @nl
preferred label: Euroopa Andmekaitsenõukogu @et
preferred label: Comité Europeo de Protección de Datos @es
preferred label: Európsky výbor pre ochranu údajov @sk
preferred label: Det Europæiske Databeskyttelsesråd @da
preferred label: An Bord Eorpach um Chosaint Sonraí @ga
preferred label: Evropski odbor za varstvo podatkov @sl
preferred label: Comitato europeo per la protezione dei dati @it
preferred label: Európai Adatvédelmi Testület @hu
preferred label: Ευρωπαϊκό Συμβούλιο Προστασίας Δεδομένων @el
preferred label: Europski odbor za zaštitu podataka @hr
preferred label: Comité européen de la protection des données @fr
preferred label: Europäischer Datenschutzausschuss @de
preferred label: Eiropas Datu aizsardzības kolēģija @lv
preferred label: Comitetul european pentru protecția datelor @ro
preferred label: Europos duomenų apsaugos valdyba @lt
preferred label: Euroopan tietosuojaneuvosto @fi
preferred label: Evropský sbor pro ochranu osobních údajů @cs
preferred label: Europeiska dataskyddsstyrelsen @sv
preferred label: Comité Europeu para a Proteção de Dados @pt
preferred label: Bord Ewropew għall-Protezzjoni tad-Data @mt

Parliament's Bureau
type: Concept
created: 2025-04-30
deprecated: false
broader: European Parliament
definition: Bureau of the European Parliament.
in scheme: EP taxonomy on entities.
preferred label: Mesa del Parlamento Europeo @es
preferred label: Biúró Pharlaimint na hEorpa @ga
preferred label: Προεδρείο του Ευρωπαϊκού Κοινοβουλίου @el
preferred label: Biroul Parlamentului European @ro
preferred label: Prezydium @pl
preferred label: Präsidium des Europäischen Parlaments @de
preferred label: Бюро на Европейския парламент @bg
preferred label: Euroopan parlamentin puhemiehistö @fi
preferred label: Mesa do Parlamento Europeu @pt
preferred label: Předsednictvo @cs
preferred label: Bureau van het Europees Parlement @nl
preferred label: Euroopa Parlamendi juhatus @et
preferred label: Eiropas Parlamenta Prezidijs @lv
preferred label: Europaparlamentets presidium @sv
preferred label: Ufficio di presidenza del Parlamento europeo @it
preferred label: Predsedstvo @sl
preferred label: Bureau @mt
preferred label: Bureau du Parlement européen @fr
preferred label: Biuras @lt
preferred label: Elnökség @hu
preferred label: Predsjedništvo Parlamenta @hr
preferred label: Predsedníctvo @sk
preferred label: Europa-Parlamentets Præsidium @da

Joint committee procedure - INTA and IMCO
type: Concept
created: 2023-10-31
deprecated: false
alternative label: Joint INTA - IMCO
alternative label: INTA und IMCO @de
alternative label: Commissions conjointes INTA - IMCO @fr
broader: Joint parliamentary committees
definition: Joint committee procedure - INTA and IMCO.
in scheme: EP taxonomy on entities.
preferred label: Procédure avec commissions conjointes - INTA et IMCO @fr
preferred label: Gemeinsames Ausschussverfahren - INTA und IMCO @de

EU institution
type: CorporateBodyClassification
type: Concept
created: 2023-10-31
deprecated: false
alternative label: Institiúidí an Aontais Eorpaigh @ga
alternative label: ES iestādes @lv
alternative label: Instituições da UE @pt
alternative label: ES institucijos @lt
alternative label: European institution
alternative label: EU institutions
alternative label: EU-instellingen @nl
alternative label: Institutions de l’UE @fr
alternative label: EU-Institutionen @de
alternative label: Istituzzjonijiet tal-UE @mt
alternative label: Instituții ale UE @ro
alternative label: ELi institutsioonid @et
alternative label: Instytucje UE @pl
alternative label: Θεσμικά όργανα της ΕΕ @el
alternative label: EU:n toimielimet @fi
alternative label: Institucije EU-a @hr
alternative label: Institucije EU @sl
alternative label: Instituciones de la UE @es
alternative label: EU-intézmények @hu
alternative label: Inštitúcie EÚ @sk
alternative label: Istituzioni dell’UE @it
alternative label: Институции на ЕС @bg
alternative label: EU-institutioner @da
definition: European institution.
in scheme: EP taxonomy on entities.
preferred label: Institucija EU @sl
preferred label: Институция на ЕС @bg
preferred label: Institución de la UE @es
preferred label: Instituce EU @cs
preferred label: ELi institutsioon @et
preferred label: EU-institution @sv
preferred label: Institucija EU-a @hr
preferred label: Instituição da UE @pt
preferred label: Istituzzjoni tal-UE @mt
preferred label: ES institucija @lt
preferred label: Instytucja UE @pl
preferred label: Inštitúcia EÚ @sk
preferred label: EU-intézmény @hu
preferred label: Θεσμικό όργανο της ΕΕ @el
preferred label: EU-instelling @nl
preferred label: Institiúid de chuid an AE @ga
preferred label: EU:n toimielin @fi
preferred label: Istituzione dell’UE @it
preferred label: EU-Institution @de
preferred label: Instituție a UE @ro
preferred label: ES iestāde @lv
preferred label: Institution de l’UE @fr
top concept of: EP taxonomy on entities.

European Central Bank
type: Concept
created: 2023-10-31
deprecated: false
broader: EU institution
definition: European Central Bank.
in scheme: EP taxonomy on entities.
preferred label: Euroopa Keskpank @et
preferred label: An Banc Ceannais Eorpach @ga
preferred label: Európai Központi Bank @hu
preferred label: Banca Centrală Europeană @ro
preferred label: Den Europæiske Centralbank @da
preferred label: Европейска централна банка @bg
preferred label: Europäische Zentralbank @de
preferred label: Banca Centrale Europea @it
preferred label: Európska centrálna banka @sk
preferred label: Bank Ċentrali Ewropew @mt
preferred label: Eiropas Centrālā Banka @lv
preferred label: Europejski Bank Centralny @pl
preferred label: Europos centrinis bankas @lt
preferred label: Evropská centrální banka @cs
preferred label: Banque Centrale Européenne @fr
preferred label: Europese Centrale Bank @nl
preferred label: Europska središnja banka @hr
preferred label: Banco Central Europeo @es
preferred label: Evropska centralna banka @sl
preferred label: Banco Central Europeu @pt

Finnish Parliament
type: Concept
created: 2023-10-31
deprecated: false
broader: National chamber
definition: Finnish Parliament.
in scheme: EP taxonomy on entities.
preferred label: Parlamentul Finlandei @ro
preferred label: Finlands riksdag @sv
preferred label: parlament Finlandii @pl
preferred label: finski parlament @sl
preferred label: fínsky parlament @sk
preferred label: den finske Rigsdag @da
preferred label: Φινλανδικό Κοινοβούλιο @el
preferred label: Finski parlament @hr
preferred label: Somijas parlaments @lv
preferred label: finn parlament @hu
preferred label: Parlament Finlandiż @mt
preferred label: Parlamento finlandés @es
preferred label: Parlement finlandais @fr
preferred label: Fins parlement @nl
preferred label: Suomen eduskunta @fi
preferred label: finský parlament @cs
preferred label: Parlamento finlandese @it
preferred label: Parlamento finlandês @pt
preferred label: finnisches Parlament @de
preferred label: Parlaimint na Fionlainne @ga
preferred label: Парламент на Република Финландия @bg
preferred label: Soome Eduskund @et
preferred label: Suomijos Respublikos Eduskunta @lt

Delegation to the EU-Slovak Republic Joint Parliamentary Committee
type: Concept
created: 2023-10-31
deprecated: true
alternative label: UE-República Eslovaca @es
alternative label: ΕΕ-Σλοβακής Δημοκρατίας @el
alternative label: EU – Slovačka Republika @hr
alternative label: EU-Republiek Slowakije @nl
alternative label: EU-Slovenská republika @cs
alternative label: EÚ-Slovenská republika @sk
alternative label: UE-Republica Slovacă @ro
alternative label: AE-Poblacht na Slóvaice @ga
alternative label: ЕС-Словашка република @bg
alternative label: EU-Slovak Republic
alternative label: EU-Slovakian tasavalta @fi
alternative label: EU-Slovakien @sv
alternative label: EU-Slowakei @de
alternative label: UE-Slowacja @pl
alternative label: EU-Slovaška republika @sl
alternative label: EL-Slovakki Vabariik @et
alternative label: EU-Slovakiet @da
alternative label: EU-Szlovák Köztársaság @hu
alternative label: ES-Slovakija @lv
alternative label: UE-Repubblika Slovakka @mt
alternative label: ES-Slovakijos Respublika @lt
alternative label: UE-République slovaque @fr
alternative label: UE-Repubblica slovacca @it
broader: Delegation to Joint Parliamentary Committee
definition: Delegation to the EU-Slovak Republic Joint Parliamentary Committee.
in scheme: EP taxonomy on entities.
preferred label: Delegatsioon parlamendi ELi-Slovakkia ühiskomisjonis @et
preferred label: ES-Slovākijas Apvienotās parlamentārās komitejas delegācija @lv
preferred label: Délégation à la commission parlementaire mixte UE-République slovaque @fr
preferred label: Delegation im gemischten parlamentarischen Ausschuss EU-Slowakei @de
preferred label: Delegação à Comissão Parlamentar Mista UE-República Eslovaca @pt
preferred label: Αντιπροσωπεία στη Μικτή Κοινοβουλευτική Επιτροπή ΕΕ-Σλοβακικής Δημοκρατίας @el
preferred label: Delegatie in de Gemengde Parlementaire Commissie EU-Republiek Slowakije @nl
preferred label: Delegazzjoni lejn il-Kumitat Parlamentari Maghqud UE-Repubblika Slovakka @mt
preferred label: Delegacija pri Skupnem parlamentarnem odboru EU-Slovaška republika @sl
preferred label: Delegationen till den gemensamma parlamentarikerkommittén EU-Slovakien @sv
preferred label: Delegazione alla commissione parlamentare mista UE-Repubblica slovacca @it
preferred label: Delegace při smíšeném parlamentním výboru EU-Slovenská republika @cs
preferred label: Az EU-Szlovák Köztársaság Parlamenti Vegyes Bizottságba delegált küldöttség @hu
preferred label: Delegacija ES-Slovakijos Respublikos jungtiniame parlamentiniame komitete @lt
preferred label: Delegationen til Det Blandede Parlamentariske Udvalg EU-Slovakiet @da
preferred label: Valtuuskunta EU:n ja Slovakian tasavallan välisessä parlamentaarisessa sekavaliokunnassa @fi
preferred label: Delegación en la Comisión Parlamentaria Mixta UE-República Eslovaca @es
preferred label: Izaslanstvo u Zajedničkom parlamentarnom odboru EU-a i Slovačke Republike @hr
preferred label: Delegația la Comisia parlamentară mixtă UE-Republica Slovacă @ro
preferred label: Toscaireacht chun an Chomhchoiste Pharlaimintigh den AE-Poblacht na Slóvaice @ga
preferred label: Делегация в Съвместния парламентарен комитет ЕС-Словашка република @bg
preferred label: Delegácia pri Spoločnom parlamentnom výbore EÚ-Slovenská republika @sk
preferred label: Delegacja do Wspólnej komisji parlamentarnej UE-Republika Słowacka @pl

Joint committee procedure - ECON and JURI
type: Concept
created: 2023-10-31
deprecated: false
alternative label: Joint ECON - JURI
alternative label: Commissions conjointes ECON - JURI @fr
alternative label: ECON und JURI @de
broader: Joint parliamentary committees
definition: Joint committee procedure - ECON and JURI.
in scheme: EP taxonomy on entities.
preferred label: Procédure avec commissions conjointes - ECON et JURI @fr
preferred label: Gemeinsames Ausschussverfahren - ECON und JURI @de

Economic and Social Committee
type: Concept
created: 2023-10-31
deprecated: false
broader: EU body
definition: European advisory body issuing opinions to the other EU institutions.
in scheme: EP taxonomy on entities.
preferred label: Het Economisch en Sociaal Comité @nl
preferred label: Οικονομική και Κοινωνική Επιτροπή @el
preferred label: Gazdasági és Szociális Bizottság @hu
preferred label: Икономически и социален комитет @bg
preferred label: Hospodářský a sociální výbor @cs
preferred label: Comité économique et social @fr
preferred label: Ekonomiska och sociala kommittén @sv
preferred label: Comité Económico y Social @es
preferred label: majandus- ja sotsiaalkomitee @et
preferred label: Ekonomsko-socialni odbor @sl
preferred label: Comitato economico e sociale @it
preferred label: Comité Económico e Social @pt
preferred label: Talous- ja sosiaalikomitea @fi
preferred label: Ekonomikos ir socialinių reikalų komitetas @lt
preferred label: Ekonomiskā un sociālā komisija @lv
preferred label: Hospodársky a sociálny výbor @sk
preferred label: Kumitat Ekonomiku u Soċjali @mt
preferred label: Gospodarski i socijalni odbor @hr
preferred label: Wirtschafts- und Sozialausschuß @de
preferred label: An Coiste Eacnamaíoch agus Sóisialta @ga
preferred label: Komitet Społeczno-Ekonomiczny @pl
preferred label: Comitetul economic și social @ro
preferred label: Det Økonomiske og Sociale Udvalg @da

European Union Agency for Fundamental Rights
type: Concept
created: 2023-10-31
deprecated: false
broader: Decentralised agency
definition: European Union Agency for Fundamental Rights.
in scheme: EP taxonomy on entities.
preferred label: Euroopan unionin perusoikeusvirasto @fi
preferred label: Οργανισμός Θεμελιωδών Δικαιωμάτων της Ευρωπαϊκής Ένωσης @el
preferred label: Europeiska unionens byrå för grundläggande rättigheter @sv
preferred label: Agencija Evropske unije za temeljne pravice @sl
preferred label: Az Európai Unió Alapjogi Ügynöksége @hu
preferred label: Agentur der Europäischen Union für Grundrechte @de
preferred label: Euroopa Liidu Põhiõiguste Amet @et
preferred label: Agencija Europske unije za temeljna prava @hr
preferred label: Agentura Evropské unie pro základní práva @cs
preferred label: L-Aġenzija tal-Unjoni Ewropea għad-Drittijiet Fundamentali @mt
preferred label: Агенция на Европейския съюз за основните права @bg
preferred label: Agenzia dell’Unione europea per i diritti fondamentali @it
preferred label: Gníomhaireacht an Aontais Eorpaigh um Chearta Bunúsacha @ga
preferred label: Agencia de los Derechos Fundamentales de la Unión Europea @es
preferred label: Agência dos Direitos Fundamentais da União Europeia @pt
preferred label: Eiropas Savienības Pamattiesību aģentūra @lv
preferred label: Agencja Praw Podstawowych Unii Europejskiej @pl
preferred label: Agentúra Európskej únie pre základné práva @sk
preferred label: Den Europæiske Unions Agentur for Grundlæggende Rettigheder @da
preferred label: Bureau van de Europese Unie voor de grondrechten @nl
preferred label: Agenția pentru Drepturi Fundamentale a Uniunii Europene @ro
preferred label: Europos Sąjungos pagrindinių teisių agentūra @lt
preferred label: Agence des droits fondamentaux de l’Union européenne @fr

Swedish Parliament
type: Concept
created: 2023-10-31
deprecated: false
broader: National chamber
definition: Swedish Parliament
in scheme: EP taxonomy on entities.
preferred label: svéd parlament @hu
preferred label: švédský parlament @cs
preferred label: Parlamentului Suediei @ro
preferred label: Švedijos Karalystės Riksdagas @lt
preferred label: Σουηδικό Κοινοβούλιο @el
preferred label: Parlament Żvediż @mt
preferred label: schwedischer Reichstag @de
preferred label: Švedskog parlamenta @hr
preferred label: Риксдаг на Кралство Швеция @bg
preferred label: švédsky parlament @sk
preferred label: švedski parlament @sl
preferred label: de Zweedse Rijksdag @nl
preferred label: Rootsi Riksdag @et
preferred label: Riksdag @pl
preferred label: den svenske Rigsdag @da
preferred label: Sveriges riksdag @sv
preferred label: Ruotsin valtiopäivät @fi
preferred label: Zviedrijas Riksdāgs @lv
preferred label: du Parlement suédois @fr
preferred label: Parlamento sueco @es
preferred label: Pharlaimint na Sualainne @ga
preferred label: Parlamento svedese @it

European Research Council Executive Agency
type: Concept
created: 2023-10-31
deprecated: false
broader: Executive agency
definition: European Research Council Executive Agency.
in scheme: EP taxonomy on entities.
preferred label: Výkonná agentúra Európskej rady pre výskum @sk
preferred label: Exekutivagentur des Europäischen Forschungsrats @de
preferred label: Agencia Ejecutiva del Consejo Europeo de Investigación @es
preferred label: Agencja Wykonawcza Europejskiej Rady ds. Badań Naukowych @pl
preferred label: Agence exécutive du Conseil européen de la recherche @fr
preferred label: Genomförandeorganet för Europeiska forskningsrådet @sv
preferred label: Eiropas Pētniecības padomes izpildaģentūra @lv
preferred label: Изпълнителна агенция на Европейския научноизследователски съвет @bg
preferred label: L-Aġenzija Eżekuttiva Ewropea għall-Kunsill Ewropew tar-Riċerka @mt
preferred label: Izvršna agencija Europskog istraživačkog vijeća @hr
preferred label: Izvajalska agencija Evropskega raziskovalnega sveta @sl
preferred label: Agenzia esecutiva del Consiglio europeo della ricerca @it
preferred label: Euroopa Teadusnõukogu Rakendusamet @et
preferred label: Europos mokslinių tyrimų tarybos vykdomoji įstaiga @lt
preferred label: Az Európai Kutatási Tanács Végrehajtó Ügynöksége @hu
preferred label: An Gníomhaireacht Feidhmiúcháin na Comhairle Eorpaí um Thaighde @ga
preferred label: Εκτελεστικός Οργανισμός του Ευρωπαϊκού Συμβουλίου Έρευνας @el
preferred label: Výkonná agentura Evropské rady pro výzkum @cs
preferred label: Euroopan tutkimusneuvoston toimeenpanovirasto @fi
preferred label: Forvaltningsorganet for Det Europæiske Forskningsråd @da
preferred label: Agência de Execução do Conselho Europeu de Investigação @pt
preferred label: Uitvoerend Agentschap Europese Onderzoeksraad @nl
preferred label: Agenția Executivă a Consiliului European pentru Cercetare @ro

Delegation for relations with the NATO Parliamentary Assembly
type: Concept
created: 2023-10-31
deprecated: false
alternative label: NATO @ro
alternative label: НАТО @bg
alternative label: NAVO @nl
alternative label: Nato @sv
alternative label: OTAN @fr
broader: Temporary parliamentary legislative committee
definition: Delegation for relations with the NATO Parliamentary Assembly.
in scheme: EP taxonomy on entities.
preferred label: Delegationen för förbindelserna med Natos parlamentariska församling @sv
preferred label: Izaslanstvo za odnose s Parlamentarnom skupštinom NATO-a @hr
preferred label: Délégation pour les relations avec l'Assemblée parlementaire de l'OTAN @fr
preferred label: Delegazzjoni għar-relazzjonijiet mal-Assemblea Parlamentari tan-NATO @mt
preferred label: Delegatsioon NATO parlamentaarse assambleega suhtlemiseks @et
preferred label: Delegația pentru relațiile cu Adunarea Parlamentară a NATO @ro
preferred label: Delegationen for Forbindelserne med NATO's Parlamentariske Forsamling @da
preferred label: Delegation für die Beziehungen zur Parlamentarischen Versammlung der NATO @de
preferred label: An Toscaireacht don chaidreamh le Tionól Parlaiminteach ECAT @ga
preferred label: Delegácia pre vzťahy s Parlamentným zhromaždením NATO @sk
preferred label: A NATO Parlamenti Közgyűlésével fenntartott kapcsolatokért felelős küldöttség @hu
preferred label: Delegacja do spraw stosunków ze Zgromadzeniem Parlamentarnym NATO @pl
preferred label: Αντιπροσωπεία για τις σχέσεις με την Κοινοβουλευτική Συνέλευση του ΝΑΤΟ @el
preferred label: Delegācija attiecībām ar NATO Parlamentāro asambleju @lv
preferred label: Делегация за връзки с Парламентарната асамблея на НАТО @bg
preferred label: Delegación para las Relaciones con la Asamblea Parlamentaria de la OTAN @es
preferred label: Delegacija ryšiams su NATO parlamentine asamblėja @lt
preferred label: Delegacija za odnose s parlamentarno skupščino zveze NATO @sl
preferred label: Delegazione per le relazioni con l'Assemblea parlamentare della NATO @it
preferred label: Delegação para as Relações com a Assembleia Parlamentar da NATO @pt
preferred label: Delegatie voor de betrekkingen met de Parlementaire Vergadering van de NAVO @nl
preferred label: Suhteista Naton parlamentaariseen yleiskokoukseen vastaava valtuuskunta @fi
preferred label: Delegace pro vztahy s Parlamentním shromážděním NATO @cs

Committee on the Environment, Climate and Food Safety
type: Concept
created: 2023-10-31
deprecated: false
alternative label: Околна среда, климат и безопасност на храните @bg
alternative label: Aplinka, klimatas ir maisto sauga @lt
alternative label: Miljø, Klima og Fødevaresikkerhed @da
alternative label: Keskkond, kliima ja toiduohutus @et
alternative label: Ambiente, clima e sicurezza alimentare @it
alternative label: Okoliš, klima i sigurnost hrane @hr
alternative label: Περιβάλλον, Κλίμα και Ασφάλεια των Τροφίμων @el
alternative label: Vide, klimats un pārtikas nekaitīgums @lv
alternative label: Environnement, climat et sécurité alimentaire @fr
alternative label: An Comhshaol, an Aeráid agus Sábháilteacht Bia @ga
alternative label: Životní prostředí, klima a bezpečnost potravin @cs
alternative label: Okolje, podnebje in varnost hrane @sl
alternative label: Umwelt, Klima und Lebensmittelsicherheit @de
alternative label: Ambjent, Klima u Sikurezza tal-Ikel @mt
alternative label: Miljö, klimat och livsmedelssäkerhet @sv
alternative label: Životné prostredie, klíma a bezpečnosť potravín @sk
alternative label: Környezetvédelem, éghajlatváltozás és élelmiszer-biztonság @hu
alternative label: Ochrona Środowiska Naturalnego, Klimat i Bezpieczeństwo Żywności @pl
alternative label: Mediu, climă și siguranță alimentară @ro
alternative label: Ympäristö, ilmasto ja elintarvikkeiden turvallisuus @fi
alternative label: Ambiente, Clima e Segurança Alimentar @pt
alternative label: Environment, Climate and Food Safety
alternative label: Milieubeheer, klimaat en voedselveiligheid @nl
alternative label: Medio Ambiente, Clima y Seguridad Alimentaria @es
broader: Standing parliamentary committee
definition: European parliamentary committee on the environment, public health and food safety.
in scheme: EP taxonomy on entities.
preferred label: Odbor za okoliš, klimu i sigurnost hrane @hr
preferred label: Výbor pro životní prostředí, klima a bezpečnost potravin @cs
preferred label: Commission de l’environnement, du climat et de la sécurité alimentaire @fr
preferred label: Комисия по околна среда, климат и безопасност на храните @bg
preferred label: Vides, klimata un pārtikas nekaitīguma komiteja @lv
preferred label: Commissione per l'ambiente, il clima e la sicurezza alimentare @it
preferred label: Commissie milieubeheer, klimaat en voedselveiligheid @nl
preferred label: An Coiste um an gComhshaol, um an Aeráid agus um Shábháilteacht Bia @ga
preferred label: Odbor za okolje, podnebje in varnost hrane @sl
preferred label: Επιτροπή Περιβάλλοντος, Κλίματος και Ασφάλειας των Τροφίμων @el
preferred label: Utskottet för miljö, klimat och livsmedelssäkerhet @sv
preferred label: Keskkonna-, kliima- ja toiduohutuse komisjon @et
preferred label: Comisia pentru mediu, climă și siguranță alimentară @ro
preferred label: Ympäristön, ilmaston ja elintarvikkeiden turvallisuuden valiokunta @fi
preferred label: Výbor pre životné prostredie, klímu a bezpečnosť potravín @sk
preferred label: Ausschuss für Umwelt, Klima und Lebensmittelsicherheit @de
preferred label: Környezetvédelmi, Éghajlatváltozási és Élelmiszer-biztonsági Bizottság @hu
preferred label: Kumitat għall-Ambjent, il-Klima u s-Sikurezza tal-Ikel @mt
preferred label: Comisión de Medio Ambiente, Clima y Seguridad Alimentaria @es
preferred label: Komisja Ochrony Środowiska Naturalnego, Klimatu i Bezpieczeństwa Żywności @pl
preferred label: Udvalget om Miljø, Klima og Fødevaresikkerhed @da
preferred label: Comissão do Ambiente, do Clima e da Segurança Alimentar @pt
preferred label: Aplinkos, klimato ir maisto saugos komitetas @lt

Joint committee procedure - BUDG, INTA and SEDE
type: CorporateBodyClassification
type: Concept
created: 2025-12-31
deprecated: false
alternative label: BUDG, INTA und SEDE @de
alternative label: Commissions conjointes BUDG - INTA - SEDE @fr
alternative label: Joint BUDG - INTA - SEDE
broader: Joint parliamentary committees
definition: Joint committee procedure - BUDG, INTA and SEDE.
in scheme: EP taxonomy on entities.
preferred label: Procédure avec commissions conjointes - BUDG, INTA et SEDE @fr
preferred label: Gemeinsames Ausschussverfahren - BUDG, INTA und SEDE @de

Committee on Employment and Social Affairs
type: Concept
created: 2023-10-31
deprecated: false
alternative label: Tööhõive ja sotsiaalvaldkond @et
alternative label: Zamestnanosť a sociálne veci @sk
alternative label: Zatrudnienie i Sprawy Socjalne @pl
alternative label: Beschäftigung und soziale Angelegenheiten @de
alternative label: Zaměstnanost a sociální věci @cs
alternative label: Zaposlovanje in socialne zadeve @sl
alternative label: Empleo y Asuntos Sociales @es
alternative label: Απασχόληση και Κοινωνικές Υποθέσεις @el
alternative label: Beskæftigelse og Sociale Anliggender @da
alternative label: Occupazione e affari sociali @it
alternative label: Sysselsättning och sociala frågor @sv
alternative label: Emprego e Assuntos Sociais @pt
alternative label: Impjiegi u Affarijiet Soċjali @mt
alternative label: Ocuparea forței de muncă și afaceri sociale @ro
alternative label: Fostaíocht agus Gnóthaí Sóisialta @ga
alternative label: Emploi et affaires sociales @fr
alternative label: Zapošljavanje i socijalna pitanja @hr
alternative label: Заетост и социални въпроси @bg
alternative label: Užimtumas ir socialiniai reikalai @lt
alternative label: Nodarbinātība un sociālās lietas @lv
alternative label: Employment and Social Affairs
alternative label: Foglalkoztatás és szociális ügyek @hu
alternative label: Werkgelegenheid en sociale zaken @nl
alternative label: Työllisyys ja sosiaaliasiat @fi
broader: Standing parliamentary committee
definition: European parliamentary committee on employment and social affairs.
in scheme: EP taxonomy on entities.
preferred label: Comisia pentru ocuparea forței de muncă și afaceri sociale @ro
preferred label: Odbor za zaposlovanje in socialne zadeve @sl
preferred label: Foglalkoztatási és Szociális Bizottság @hu
preferred label: Utskottet för sysselsättning och sociala frågor @sv
preferred label: Kumitat għall-Impjiegi u l-Affarijiet Soċjali @mt
preferred label: Ausschuss für Beschäftigung und soziale Angelegenheiten @de
preferred label: Commissie werkgelegenheid en sociale zaken @nl
preferred label: Výbor pre zamestnanosť a sociálne veci @sk
preferred label: Commissione per l'occupazione e gli affari sociali @it
preferred label: Commission de l'emploi et des affaires sociales @fr
preferred label: Επιτροπή Απασχόλησης και Κοινωνικών Υποθέσεων @el
preferred label: Výbor pro zaměstnanost a sociální věci @cs
preferred label: Comissão do Emprego e dos Assuntos Sociais @pt
preferred label: Comisión de Empleo y Asuntos Sociales @es
preferred label: Komisja Zatrudnienia i Spraw Socjalnych @pl
preferred label: Työllisyyden ja sosiaaliasioiden valiokunta @fi
preferred label: Užimtumo ir socialinių reikalų komitetas @lt
preferred label: Odbor za zapošljavanje i socijalna pitanja @hr
preferred label: Udvalget om Beskæftigelse og Sociale Anliggender @da
preferred label: Комисия по заетост и социални въпроси @bg
preferred label: An Coiste um Fhostaíocht agus um Ghnóthaí Sóisialta @ga
preferred label: Tööhõive- ja sotsiaalkomisjon @et
preferred label: Nodarbinātības un sociālo lietu komiteja @lv

European Investment Bank
type: Concept
created: 2023-10-31
deprecated: false
broader: EU body
definition: The European Investment Bank owned by the 27 member states.
in scheme: EP taxonomy on entities.
preferred label: Banco Europeo de Inversiones @es
preferred label: Европейска инвестиционна банка @bg
preferred label: Den Europæiske Investeringsbank @da
preferred label: Evropska investicijska banka @sl
preferred label: Banca europeană de investiții @ro
preferred label: Banca europea per gli investimenti @it
preferred label: An Banc Infheistíochta Eorpach @ga
preferred label: Európska investičná banka @sk
preferred label: Banco Europeu de Investimento @pt
preferred label: Europos investicijų bankas @lt
preferred label: Europäische Investitionsbank @de
preferred label: Euroopa Investeerimispank @et
preferred label: Europejski Bank Inwestycyjny @pl
preferred label: Ευρωπαϊκή Τράπεζα Επενδύσεων @el
preferred label: Banque européenne d'investissement @fr
preferred label: Europska investicijska banka @hr
preferred label: Eiropas Investīciju banka @lv
preferred label: Europese Investeringsbank @nl
preferred label: Euroopan investointipankki @fi
preferred label: Bank Ewropew ta’ l-Investiment @mt
preferred label: Evropská investiční banka @cs
preferred label: Európai Befektetési Bank @hu
preferred label: Europeiska investeringsbanken @sv

Joint committee procedure - IMCO and JURI
type: Concept
created: 2023-10-31
deprecated: false
alternative label: IMCO und JURI @de
alternative label: Commissions conjointes IMCO - JURI @fr
alternative label: Joint IMCO - JURI
broader: Joint parliamentary committees
definition: Joint committee procedure - IMCO and JURI.
in scheme: EP taxonomy on entities.
preferred label: Gemeinsames Ausschussverfahren - IMCO und JURI @de
preferred label: Procédure avec commissions conjointes - IMCO et JURI @fr

Dáil Éireann
type: Concept
created: 2023-10-31
deprecated: false
broader: National chamber
definition: Dáil Éireann.
in scheme: EP taxonomy on entities.
preferred label: ír képviselőház @hu
preferred label: Irlannin edustajainhuone @fi
preferred label: Ιρλανδική Βουλή των Αντιπροσώπων @el
preferred label: Kamra tar-Rappreżentanti Irlandiża @mt
preferred label: Camera dei deputati irlandese @it
preferred label: Камара на представителите на Ирландия @bg
preferred label: Câmara dos Representantes irlandesa @pt
preferred label: irski Zastupnički dom @hr
preferred label: Den irländska deputeradekammaren @sv
preferred label: Airijos Atstovų Rūmai @lt
preferred label: irská Poslanecké sněmovna @cs
preferred label: det irske Repræsentanternes Hus @da
preferred label: Iirimaa Esindajatekoda @et
preferred label: Cámara de Representantes irlandesa @es
preferred label: Īrijas parlamenta Pārstāvju palāta @lv
preferred label: Ierse Kamer van Volksvertegenwoordigers @nl
preferred label: Camera Deputaților din Irlanda @ro
preferred label: irska poslanska zbornica @sl
preferred label: Chambre des représentants irlandaise @fr
preferred label: Izba Reprezentantów Irlandii @pl
preferred label: írska Poslanecká snemovňa @sk
preferred label: irisches Abgeordnetenhaus @de

European Union Agency for Law Enforcement Cooperation
type: Concept
created: 2023-10-31
deprecated: false
broader: Decentralised agency
definition: European Union Agency for Law Enforcement Cooperation.
in scheme: EP taxonomy on entities.
preferred label: Europeiska unionens byrå för samarbete inom brottsbekämpning @sv
preferred label: Gníomhaireacht an Aontais Eorpaigh i ndáil le Comhar i bhForfheidhmiú an Dlí @ga
preferred label: Agentschap van de Europese Unie voor samenwerking op het gebied van rechtshandhaving @nl
preferred label: Agenția Uniunii Europene pentru Cooperare în Materie de Aplicare a Legii @ro
preferred label: Agence de l’Union européenne pour la coopération des services répressifs @fr
preferred label: Den Europæiske Unions Agentur for Retshåndhævelsessamarbejde @da
preferred label: Euroopan unionin lainvalvontayhteistyövirasto @fi
preferred label: Agentur der Europäischen Union für die Zusammenarbeit auf dem Gebiet der Strafverfolgung @de
preferred label: Eiropas Savienības Aģentūra tiesībaizsardzības sadarbībai @lv
preferred label: Агенция на Европейския съюз за сътрудничество в областта на правоприлагането @bg
preferred label: L-Aġenzija tal-Unjoni Ewropea għall-Kooperazzjoni fl-Infurzar tal-Liġi @mt
preferred label: Agencja Unii Europejskiej ds. Współpracy Organów Ścigania @pl
preferred label: Agência da União Europeia para a Cooperação Policial @pt
preferred label: Agencija Europske unije za suradnju tijela za izvršavanje zakonodavstva @hr
preferred label: A Bűnüldözési Együttműködés Európai Uniós Ügynöksége @hu
preferred label: Οργανισμός της Ευρωπαϊκής Ένωσης για τη Συνεργασία στον Τομέα της Επιβολής του Νόμου @el
preferred label: Agencia de la Unión Europea para la Cooperación Policial @es
preferred label: Agentúra Európskej únie pre spoluprácu v oblasti presadzovania práva @sk
preferred label: Agencija Evropske unije za sodelovanje na področju preprečevanja, odkrivanja in preiskovanja kaznivih dejanj @sl
preferred label: Agentura Evropské unie pro spolupráci v oblasti prosazování práva @cs
preferred label: Agenzia dell’Unione europea per la cooperazione nell’attività di contrasto @it
preferred label: Euroopa Liidu Õiguskaitsekoostöö Amet @et
preferred label: Europos Sąjungos teisėsaugos bendradarbiavimo agentūra @lt

EP taxonomy on entities.
type: ConceptScheme
created: 2023-10-31
creator: EP
description: Taxonomy of the European Parliament on entities.
modified: 2026-01-31
version info: 2026-01-31_1

Delegation to the EU-North Macedonia Joint Parliamentary Committee
type: Concept
created: 2023-10-31
deprecated: false
alternative label: North Macedonia
alternative label: Macedonia de Nord @ro
alternative label: Macedonia del Nord @it
alternative label: Severna Makedonija @sl
alternative label: Северна Македония @bg
alternative label: Sjeverna Makedonija @hr
alternative label: Macedonia del Norte @es
alternative label: Pohjois-Makedonian @fi
alternative label: Nordmazedonien @de
alternative label: Maċedonja ta' Fuq @mt
alternative label: Noord-Macedonië @nl
alternative label: Severné Macedónsko @sk
alternative label: Šiaurės Makedonija @lt
alternative label: Nordmakedonien @da
alternative label: Macédoine du Nord @fr
alternative label: Ziemeļmaķedonija @lv
alternative label: An Mhacadóin Thuaidh @ga
alternative label: Βόρεια Μακεδονία @el
alternative label: Macedonia Północna @pl
alternative label: Macedónia do Norte @pt
alternative label: Severní Makedonie @cs
alternative label: Észak-Macedónia @hu
alternative label: Põhja-Makedoonia @et
broader: Delegation to Joint Parliamentary Committee
definition: Delegation to the EU-North Macedonia Joint Parliamentary Committee.
in scheme: EP taxonomy on entities.
preferred label: Delegazzjoni għall-Kumitat Parlamentari Konġunt UE-Maċedonja ta' Fuq @mt
preferred label: Delegación en la Comisión Parlamentaria Mixta UE-Macedonia del Norte @es
preferred label: Delegationen til Det Blandede Parlamentariske Udvalg EU-Nordmakedonien @da
preferred label: Delegationen till den gemensamma parlamentarikerkommittén EU-Nordmakedonien @sv
preferred label: Valtuuskunta EU:n ja Pohjois-Makedonian parlamentaarisessa sekavaliokunnassa @fi
preferred label: Az EU–Észak-Macedónia Parlamenti Vegyes Bizottságba delegált küldöttség @hu
preferred label: Delegation im Gemischten Parlamentarischen Ausschuss EU-Nordmazedonien @de
preferred label: Delegacja do Wspólnej Komisji Parlamentarnej UE-Macedonia Północna @pl
preferred label: Délégation à la commission parlementaire mixte UE-Macédoine du Nord @fr
preferred label: Αντιπροσωπεία στη Μικτή Κοινοβουλευτική Επιτροπή ΕΕ-Βόρειας Μακεδονίας @el
preferred label: Delegatie in de Gemengde Parlementaire Commissie EU-Noord-Macedonië @nl
preferred label: Delegatsioon ELi – Põhja-Makedoonia parlamentaarses ühiskomisjonis @et
preferred label: Delegazione alla commissione parlamentare mista UE-Macedonia del Nord @it
preferred label: Delegação à Comissão Parlamentar Mista UE-Macedónia do Norte @pt
preferred label: Delegacija pri skupnem parlamentarnem odboru EU-Severna Makedonija @sl
preferred label: Delegația la Comisia parlamentară mixtă UE-Macedonia de Nord @ro
preferred label: An Toscaireacht chun an Chomhchoiste Pharlaimintigh idir AE agus an Mhacadóin Thuaidh @ga
preferred label: Delegācija ES un Ziemeļmaķedonijas apvienotajā parlamentārajā komitejā @lv
preferred label: Delegacija ES ir Šiaurės Makedonijos jungtiniame parlamentiniame komitete @lt
preferred label: Izaslanstvo u Zajedničkom parlamentarnom odboru EU-a i Sjeverne Makedonije @hr
preferred label: Delegace ve Smíšeném parlamentním výboru EU-Severní Makedonie @cs
preferred label: Делегация в Съвместния парламентарен комитет ЕС – Северна Македония @bg
preferred label: Delegácia pri Spoločnom parlamentnom výbore EÚ – Severné Macedónsko @sk

Delegation for relations with the Member States of ASEAN, south-east Asia and the Republic of Korea
type: Concept
created: 2023-10-31
deprecated: true
broader: Parliamentary delegation
definition: Delegation for relations with the Member States of ASEAN, south-east Asia and the Republic of Korea.
in scheme: EP taxonomy on entities.
preferred label: Делегация за връзки с държавите-членки на АСЕАН, Югоизточна Азия и Република Корея @bg
preferred label: Izaslanstvo za odnose s državama članicama ASEAN-a, Jugoistočnom Azijom i Republikom Korejom @hr
preferred label: Az ASEAN tagállamaival, Délkelet-Ázsiával és a Koreai Köztársasággal folytatott kapcsolatokért felelős küldöttség @hu
preferred label: Suhteista ASEANin jäsenmaihin, Kaakkois-Aasiaan ja Korean tasavaltaan vastaava valtuuskunta @fi
preferred label: Delegația pentru relațiile cu țările membre ale ASEAN, Asia de Sud-Est și cu Republica Coreea @ro
preferred label: Delegatie voor de betrekkingen met de lidstaten van de ASEAN, Zuidoost-Azië en de Republiek Korea @nl
preferred label: Αντιπροσωπεία για τις σχέσεις με τις χώρες μέλη του ΑSΕAN, τη Νοτιοανατολική Ασία και τη Δημοκρατία της Κορέας @el
preferred label: Delegationen for Forbindelserne med Medlemslandene af ASEAN, Landene i Sydøstasien og Republikken Korea @da
preferred label: Delegatsioon ASEANi liikmesriikide, Kagu-Aasia ja Korea Vabariigiga suhtlemiseks @et
preferred label: Delegacija ryšiams su ASEAN (Pietryčių Azijos valstybių asociacija) šalimis narėmis, pietryčių Azija ir Korėjos Respublika @lt
preferred label: Délégation pour les relations avec les pays membres de l'ANASE, le Sud-Est asiatique et la République de Corée @fr
preferred label: Toscaireacht don chaidreamh le Ballstáit ASEAN, Oirdheisceart na hÁise agus Poblacht na Cóiré @ga
preferred label: Delegácia pre vzťahy s členskými štátmi ASEAN-u, juhovýchodnou Áziou a Kórejskou republikou @sk
preferred label: Delegazzjoni ghar-relazzjonijiet ma’ l-Istati Membri ta’ l-ASEAN, l-Azja ta’nofsinhar-lvant u r-Repubblika tal-Korea @mt
preferred label: Delegação para as Relações com os Países Membros da ANASE, o Sudeste Asiático e a República da Coreia @pt
preferred label: Delegation für die Beziehungen zu den Mitgliedsländern der ASEAN, Südostasien und der Republik Korea @de
preferred label: Delegācija attiecībām ar ASEAN dalībvalstīm, Dienvidaustrumu Āziju un Korejas Republiku @lv
preferred label: Delegazione per le relazioni con i paesi membri dell'ASEAN, il Sud-Est asiatico e la Repubblica di Corea @it
preferred label: Delegación para las Relaciones con los Países Miembros de la ASEAN, el Sudeste Asiático y la República de Corea @es
preferred label: Delegacja do spraw stosunków z państwami ASEAN, Azji Południowo-Wschodniej i Republiką Korei @pl
preferred label: Delegationen för förbindelserna med Aseans medlemsländer, länderna i Sydostasien och Republiken Korea @sv
preferred label: Delegace pro vztahy s členskými státy sdružení ASEAN, jihovýchodní Asie a Korejské republiky @cs
preferred label: Delegacija za odnose z državami članicami ASEAN-a, jugovzhodno Azijo in Republiko Korejo @sl

Austrian Federal Council
type: Concept
created: 2023-10-31
deprecated: false
broader: National chamber
definition: Austrian Federal Council.
in scheme: EP taxonomy on entities.
preferred label: Itävallan liittoneuvosto @fi
preferred label: Consiliul Federal al Austriei @ro
preferred label: avstrijski zvezni svet @sl
preferred label: Oostenrijkse Bondsraad @nl
preferred label: det østrigske Forbundsråd @da
preferred label: rakúska Spolková rada @sk
preferred label: Consejo Federal austríaco @es
preferred label: osztrák szövetségi tanács @hu
preferred label: austrijsko Savezno vijeće @hr
preferred label: Федерален съвет на Република Австрия @bg
preferred label: Comhairle Chónaidhme na hOstaire @ga
preferred label: Austrijos Respublikos Bundesratas @lt
preferred label: Austrijas Federālā padome @lv
preferred label: Rada Związkowa Austrii @pl
preferred label: Consiglio federale austriaco @it
preferred label: Det österrikiska förbundsrådet @sv
preferred label: Kunsill Federali Awstrijak @mt
preferred label: Conselho Federal austríaco @pt
preferred label: Conseil fédéral autrichien @fr
preferred label: Austria Liidunõukogu @et
preferred label: österreichischer Bundesrat @de
preferred label: Αυστριακό Ομοσπονδιακό Συμβούλιο @el
preferred label: rakouská Spolková rada @cs

European Insurance and Occupational Pensions Authority
type: Concept
created: 2023-10-31
deprecated: false
broader: Decentralised agency
definition: European Insurance and Occupational Pensions Authority.
in scheme: EP taxonomy on entities.
preferred label: Euroopan vakuutus- ja lisäeläkeviranomainen @fi
preferred label: Európai Biztosítás- és Foglalkoztatóinyugdíj-hatóság @hu
preferred label: Európsky orgán pre poisťovníctvo a dôchodkové poistenie zamestnancov @sk
preferred label: Evropský orgán pro pojišťovnictví a zaměstnanecké penzijní pojištění @cs
preferred label: Den Europæisk Tilsynsmyndighed for Forsikrings- og Arbejdsmarkedspensionsordninger @da
preferred label: Europäische Aufsichtsbehörde für das Versicherungswesen und die betriebliche Altersversorgung @de
preferred label: An tÚdarás Eorpach um Árachas agus Pinsin Cheirde @ga
preferred label: Europejski Urząd Nadzoru Ubezpieczeń i Pracowniczych Programów Emerytalnych @pl
preferred label: Evropski organ za zavarovanja in poklicne pokojnine @sl
preferred label: Europeiska försäkrings- och tjänstepensionsmyndigheten @sv
preferred label: Ευρωπαϊκή Αρχή Ασφαλίσεων και Επαγγελματικών Συντάξεων @el
preferred label: Europos draudimo ir profesinių pensijų institucija @lt
preferred label: Eiropas Apdrošināšanas un aroda pensiju iestāde @lv
preferred label: Европейски орган за застраховане и професионално пенсионно осигуряване @bg
preferred label: L-Awtorità Ewropea tal-Assigurazzjoni u l-Pensjonijiet tax-Xogħol @mt
preferred label: Autoridad Europea de Seguros y Pensiones de Jubilación @es
preferred label: Autorità europea delle assicurazioni e delle pensioni aziendali e professionali @it
preferred label: Autorité européenne des assurances et des pensions professionnelles @fr
preferred label: Europsko nadzorno tijelo za osiguranje i strukovno mirovinsko osiguranje @hr
preferred label: Europese Autoriteit voor verzekeringen en bedrijfspensioenen @nl
preferred label: Euroopa Kindlustus- ja Tööandjapensionide Järelevalve @et
preferred label: Autoritatea Europeană de Asigurări şi Pensii Ocupaţionale @ro
preferred label: Autoridade Europeia dos Seguros e Pensões Complementares de Reforma @pt

Parliamentary delegation
type: CorporateBodyClassification
type: Concept
created: 2023-10-31
deprecated: false
broader: European Parliament
definition: Parliamentary Delegation of the European Parliament.
in scheme: EP taxonomy on entities.
preferred label: Parlamentná delegácia @sk
preferred label: Delegazzjoni Parlamentari @mt
preferred label: Parlamentarna delegacija @sl
preferred label: Delegación parlamentaria @es
preferred label: Delegação parlamentar @pt
preferred label: Κοινοβουλευτική αντιπροσωπεία @el
preferred label: Delegation til Europa-Parlamentet @da
preferred label: Parlamenti küldöttség @hu
preferred label: Parlementaire delegatie @nl
preferred label: Parlamentin valtuuskunta @fi
preferred label: Toscaireacht pharlaiminteach @ga
preferred label: Parlamento delegacija @lt
preferred label: Parlamendi delegatsioon @et
preferred label: Parlamentarische Delegation @de
preferred label: Délégation parlementaire @fr
preferred label: Delegazione parlamentare @it
preferred label: Delegacja parlamentarna @pl
preferred label: Parlamentarno izaslanstvo @hr
preferred label: Parlamenta delegācija @lv
preferred label: Парламентарна делегация @bg
preferred label: Parlamentarisk delegation @sv
preferred label: Parlamentní delegace @cs
preferred label: Delegația parlamentară @ro

National entities
type: Concept
created: 2025-04-30
deprecated: false
definition: National entities.
in scheme: EP taxonomy on entities.
preferred label: Entidades nacionales @es
preferred label: Nemzeti szervek @hu
preferred label: Entidades nacionais @pt
preferred label: Vnitrostátní subjekty @cs
preferred label: Εθνικές οντότητες @el
preferred label: Entités nationales @fr
preferred label: Valsts iestādes @lv
preferred label: Kansalliset yksiköt @fi
preferred label: Entități naționale @ro
preferred label: Nacionalna tijela @hr
preferred label: Entitajiet nazzjonali @mt
preferred label: Nacionalni subjekti @sl
preferred label: Podmioty krajowe @pl
preferred label: Nationale enheder @da
preferred label: Nationale Einrichtungen @de
preferred label: Nationale entiteiten @nl
preferred label: Eintitis náisiúnta @ga
preferred label: Riiklikud üksused @et
preferred label: Nationella enheter @sv
preferred label: Vnútroštátne subjekty @sk
preferred label: Nacionaliniai subjektai @lt
preferred label: Enti nazionali @it
preferred label: Национални органи @bg
top concept of: EP taxonomy on entities.

Joint committee procedure - ENVI, IMCO and TRAN
type: CorporateBodyClassification
type: Concept
created: 2025-12-31
deprecated: false
alternative label: ENVI, IMCO und TRAN @de
alternative label: Commissions conjointes ENVI - IMCO - TRAN @fr
alternative label: Joint ENVI - IMCO - TRAN
broader: Joint parliamentary committees
definition: Joint committee procedure - ENVI and IMCO.
in scheme: EP taxonomy on entities.
preferred label: Procédure avec commissions conjointes - ENVI, IMCO et TRAN @fr
preferred label: Gemeinsames Ausschussverfahren - ENVI, IMCO und TRAN @de

Delegation for relations with Canada
type: Concept
created: 2023-10-31
deprecated: false
alternative label: Kanāda @lv
alternative label: Καναδάς @el
alternative label: Canadá @es
alternative label: Ceanada @ga
alternative label: Canada
alternative label: Kanada @et
alternative label: Канада @bg
broader: Parliamentary delegation
definition: Delegation for relations with Canada.
in scheme: EP taxonomy on entities.
preferred label: Delegācija attiecībām ar Kanādu @lv
preferred label: Delegazione per le relazioni con il Canada @it
preferred label: Delegace pro vztahy s Kanadou @cs
preferred label: Delegación para las Relaciones con Canadá @es
preferred label: Делегация за връзки с Канада @bg
preferred label: Delegácia pre vzťahy s Kanadou @sk
preferred label: Delegationen för förbindelserna med Kanada @sv
preferred label: Delegacija za odnose s Kanado @sl
preferred label: Delegação para as Relações com o Canadá @pt
preferred label: Suhteista Kanadaan vastaava valtuuskunta @fi
preferred label: Izaslanstvo za odnose s Kanadom @hr
preferred label: Delegatsioon Kanadaga suhtlemiseks @et
preferred label: Delegationen for Forbindelserne med Canada @da
preferred label: An Toscaireacht don chaidreamh le Ceanada @ga
preferred label: Delegation für die Beziehungen zu Kanada @de
preferred label: Delegacja do spraw stosunków z Kanadą @pl
preferred label: Αντιπροσωπεία για τις σχέσεις με τον Καναδά @el
preferred label: Delegatie voor de betrekkingen met Canada @nl
preferred label: Delegacija ryšiams su Kanada @lt
preferred label: A Kanadával fenntartott kapcsolatokért felelős küldöttség @hu
preferred label: Delegazzjoni għar-relazzjonijiet mal-Kanada @mt
preferred label: Delegația pentru relațiile cu Canada @ro
preferred label: Délégation pour les relations avec le Canada @fr

Joint committee procedure - ENVI and SEDE
type: Concept
created: 2025-04-30
deprecated: false
alternative label: ENVI und SEDE @de
alternative label: Commissions conjointes ENVI - SEDE @fr
alternative label: Joint ENVI - SEDE
broader: Joint parliamentary committees
definition: Joint committee procedure - ENVI and SEDE.
in scheme: EP taxonomy on entities.
preferred label: Gemeinsames Ausschussverfahren - ENVI und SEDE @de
preferred label: Procédure avec commissions conjointes - ENVI et SEDE @fr

European Public Prosecutor’s Office
type: Concept
created: 2023-10-31
deprecated: false
broader: Decentralised agency
definition: European Public Prosecutor’s Office.
in scheme: EP taxonomy on entities.
preferred label: Procuradoria Europeia @pt
preferred label: Ured europskog javnog tužitelja @hr
preferred label: Europees Openbaar Ministerie @nl
preferred label: Európska prokuratúra @sk
preferred label: Fiscalía Europea @es
preferred label: Den Europæiske Anklagemyndighed @da
preferred label: Euroopa Prokuratuur @et
preferred label: L-Uffiċċju tal-Prosekutur Pubbliku Ewropew @mt
preferred label: Europos prokuratūra @lt
preferred label: Ευρωπαϊκή Εισαγγελία @el
preferred label: Parchetul European @ro
preferred label: Úřad evropského veřejného žalobce @cs
preferred label: Evropsko javno tožilstvo @sl
preferred label: Prokuratura Europejska @pl
preferred label: Eiropas Prokuratūra @lv
preferred label: Oifig an Ionchúisitheora Phoiblí Eorpaigh @ga
preferred label: Euroopan syyttäjänvirasto @fi
preferred label: Parquet européen @fr
preferred label: Europäische Staatsanwaltschaft @de
preferred label: Европейска прокуратура @bg
preferred label: Európai Ügyészség @hu
preferred label: Europeiska åklagarmyndigheten @sv
preferred label: Procura europea @it

EU agency
type: Concept
created: 2023-10-31
deprecated: false
definition: European agency.
in scheme: EP taxonomy on entities.
preferred label: Aġenzija tal-UE @mt
preferred label: EU:n virasto @fi
preferred label: EU-byrå @sv
preferred label: Agentura EU @cs
preferred label: Agencija EU-a @hr
preferred label: Οργανισμός της ΕΕ @el
preferred label: EU-agentschap @nl
preferred label: ES agentūra @lt
preferred label: EU-ügynökség @hu
preferred label: Agencia de la UE @es
preferred label: Gníomhaireacht de chuid an AE @ga
preferred label: Agenzia dell’UE @it
preferred label: EU-agentur @da
preferred label: Agentúra EÚ @sk
preferred label: Agência da UE @pt
preferred label: Agencija EU @sl
preferred label: ELi asutus @et
preferred label: Agenție a UE @ro
preferred label: Agencja UE @pl
preferred label: EU-Agentur @de
preferred label: Agence de l’UE @fr
preferred label: Агенция на ЕС @bg
preferred label: ES aģentūra @lv

Joint committee procedure - ECON and FEMM
type: Concept
created: 2023-10-31
deprecated: false
alternative label: ECON und FEMM @de
alternative label: Commissions conjointes ECON - FEMM @fr
alternative label: Joint ECON - FEMM
broader: Joint parliamentary committees
definition: Joint committee procedure - ECON and FEMM.
in scheme: EP taxonomy on entities.
preferred label: Gemeinsames Ausschussverfahren - ECON und FEMM @de
preferred label: Procédure avec commissions conjointes - ECON et FEMM @fr

European Parliament
type: Concept
created: 2023-10-31
deprecated: false
broader: EU institution
definition: European Parliament.
in scheme: EP taxonomy on entities.
preferred label: Evropski parlament @sl
preferred label: Európai Parlament @hu
preferred label: Eiropas Parlaments @lv
preferred label: Parlaimint na hEorpa @ga
preferred label: Europäisches Parlament @de
preferred label: Europaparlamentet @sv
preferred label: Parlamento Europeo @es
preferred label: Euroopa Parlament @et
preferred label: Ευρωπαϊκό Κοινοβούλιο @el
preferred label: Europos Parlamentas @lt
preferred label: Evropský parlament @cs
preferred label: Parlament Ewropew @mt
preferred label: Европейски парламент @bg
preferred label: Europski parlament @hr
preferred label: Parlamento Europeu @pt
preferred label: Parlement européen @fr
preferred label: Europa-Parlamentet @da
preferred label: Parlament Europejski @pl
preferred label: Europees Parlement @nl
preferred label: Parlamento europeo @it
preferred label: Európsky parlament @sk
preferred label: Euroopan parlamentti @fi
preferred label: Parlamentul European @ro

Special committee on financial crimes, tax evasion and tax avoidance
type: Concept
created: 2023-10-31
deprecated: true
alternative label: Οικονομικό έγκλημα, φοροδιαφυγή και φοροαποφυγή @el
alternative label: Il-kriminalità finanzjarja, l-evażjoni tat-taxxa u l-evitar tat-taxxa @mt
alternative label: Finančná trestná činnosť, vyhýbanie sa daňovým povinnostiam a daňové úniky @sk
alternative label: Talousrikokset, veropetokset ja veronkierto @fi
alternative label: Finansinių nusikaltimų, mokesčių vengimo ir slėpimo klausimai @lt
alternative label: Coireanna airgeadais, seachaint cánach agus imghabháil cánach @ga
alternative label: Criminalité financière, fraude fiscale et évasion fiscale @fr
alternative label: Financijski kriminal, utaja poreza i izbjegavanje plaćanja poreza @hr
alternative label: Økonomisk Kriminalitet, Skatteunddragelse og Skatteundgåelse @da
alternative label: Financial crimes, tax evasion and tax avoidance
alternative label: Ekonomisk brottslighet, skatteundandragande och skatteflykt @sv
alternative label: Delitos Financieros y Evasión y Elusión Fiscales @es
alternative label: Finančni kriminal, davčna utaja in izogibanje davkom @sl
alternative label: Finanční trestné činy, vyhýbání se daňovým povinnostem a daňové úniky @cs
alternative label: Финансови престъпления, данъчни измами и избягване на данъци @bg
alternative label: Przestępstwa Finansowe, Uchylanie się od Opodatkowania i Unikanie Opodatkowania @pl
alternative label: Financiële misdrijven, belastingontduiking en belastingontwijking @nl
alternative label: Infracțiunil financiare, evaziunea fiscală și evitarea obligațiilor fiscale @ro
alternative label: Finanšu noziegumi, izvairīšanās no nodokļu maksāšanas un nodokļu apiešana @lv
alternative label: Reati finanziari, evasione fiscale ed elusione fiscale @it
alternative label: Finanzkriminalität, Steuerhinterziehung und Steuervermeidung @de
alternative label: Finantskuriteod, maksudest kõrvalehoidumine ja maksustamise vältimine @et
alternative label: Pénzügyi bűncselekmények, adókijátszási és adókikerülési ügyek @hu
alternative label: Crimes Financeiros e Elisão e Evasão Fiscais @pt
broader: Special parliamentary committee
definition: TAXE will notably look into the compatibility of tax rulings, which basically aim at clarifying in advance how to interpret and apply national tax legislation, with State Aid rules and taxation law.(PANA, TAXE, TAX2, TAX3).
in scheme: EP taxonomy on entities.
narrow match: EP TAX2
narrow match: https://data.europarl.europa.eu/org/4926
narrow match: EP TAX3
narrow match: https://data.europarl.europa.eu/org/5047
narrow match: https://data.europarl.europa.eu/org/4899
narrow match: EP TAXE
preferred label: Osobitný výbor pre finančnú trestnú činnosť, vyhýbanie sa daňovým povinnostiam a daňové úniky @sk
preferred label: Comissão Especial sobre os Crimes Financeiros e a Elisão e a Evasão Fiscais @pt
preferred label: Talousrikoksia, veropetoksia ja veronkiertoa käsittelevä erityisvaliokunta @fi
preferred label: Kumitat Speċjali dwar il-kriminalità finanzjarja, l-evażjoni tat-taxxa u l-evitar tat-taxxa @mt
preferred label: Sonderausschuss zu Finanzkriminalität, Steuerhinterziehung und Steuervermeidung @de
preferred label: Īpašā komiteja finanšu noziegumu, izvairīšanās no nodokļu maksāšanas un nodokļu apiešanas jautājumos @lv
preferred label: Det Særlige Udvalg om Økonomisk Kriminalitet, Skatteunddragelse og Skatteundgåelse @da
preferred label: Bijzondere Commissie financiële misdrijven, belastingontduiking en belastingontwijking @nl
preferred label: Specialusis komitetas finansinių nusikaltimų, mokesčių vengimo ir slėpimo klausimais @lt
preferred label: Специална комисия относно финансовите престъпления, данъчните измами и избягването на данъци @bg
preferred label: Finantskuritegusid, maksudest kõrvalehoidumist ja maksustamise vältimist käsitlev erikomisjon @et
preferred label: Ειδική επιτροπή σχετικά με το οικονομικό έγκλημα, τη φοροδιαφυγή και τη φοροαποφυγή @el
preferred label: An coiste speisialta um choireanna airgeadais, um sheachaint cánach agus um imghabháil cánach @ga
preferred label: Särskilda utskottet för frågor om ekonomisk brottslighet, skatteundandragande och skatteflykt @sv
preferred label: Commissione speciale sui reati finanziari, l'evasione fiscale e l'elusione fiscale @it
preferred label: Zvláštní výbor pro finanční trestné činy, vyhýbání se daňovým povinnostem a daňové úniky @cs
preferred label: Commission spéciale sur la criminalité financière, la fraude fiscale et l'évasion fiscale @fr
preferred label: Pénzügyi bűncselekmények, adókijátszási és adókikerülési ügyek különbizottsága @hu
preferred label: Comisión Especial sobre Delitos Financieros y Evasión y Elusión Fiscales @es
preferred label: Komisja Specjalna ds. Przestępstw Finansowych, Uchylania się od Opodatkowania i Unikania Opodatkowania @pl
preferred label: Posebni odbor o finančnem kriminalu, davčni utaji in izogibanju davkom @sl
preferred label: Posebni odbor za financijski kriminal, utaju poreza i izbjegavanje plaćanja poreza @hr
preferred label: Comisia specială privind infracțiunile financiare, evaziunea fiscală și evitarea obligațiilor fiscale @ro

Committee on Economic and Monetary Affairs
type: Concept
created: 2023-10-31
deprecated: false
alternative label: Affarijiet Ekonomiċi u Monetarji @mt
alternative label: Sprawy Gospodarcze i Monetarne @pl
alternative label: Økonomi og Valuta @da
alternative label: Hospodářství a měna @cs
alternative label: Ekonomske in monetarne zadeve @sl
alternative label: Икономически и парични въпроси @bg
alternative label: Majandus ja rahandus @et
alternative label: Ekonomi och valutafrågor @sv
alternative label: Ekonomikos ir pinigų politika @lt
alternative label: Οικονομική και Νομισματική Πολιτική @el
alternative label: Economic and Monetary Affairs
alternative label: Talous- ja raha-asiat @fi
alternative label: Assuntos Económicos e Monetários @pt
alternative label: Asuntos Económicos y Monetarios @es
alternative label: Problemi economici e monetari @it
alternative label: Ekonomska i monetarna politika @hr
alternative label: Gnóthaí Eacnamaíochta agus Airgeadaíochta @ga
alternative label: Ekonomikas un monetārie jautājumi @lv
alternative label: Hospodárske a menové veci @sk
alternative label: Wirtschaft und Währung @de
alternative label: Economische en monetaire zaken @nl
alternative label: Afaceri economice și monetare @ro
alternative label: Affaires économiques et monétaires @fr
alternative label: Gazdasági és monetáris ügyek @hu
broader: Standing parliamentary committee
definition: European parliamentary committee on economic and monetary affairs.
in scheme: EP taxonomy on entities.
preferred label: Comisia pentru afaceri economice și monetare @ro
preferred label: Výbor pre hospodárske a menové veci @sk
preferred label: Komisja Gospodarcza i Monetarna @pl
preferred label: Hospodářský a měnový výbor @cs
preferred label: Utskottet för ekonomi och valutafrågor @sv
preferred label: Gazdasági és Monetáris Bizottság @hu
preferred label: Økonomi- og Valutaudvalget @da
preferred label: Odbor za ekonomske in monetarne zadeve @sl
preferred label: Commissione per i problemi economici e monetari @it
preferred label: Odbor za ekonomsku i monetarnu politiku @hr
preferred label: Ausschuss für Wirtschaft und Währung @de
preferred label: Majandus- ja rahanduskomisjon @et
preferred label: Comissão dos Assuntos Económicos e Monetários @pt
preferred label: Επιτροπή Οικονομικής και Νομισματικής Πολιτικής @el
preferred label: Commissie economische en monetaire zaken @nl
preferred label: Talous- ja raha-asioiden valiokunta @fi
preferred label: Ekonomikos ir pinigų politikos komitetas @lt
preferred label: Комисия по икономически и парични въпроси @bg
preferred label: Kumitat għall-Affarijiet Ekonomiċi u Monetarji @mt
preferred label: Ekonomikas un monetārā komiteja @lv
preferred label: Comisión de Asuntos Económicos y Monetarios @es
preferred label: An Coiste um Ghnóthaí Eacnamaíochta agus Airgeadaíochta @ga
preferred label: Commission des affaires économiques et monétaires @fr

Joint committee procedure - AGRI, EMPL and REGI
type: Concept
created: 2025-08-31
deprecated: false
alternative label: Joint AGRI - EMPL - REGI
alternative label: Commissions conjointes AGRI - EMPL - REGI @fr
alternative label: AGRI, EMPL und REGI @de
broader: Joint parliamentary committees
definition: Joint committee procedure - AGRI, EMPL and REGI.
in scheme: EP taxonomy on entities.
preferred label: Procédure avec commissions conjointes - AGRI, EMPL et REGI @fr
preferred label: Gemeinsames Ausschussverfahren - AGRI, EMPL und REGI @de

Conciliation Committee
type: CorporateBodyClassification
type: Concept
created: 2025-04-30
deprecated: false
alternative label: Parlamento delegacija Taikinimo komitete @lt
alternative label: European Parliament's delegation to the Conciliation Committee
alternative label: Delegação do Parlamento Europeu ao Comité de Conciliação @pt
alternative label: Europa-Parlamentets Delegation til Forligsudvalget @da
alternative label: Europaparlamentets delegation till förlikningskommittén @sv
alternative label: Izaslanstvo Parlamenta u Odboru za mirenje @hr
alternative label: Eiropas Parlamenta delegācija Samierināšanas komitejā @lv
alternative label: A Parlament Egyeztető Bizottságba delegált küldöttsége @hu
alternative label: Delegation des Europäischen Parlaments im Vermittlungsausschuss @de
alternative label: Делегация на Европейския парламент в Помирителния комитет @bg
alternative label: Delegacija Evropskega parlamenta pri Spravnem odboru @sl
alternative label: Parlamendi delegatsioon lepituskomitee juures @et
alternative label: Parlamentin sovittelukomiteavaltuuskunta @fi
alternative label: Delegația Parlamentului European la Comitetul de conciliere @ro
alternative label: Id-delegazzjoni tal-Parlament għall-Kumitat ta' Konċiljazzjoni @mt
alternative label: Délégation du Parlement européen au comité de conciliation @fr
alternative label: Delegacja Parlamentu do komitetu pojednawczego @pl
alternative label: Delegatie van het Europees Parlement in het bemiddelingscomité @nl
alternative label: Delegación del Parlamento Europeo en el Comité de Conciliación @es
alternative label: Delegácia parlamentu pri Zmierovacom výbore @sk
alternative label: Delegazione del Parlamento europeo al Comitato di conciliazione @it
alternative label: Toscaireacht na Parlaiminte chuig an gCoiste Idir-réiteach @ga
alternative label: Parlamentní delegace do dohodovacího výboru @cs
alternative label: Αντιπροσωπεία του Ευρωπαϊκού Κοινοβουλίου στην Επιτροπή Συνδιαλλαγής @el
broader: Parliamentary committee
definition: Conciliation Committee.
in scheme: EP taxonomy on entities.
preferred label: Vermittlungsausschuss @de
preferred label: Taikinimo Komitete @lt
preferred label: Komitecie porozumiewawczym @pl
preferred label: Comitato di conciliazione @it
preferred label: Forligsudvalget @da
preferred label: Smírčím výboru @cs
preferred label: CComité de Conciliação @pt
preferred label: Odbor za mirenje @hr
preferred label: Помирителен комитет @bg
preferred label: Zmierovacom výbore @sk
preferred label: Sovittelukomiteavaltuuskunta @fi
preferred label: Förlikningskommittén @sv
preferred label: Spravnem odboru @sl
preferred label: Lepituskomitee juures @et
preferred label: Comité de Conciliación @es
preferred label: Επιτροπή Συνδιαλλαγής @el
preferred label: Samierināšanas komiteju @lv
preferred label: An Coiste Idir-réiteach @ga
preferred label: Bemiddelingscomite @nl
preferred label: Comité de conciliation @fr
preferred label: Comitetul de conciliere @ro
preferred label: Bizottságba delegált küldött @hu
preferred label: Kumitat ta' Konċiljazzjoni @mt

Conference of Delegation Chairs
type: Concept
created: 2025-04-30
deprecated: false
broader: Governing entities
definition: Conference of Delegation Chairs.
in scheme: EP taxonomy on entities.
preferred label: Delegāciju vadītāju konference @lv
preferred label: Conferencia de Presidentes de Delegación @es
preferred label: Konferenz der Delegationsvorsitze @de
preferred label: Konferencija predsjednika izaslanstava @hr
preferred label: Delegationsformandskonferencen @da
preferred label: Konferenza tal-Presidenti tad-Delegazzjonijiet @mt
preferred label: Konferenca predsednikov delegacij @sl
preferred label: Съвет на председателите на делегации @bg
preferred label: Conferentie van delegatievoorzitters @nl
preferred label: Delegationsordförandekonferensen @sv
preferred label: Delegatsioonide juhtide konverents @et
preferred label: Valtuuskuntien puheenjohtajakokous @fi
preferred label: Διάσκεψη των Προέδρων των Αντιπροσωπειών @el
preferred label: Conferência dos Presidentes das Delegações @pt
preferred label: Konferencia predsedov delegácií @sk
preferred label: Conferenza dei presidenti di delegazione @it
preferred label: Konference předsedů delegací @cs
preferred label: Küldöttségi Elnökök Értekezlete @hu
preferred label: Delegacijų pirmininkų sueiga @lt
preferred label: Comhdháil Chathaoirligh na dToscaireachtaí @ga
preferred label: Konferencja Przewodniczących Delegacji @pl
preferred label: Conférence des présidents des délégations @fr
preferred label: Conferința președinților de delegație @ro

Committee on Public Health
type: Concept
created: 2025-01-31
deprecated: false
alternative label: Volksgezondheid @nl
alternative label: Δημόσια Υγεία @el
alternative label: Verejné zdravie @sk
alternative label: Folkhälsa @sv
alternative label: Sláinte Phoiblí @ga
alternative label: Folkesundhed @da
alternative label: Santé Publique @fr
alternative label: Öffentliche Gesundheit @de
alternative label: Javno zdravlje @hr
alternative label: Visuomenės sveikata @lt
alternative label: Public Health
alternative label: Обществено здраве @bg
alternative label: Sanità pubblica @it
alternative label: Rahvatervis @et
alternative label: Javno zdravje @sl
alternative label: Közegészségügy @hu
alternative label: Saúde Pública @pt
alternative label: Salud Pública @es
alternative label: veřejné zdraví @cs
alternative label: Sabiedrības veselība @lv
alternative label: Sănătate publică @ro
alternative label: Kansanterveys @fi
alternative label: Zdrowie Publiczne @pl
alternative label: Saħħa pubblika @mt
broader: Standing parliamentary committee
definition: European parliamentary subcommittee on public health.
in scheme: EP taxonomy on entities.
preferred label: Commissie volksgezondheid @nl
preferred label: Comisión de Salud Pública @es
preferred label: Sabiedrības veselības komiteja @lv
preferred label: An Coiste um Shláinte Phoiblí @ga
preferred label: Kumitat għas-Saħħa Pubblika @mt
preferred label: Visuomenės sveikatos komitetas @lt
preferred label: Comissão da Saúde Pública @pt
preferred label: Közegészségügyi Bizottság @hu
preferred label: Odbor za javno zdravlje @hr
preferred label: Kansanterveyden valiokunta @fi
preferred label: Utskottet för folkhälsa @sv
preferred label: Výbor pre verejné zdravie @sk
preferred label: Ausschuss für öffentliche Gesundheit @de
preferred label: Udvalget om Folkesundhed @da
preferred label: Επιτροπή Δημόσιας Υγείας @el
preferred label: Commission de la santé publique @fr
preferred label: Výbor pro veřejné zdraví @cs
preferred label: Komisja Zdrowia Publicznego @pl
preferred label: Rahvatervishoiu komisjon @et
preferred label: Комисия по обществено здраве @bg
preferred label: Comisia pentru sănătate publică @ro
preferred label: Commissione per la sanità pubblica @it
preferred label: Odbor za javno zdravje @sl

Delegation for relations with Cyprus
type: Concept
created: 2023-10-31
deprecated: true
alternative label: An Chipir @ga
alternative label: Cyprus
alternative label: Kipra @lv
alternative label: Chypre @fr
alternative label: Cipru @ro
alternative label: Küpros @et
alternative label: Zypern @de
alternative label: Cipar @hr
alternative label: Ciper @sl
alternative label: Ciprus @hu
alternative label: Kipras @lt
alternative label: Кипър @bg
alternative label: Cypr @pl
alternative label: Chipre @pt
alternative label: Κύπρος @el
alternative label: Cypern @sv
alternative label: Kypr @cs
alternative label: Cipro @it
alternative label: Kypros @fi
broader: Parliamentary delegation
definition: Delegation for relations with Cyprus.
in scheme: EP taxonomy on entities.
preferred label: Delegacja ds. stosunków z Cyprem @pl
preferred label: Izaslanstvo za odnose s Ciprom @hr
preferred label: Delegația pentru relațiile cu Cipru @ro
preferred label: Delegácia pre vztahy s Cyprom @sk
preferred label: Délégation pour les relations avec Chypre @fr
preferred label: Delegación para las relaciones con Chipre @es
preferred label: Ühenduse ja Küprose vaheliste suhetega tegelev delegatsioon @et
preferred label: Delegacija attiecibam ar Kipru @lv
preferred label: Delegacija ryšiams su Kipru @lt
preferred label: Suhteista Kyprokseen vastaava valtuuskunta @fi
preferred label: Delegacija za odnose s Ciprom @sl
preferred label: Delegação para as relações com Chipre @pt
preferred label: Delegationen för förbindelserna med Cypern @sv
preferred label: A Ciprussal való kapcsolatokért felelos küldöttség @hu
preferred label: Delegatie voor de betrekkingen met Cyprus @nl
preferred label: Delegationen for Forbindelserne med Cypern @da
preferred label: Делегация за връзки с Кипър @bg
preferred label: Delegace pro vztahy s Kyprem @cs
preferred label: Delegazzjoni ghar-relazzjonijiet ma’ Cipru @mt
preferred label: Delegation für die Beziehungen zu Zypern @de
preferred label: Αντιπροσωπεία για τις σχέσεις με τη Κύπρο @el
preferred label: Delegazione per le relazioni con Cipro @it
preferred label: Toscaireacht don chaidreamh leis an gCipir @ga

European Institute of Innovation and Technology
type: Concept
created: 2023-10-31
deprecated: false
broader: EU agency
definition: European Institute of Innovation and Technology.
in scheme: EP taxonomy on entities.
narrow match: EIT 2007 0
preferred label: Euroopa Innovatsiooni- ja Tehnoloogiainstituut @et
preferred label: Európsky inovačný a technologický inštitút @sk
preferred label: Institut européen d’innovation et de technologie @fr
preferred label: Europski institut za inovacije i tehnologiju @hr
preferred label: Europos inovacijos ir technologijos institutas @lt
preferred label: Evropský inovační a technologický institut @cs
preferred label: L-Istitut Ewropew tal-Innovazzjoni u t-Teknoloġija @mt
preferred label: Europäisches Innovations- und Technologieinstitut @de
preferred label: Европейски институт за иновации и технологии @bg
preferred label: Institiúid Eorpach um Nuálaíocht agus Teicneolaíocht @ga
preferred label: Európai Innovációs és Technológiai Intézet @hu
preferred label: Euroopan innovaatio- ja teknologiainstituutti @fi
preferred label: Ευρωπαϊκό Ινστιτούτο Καινοτομίας και Τεχνολογίας @el
preferred label: Instituto Europeo de Innovación y Tecnología @es
preferred label: Eiropas Inovāciju un tehnoloģiju institūts @lv
preferred label: Europees Instituut voor innovatie en technologie @nl
preferred label: Europeiska institutet för innovation och teknik @sv
preferred label: Instituto Europeu de Inovação e Tecnologia @pt
preferred label: Institutul European de Inovare și Tehnologie @ro
preferred label: Istituto europeo di innovazione e tecnologia @it
preferred label: Det Europæiske Institut for Innovation og Teknologi @da
preferred label: Evropski inštitut za inovacije in tehnologijo @sl
preferred label: Europejski Instytut Innowacji i Technologii @pl

Temporary committee on employment
type: Concept
created: 2023-10-31
deprecated: true
preferred label: Dočasný výbor pro zaměstnanost @cs
preferred label: Nichtständiger Ausschuß für Beschäftigung @de
preferred label: Nodarbinatibas pagaidu komisija @lv
preferred label: Tijdelijke Commissie werkgelegenheid @nl
preferred label: Ajutine tööhõivekomitee @et
preferred label: Začasni odbor za zaposlovanje @sl
alternative label: Tillfälliga sysselsättningsutskottet @sv
preferred label: Ideiglenes bizottság a foglalkoztatásra @hu
preferred label: Commission temporaire pour l'emploi @fr
alternative label: Tymczasowa komisja ds. zatrudnienia @pl
preferred label: Commissione temporanea per l'occupazione @it
preferred label: Privremeni odbor za zapošljavanje @hr
preferred label: Väliaikainen työllisyysvaliokunta @fi
preferred label: Docasný výbor pre zamestnanost @sk
preferred label: Προσωρινή Επιτροπή για την Απασχόληση @el
preferred label: Comisión temporal sobre el empleo @es
preferred label: Временна комисия по заетостта @bg
preferred label: Comissão Temporária do Emprego @pt
preferred label: Kumitat Temporanju dwar l-impieg @mt
preferred label: Laikinasis užimtumo komitetas @lt
preferred label: Det Midlertidige Udvalg om Beskæftigelse @da
preferred label: Coiste sealadach um fhostaíocht @ga
preferred label: Comisia temporară pentru ocuparea forței de muncă @ro
broader: Temporary parliamentary committee
definition: Temporary committee on employment.
in scheme: EP taxonomy on entities.
preferred label: Tymczasowa Komisja ds. Zatrudnienia @pl
preferred label: Tillfälliga utskottet för sysselsättning @sv

Governing entities
type: Concept
created: 2025-04-30
deprecated: false
alternative label: Pārvaldības struktūras @lv
alternative label: Órgãos de direção @pt
alternative label: Organi direttivi @it
alternative label: Riadiace orgány @sk
alternative label: Styrende organer @da
alternative label: Διοικητικά όργανα @el
alternative label: Governing bodies
alternative label: Valdymo organai @lt
alternative label: Organele de conducere @ro
alternative label: Comhlachtaí rialaithe @ga
alternative label: Korpi ta' tmexxija @mt
alternative label: Upravni organi @sl
alternative label: Organes directeurs @fr
alternative label: Upravljačka tijela @hr
alternative label: Управителни органи @bg
alternative label: Órganos de gobierno @es
alternative label: Leitungsgremien @de
preferred label: Irányító szervek @hu
alternative label: Hallintoelimet @fi
alternative label: Bestuursorganen @nl
alternative label: Juhtorganid @et
alternative label: Organy zarządzające @pl
alternative label: Řídící orgány @cs
alternative label: Styrande organ @sv
broader: European Parliament
definition: Parliamentary governing entities.
in scheme: EP taxonomy on entities.
preferred label: Eintitis rialaithe @ga
preferred label: Reguleerivad üksused @et
preferred label: Podmioty zarządzające @pl
preferred label: Управляващи субекти @bg
preferred label: Pārvaldības iestādes @lv
preferred label: Entidades de gobierno @es
preferred label: Styrande enheter @sv
preferred label: Entidades gestoras @pt
preferred label: Entitajiet ta' tmexxija @mt
preferred label: Řídící subjekty @cs
preferred label: Valdantys subjektai @lt
preferred label: Riadiace subjekty @sk
preferred label: Styrende enheder @da
preferred label: Upravljački subjekti @hr
preferred label: Διοικητικές οντότητες @el
preferred label: Entități de conducere @ro
preferred label: Regierende Stellen @de
preferred label: Enti direttivi @it
preferred label: Upravni subjekti @sl
preferred label: Besturende entiteiten @nl
preferred label: Entités dirigeantes @fr
preferred label: Hallintoyksiköt @fi

Delegation for relations with Iraq
type: Concept
created: 2023-10-31
deprecated: false
alternative label: Ирак @bg
alternative label: Ιράκ @el
alternative label: Irák @cs
alternative label: Irāka @lv
alternative label: Iaráic @ga
alternative label: Iraak @et
alternative label: Iraque @pt
alternative label: Irakas @lt
alternative label: Irak @hr
alternative label: Iraq
broader: Parliamentary delegation
definition: Delegation for relations with Iraq.
in scheme: EP taxonomy on entities.
preferred label: Delagacija ryšiams su Iraku @lt
preferred label: Delegatsioon Iraagiga suhtlemiseks @et
preferred label: Delegazione per le relazioni con l'Iraq @it
preferred label: Delegatie voor de betrekkingen met Irak @nl
preferred label: Az Irakkal fenntartott kapcsolatokért felelős küldöttség @hu
preferred label: Delegace pro vztahy s Irákem @cs
preferred label: Delegacja do spraw stosunków z Irakiem @pl
preferred label: Délégation pour les relations avec l'Iraq @fr
preferred label: Delegacija za odnose z Irakom @sl
preferred label: Delegação para as Relações com o Iraque @pt
preferred label: Izaslanstvo za odnose s Irakom @hr
preferred label: Delegácia pre vzťahy s Irakom @sk
preferred label: Αντιπροσωπεία για τις σχέσεις με το Ιράκ @el
preferred label: Delegación para las Relaciones con Irak @es
preferred label: Delegation für die Beziehungen zu Irak @de
preferred label: Delegācija attiecībām ar Irāku @lv
preferred label: Delegationen för förbindelserna med Irak @sv
preferred label: Suhteista Irakiin vastaava valtuuskunta @fi
preferred label: Делегация за връзки с Ирак @bg
preferred label: Delegația pentru relațiile cu Irak @ro
preferred label: Delegazzjoni għar-relazzjonijiet mal-Iraq @mt
preferred label: Delegationen for Forbindelserne med Irak @da
preferred label: An Toscaireacht don chaidreamh leis an Iaráic @ga

European Union Aviation Safety Agency
type: Concept
created: 2023-10-31
deprecated: false
broader: Decentralised agency
definition: European Union Aviation Safety Agency.
in scheme: EP taxonomy on entities.
preferred label: Agentur der Europäischen Union für Flugsicherheit @de
preferred label: Agence de l’Union européenne pour la sécurité aérienne @fr
preferred label: Agência da União Europeia para a Segurança da Aviação @pt
preferred label: Agenzia dell’Unione europea per la sicurezza aerea @it
preferred label: Aġenzija tas-Sikurezza tal-Avjazzjoni tal-Unjoni Ewropea @mt
preferred label: Agencija Europske unije za sigurnost zračnog prometa @hr
preferred label: Europeiska unionens byrå för luftfartssäkerhet @sv
preferred label: Agentschap van de Europese Unie voor de veiligheid van de luchtvaart @nl
preferred label: Gníomhaireacht Sábháilteachta Eitlíochta de chuid an Aontais Eorpaigh @ga
preferred label: Agencia de la Unión Europea para la Seguridad Aérea @es
preferred label: Agenția Uniunii Europene pentru Siguranță a Aviației @ro
preferred label: Agentura Evropské unie pro bezpečnost letectví @cs
preferred label: Agencja Unii Europejskiej ds. Bezpieczeństwa Lotniczego @pl
preferred label: Den Europæiske Unions Luftfartssikkerhedsagentur @da
preferred label: Euroopan unionin lentoturvallisuusvirasto @fi
preferred label: Az Európai Unió Repülésbiztonsági Ügynöksége @hu
preferred label: Агенция за авиационна безопасност на Европейския съюз @bg
preferred label: Europos Sąjungos aviacijos saugos agentūra @lt
preferred label: Agencija Evropske unije za varnost v letalstvu @sl
preferred label: Οργανισμός της Ευρωπαϊκής Ένωσης για την Ασφάλεια της Αεροπορίας @el
preferred label: Agentúra Európskej únie pre bezpečnosť letectva @sk
preferred label: Eiropas Savienības Aviācijas drošības aģentūra @lv
preferred label: Euroopa Liidu Lennundusohutusamet @et

Joint committee procedure - ENVI and TRAN
type: Concept
created: 2023-10-31
deprecated: false
alternative label: Joint ENVI - TRAN
alternative label: ENVI und TRAN @de
alternative label: Commissions conjointes ENVI - TRAN @fr
broader: Joint parliamentary committees
definition: Joint committee procedure - ENVI and TRAN.
in scheme: EP taxonomy on entities.
preferred label: Gemeinsames Ausschussverfahren - ENVI und TRAN @de
preferred label: Procédure avec commissions conjointes - ENVI et TRAN @fr

Romanian Senate
type: Concept
created: 2023-10-31
deprecated: false
broader: National chamber
definition: Romanian Senate.
in scheme: EP taxonomy on entities.
preferred label: romunski senat @sl
preferred label: Senato romeno @it
preferred label: Seanad na Rómáine @ga
preferred label: rumunjski Senat @hr
preferred label: román szenátus @hu
preferred label: Senat Rumunii @pl
preferred label: rumunský Senát @cs
preferred label: Rumeenia Senat @et
preferred label: Ρουμανική Γερουσία @el
preferred label: Roemeense Senaat @nl
preferred label: Senado romeno @pt
preferred label: Сенат на Румъния @bg
preferred label: Senat Rumen @mt
preferred label: Den rumänska senaten @sv
preferred label: Rumānijas parlamenta Senāts @lv
preferred label: det rumænske Senat @da
preferred label: Romanian senaatti @fi
preferred label: Senado rumano @es
preferred label: Senatul României @ro
preferred label: Sénat roumain @fr
preferred label: rumänischer Senat @de
preferred label: Rumunijos Senatas @lt

Joint parliamentary committees
type: Concept
type: CorporateBodyClassification
created: 2023-10-31
deprecated: false
broader: Parliamentary committee
definition: Joint parliamentary committees of the European Parliament.
in scheme: EP taxonomy on entities.
preferred label: Jungtiniai parlamentiniai komitetai @lt
preferred label: Gemensamma parlamentarikerkommittéer @sv
preferred label: Commissioni parlamentari miste @it
preferred label: Comisiile parlamentare mixte @ro
preferred label: Comhchoistí parlaiminteacha @ga
preferred label: Wspólne komisje parlamentarne @pl
preferred label: Spoločné parlamentné výbory @sk
preferred label: Gemischte parlamentarische Ausschüsse @de
preferred label: Съвместни парламентарни комисии @bg
preferred label: Comissões parlamentares mistas @pt
preferred label: Gemengde parlementaire commissies @nl
preferred label: Smíšené parlamentní výbory @cs
preferred label: Apvienotās parlamentārās komitejas @lv
preferred label: Μικτές κοινοβουλευτικές επιτροπές @el
preferred label: Kumitati parlamentari konġunti @mt
preferred label: Blandede parlamentariske udvalg @da
preferred label: Parlamentaarsed ühiskomisjonid @et
preferred label: Commissions parlementaires mixtes @fr
preferred label: Parlamentaariset sekavaliokunnat @fi
preferred label: Parlamenti vegyes bizottságok @hu
preferred label: Zajednički parlamentarni odbori @hr
preferred label: Comisiones parlamentarias mixtas @es
preferred label: Skupni parlamentarni odbori @sl

Temporary committee on human genetics and other new technologies in modern medicine
type: Concept
created: 2023-10-31
deprecated: true
alternative label: Tymczasowa Komisja ds. genetyki ludzkiej @pl
alternative label: Menselijke genetica @nl
alternative label: Ihmisgenetiikkaa @fi
alternative label: Genetica umană @ro
alternative label: Inimgeneetika ajutine komisjon @et
alternative label: Genetica umana @it
alternative label: Genética humana @pt
alternative label: Začasni odbor za humano genetiko @sl
alternative label: Génétique humaine @fr
alternative label: Genetika Umana @mt
alternative label: Dočasný výbor pro otázky lidské genetiky @cs
alternative label: Ljudska genetika @hr
alternative label: Géineolaíocht an duine @ga
alternative label: Ανθρώπινη γενετική @el
alternative label: Humangenetik @de
alternative label: Human genetics
alternative label: Humángenetikai Ideiglenes Bizottság @hu
alternative label: Laikinasis komitetas dėl žmogaus genetikos @lt
alternative label: Pagaidu komiteja cilvēka genoma izpētei @lv
alternative label: Човешка генетика @bg
alternative label: Dočasný výbor pre humánnu genetiku @sk
broader: Temporary parliamentary committee
definition: European temporary parliamentary committee on human genetics and other new technologies in modern medicine.
in scheme: EP taxonomy on entities.
preferred label: Ihmisgenetiikkaa ja nykylääketieteen muita uusia tekniikoita käsittelevä väliaikainen valiokunta @fi
preferred label: Dočasný výbor pre humánnu genetiku a ďalšie nové technológie v modernej medicíne @sk
preferred label: Laikinasis komitetas dėl žmogaus genetikos ir kitų naujų moderniosios medicinos technologijų @lt
preferred label: Tillfälligt utskott för humangenetik och annan ny teknik inom den moderna medicinen @sv
preferred label: Comisia temporară privind genetica umană și alte noi tehnologii ale medicinii moderne @ro
preferred label: Začasni odbor za humano genetiko in druge nove tehnologije sodobne medicine @sl
preferred label: Privremeni odbor za ljudsku genetiku i druge nove tehnologije moderne medicine @hr
preferred label: Commissione temporanea sulla genetica umana e le altre nuove tecnologie nel settore della medicina moderna @it
preferred label: Det Midlertidige Udvalg om Humangenetik og Andre Nye Teknologier inden for Moderne Lægevidenskab @da
preferred label: Pagaidu komiteja cilvēka genoma izpētei un citām jaunajām tehnoloģijām mūsdienu medicīnā @lv
preferred label: Inimgeneetika ja kaasaegse meditsiinitehnoloogia ajutine komisjon @et
preferred label: Dočasný výbor pro otázky lidské genetiky a nové technologie v moderním lékařství @cs
preferred label: Coiste sealadach um ghéineolaíocht an duine agus um theicneolaíochtaí nua eile sa nuamhíochaine @ga
preferred label: Comisión Temporal sobre Genética Humana y Otras Nuevas Tecnologías de la Medicina Moderna @es
preferred label: Comissão temporária sobre a genética humana e outras novas tecnologias da medicina moderna @pt
preferred label: A humángenetikával és a modern orvostudományban alkalmazott más új technológiákkal foglalkozóIdeiglenes Bizottság @hu
preferred label: Tymczasowa Komisja ds. genetyki ludzkiej i innych nowych technologii współczesnej medycyny @pl
preferred label: Commission temporaire sur la génétique humaine et les autres technologies nouvelles de la médecine moderne @fr
preferred label: Kumitat Temporanju dwar il-genetika umana u teknologiji ohra godda fil-medicina moderna @mt
preferred label: Nichtständiger Ausschuss für Humangenetik und andere neue Technologien in der modernen Medizin @de
preferred label: Tijdelijke Commissie menselijke genetica en andere nieuwe technologieën in de moderne geneeskunde @nl
preferred label: Προσωρινή επιτροπή για την ανθρώπινη γενετική και τις άλλες νέες τεχνολογίες της σύγχρονης ιατρικής @el
preferred label: Временна комисия по човешка генетика и други нови технологии в съвременната медицина @bg

Temporary Committee on the alleged use of European countries by the CIA for the transport and illegal detention of prisoners
type: Concept
created: 2023-10-31
deprecated: true
alternative label: CIA:s påstådda användning av europeiska länder för transport och illegal internering av fångar @sv
alternative label: Domnevna uporaba evropskih držav za prevoz in nezakonito pridržanje ujetnikov s strani obveščevalne agencije CIA @sl
alternative label: Euroopan maiden alueen epäilty käyttö CIA:n vankikuljetuksiin ja laittomaan vankien säilyttämiseen @fi
alternative label: Предполагаемо използване на европейски държави от ЦРУ за транспорт и незаконно задържане на затворници @bg
alternative label: Alegada Utilização pela CIA de Países Europeus para o Transporte e a Detenção Ilegal de Prisioneiros @pt
alternative label: Utilisation alléguée de pays européens par la CIA pour le transport et la détention illégale de prisonniers @fr
alternative label: Użu allegat ta' pajjiżi Ewropej mis-CIA għat-trasportazzjoni u ż-żamma illegali ta' priġunieri @mt
preferred label: LKA poolt kinnipeetavate transpordiks ja ebaseaduslikuks kinnipidamiseks Euroopa riikide väidetava kasutamise uurimise ajutine komisjon @et
alternative label: Verondersteld gebruik door de CIA van Europese landen voor het vervoer en illegaal vasthouden van gevangenen @nl
alternative label: Navodno korištenje europskih zemalja od strane CIA-e za prijevoz i nezakonito zadržavanje zatvorenika @hr
alternative label: Domnělé využití evropských zemí ze strany CIA pro převoz a nezákonné zadržování vězňů @cs
alternative label: Údajné využívanie európskych krajín prostredníctvom CIA na účely prepravy a nezákonného zadržiavania väzňov @sk
alternative label: Behauptete Nutzung europäischer Staaten durch die CIA für die Beförderung und das rechtswidrige Festhalten von Gefangenen @de
alternative label: Supuesta Utilización de Países Europeos por la CIA para el Transporte y la Detención Ilegal de Presos @es
alternative label: Rzekome wykorzystanie krajów europejskich przez CIA do transportu i nielegalnego przetrzymywania więźniów @pl
alternative label: Presupusa folosire a unor țări europene de către CIA pentru transportarea și deținerea ilegală de prizonieri @ro
alternative label: Tariamas CŽV vykdytas kalinių gabenimas ir neteisėtas kalinimas Europos šalyse @lt
alternative label: Úsáid líomhnaithe thíortha Eorpacha ag an CIA chun príosúnaigh a iompar agus a choimeád go neamhdleathach @ga
alternative label: Iespējamā CIP veiktā Eiropas valstu izmantošana, lai pārvadātu un nelikumīgi turētu apcietinājumā gūstekņus @lv
preferred label: Az európai országoknak a CIA által foglyok szállítására és illegális fogva tartására való állítólagos használatával foglalkozó ideiglenes bizottság @hu
alternative label: CIA's Påståede Brug af Europæiske Lande ved Transport og Ulovlig Tilbageholdelse af Fanger @da
alternative label: Presunto utilizzo di paesi europei da parte della CIA per il trasporto e la detenzione illegale di persone @it
alternative label: Alleged use of European countries by the CIA for the transport and illegal detention of prisoners
alternative label: Εικαζόμενη χρήση ευρωπαϊκών κρατών από τη CIA για τη μεταφορά και την παράνομη κράτηση ατόμων @el
broader: Temporary parliamentary committee
definition: European temporary parliamentary committee on the alleged use of European countries by the CIA for the transport and illegal detention of prisoners.
in scheme: EP taxonomy on entities.
preferred label: Dočasný výbor k domnělému využití evropských zemí ze strany CIA pro převoz a nezákonné zadržování vězňů @cs
preferred label: Euroopan maiden alueen epäiltyä käyttöä CIA:n vankikuljetuksiin ja laittomaan vankien säilyttämiseen käsittelevä väliaikainen valiokunta @fi
preferred label: Comisia temporară privind presupusa folosire a unor țări europene de către CIA pentru transportarea și deținerea ilegală de prizonieri @ro
preferred label: Προσωρινή επιτροπή για την εικαζόμενη χρήση ευρωπαϊκών κρατών από τη CIA για τη μεταφορά και την παράνομη κράτηση ατόμων @el
preferred label: Comisión Temporal sobre la Supuesta Utilización de Países Europeos por la CIA para el Transporte y la Detención Ilegal de Presos @es
preferred label: Det Midlertidige Udvalg om CIA's Påståede Brug af Europæiske Lande ved Transport og Ulovlig Tilbageholdelse af Fanger @da
preferred label: Comissão Temporária sobre a Alegada Utilização pela CIA de Países Europeus para o Transporte e a Detenção Ilegal de Prisioneiros @pt
preferred label: Začasni odbor za preučitev domnev o uporabi evropskih držav za prevoz in nezakonito pridržanje ujetnikov s strani obveščevalne agencije CIA @sl
preferred label: Временна комисия по предполагаемото използване на европейски държави от ЦРУ с цел транспортиране и незаконно задържане на затворници @bg
preferred label: Privremeni odbor za navodno korištenje europskih zemalja od strane CIA-e za prijevoz i nezakonito zadržavanje zatvorenika @hr
preferred label: Laikinasis komitetas tariamam CŽV vykdytam kalinių gabenimui ir neteisėtam kalinimui Europos šalyse tirti @lt
preferred label: An Coiste Sealadach um úsáid líomhnaithe thíortha Eorpacha ag an CIA chun príosúnaigh a iompar agus a choimeád go neamhdleathach @ga
preferred label: Commission temporaire sur l'utilisation alléguée de pays européens par la CIA pour le transport et la détention illégale de prisonniers @fr
preferred label: Pagaidu komiteja saistībā ar iespējamo CIP veikto Eiropas valstu izmantošanu, lai pārvadātu un nelikumīgi turētu apcietinājumā gūstekņus @lv
preferred label: Kumitat temporanju dwar l-użu allegat ta' pajjiżi Ewropej mis-CIA għat-trasportazzjoni u ż-żamma illegali ta' priġunieri @mt
preferred label: Det tillfälliga utskottet för CIA:s påstådda användning av europeiska länder för transport och illegal internering av fångar @sv
preferred label: Komisja tymczasowa do zbadania sprawy rzekomego wykorzystania krajów europejskich przez CIA do transportu i nielegalnego przetrzymywania więźniów @pl
preferred label: Nichtständiger Ausschuss zur behaupteten Nutzung europäischer Staaten durch die CIA für die Beförderung und das rechtswidrige Festhalten von Gefangenen @de
preferred label: Dočasný výbor vo veci údajného využívania európskych krajín prostredníctvom CIA na účely prepravy a nezákonného zadržiavania väzňov @sk
preferred label: Commissione temporanea sul presunto utilizzo di paesi europei da parte della CIA per il trasporto e la detenzione illegale di persone @it
preferred label: Tijdelijke Commissie verondersteld gebruik door de CIA van Europese landen voor het vervoer en illegaal vasthouden van gevangenen @nl

Delegation for relations with India
type: Concept
created: 2023-10-31
deprecated: false
alternative label: Ινδία @el
alternative label: Índia @pt
alternative label: an India @ga
alternative label: India
alternative label: Indie @cs
alternative label: Indien @sv
alternative label: Intia @fi
alternative label: Indija @lt
alternative label: Indja @mt
alternative label: Inde @fr
alternative label: Индия @bg
broader: Parliamentary delegation
definition: Delegation for relations with India.
in scheme: EP taxonomy on entities.
preferred label: Delegación para las Relaciones con la India @es
preferred label: Delegace pro vztahy s Indií @cs
preferred label: Delegácia pre vzťahy s Indiou @sk
preferred label: Delegația pentru relațiile cu India @ro
preferred label: Делегация за връзки с Индия @bg
preferred label: Delegazione per le relazioni con l'India @it
preferred label: Delegacija ryšiams su Indija @lt
preferred label: Suhteista Intiaan vastaava valtuuskunta @fi
preferred label: Izaslanstvo za odnose s Indijom @hr
preferred label: Delegazzjoni għar-relazzjonijiet mal-Indja @mt
preferred label: Delegacja do spraw stosunków z Indiami @pl
preferred label: Delegācija attiecībām ar Indiju @lv
preferred label: Az Indiával fenntartott kapcsolatokért felelős küldöttség @hu
preferred label: Delegationen for Forbindelserne med Indien @da
preferred label: Delegação para as Relações com a Índia @pt
preferred label: Delegatie voor de betrekkingen met India @nl
preferred label: Delegatsioon Indiaga suhtlemiseks @et
preferred label: Délégation pour les relations avec l'Inde @fr
preferred label: Delegation für die Beziehungen zu Indien @de
preferred label: Αντιπροσωπεία για τις σχέσεις με την Ινδία @el
preferred label: Delegationen för förbindelserna med Indien @sv
preferred label: Delegacija za odnose z Indijo @sl
preferred label: An Toscaireacht don chaidreamh leis an India @ga

Delegation for relations with Belarus
type: Concept
created: 2023-10-31
deprecated: false
alternative label: Baltkrievija @lv
alternative label: Belarus
alternative label: Bjelorusssja @mt
alternative label: Bielorussia @it
alternative label: Bielorrússia @pt
alternative label: Baltarusija @lt
alternative label: Bjelarus @hr
alternative label: Belarusz @hu
alternative label: Bielorrusia @es
alternative label: Wit-Rusland @nl
alternative label: Λευκορωσία @el
alternative label: Valko-Venäjä @fi
alternative label: Bielorusko @sk
alternative label: Biélorussie @fr
alternative label: Belorusija @sl
alternative label: Białoruś @pl
alternative label: Bělorusko @cs
alternative label: An Bhealarúis @ga
alternative label: Vitryssland @sv
alternative label: Valgevene @et
alternative label: Беларус @bg
broader: Parliamentary delegation
definition: Delegation for relations with Belarus.
in scheme: EP taxonomy on entities.
preferred label: Delegatie voor de betrekkingen met Belarus @nl
preferred label: Delegação para as Relações com a Bielorrússia @pt
preferred label: Αντιπροσωπεία για τις σχέσεις με τη Λευκορωσία @el
preferred label: Delegacja do spraw stosunków z Białorusią @pl
preferred label: Delegatsioon Valgevenega suhtlemiseks @et
preferred label: A Belarusszal fenntartott kapcsolatokért felelős küldöttség @hu
preferred label: Izaslanstvo za odnose s Bjelarusom @hr
preferred label: Delegacija ryšiams su Baltarusija @lt
preferred label: Delegación para las Relaciones con Bielorrusia @es
preferred label: Delegace pro vztahy s Běloruskem @cs
preferred label: Delegazzjoni għar-relazzjonijiet mal-Belarussja @mt
preferred label: Delegationen för förbindelserna med Vitryssland @sv
preferred label: Delegazione per le relazioni con la Bielorussia @it
preferred label: Delegācija attiecībām ar Baltkrieviju @lv
preferred label: An Toscaireacht don chaidreamh leis an mBealarúis @ga
preferred label: Délégation pour les relations avec la Biélorussie @fr
preferred label: Delegation für die Beziehungen zu Belarus @de
preferred label: Delegația pentru relațiile cu Belarus @ro
preferred label: Suhteista Valko-Venäjään vastaava valtuuskunta @fi
preferred label: Делегация за връзки с Беларус @bg
preferred label: Delegationen for Forbindelserne med Belarus @da
preferred label: Delegacija za odnose z Belorusijo @sl

Europe’s Rail Joint Undertaking
type: Concept
created: 2023-10-31
deprecated: false
broader: EU joint undertaking
definition: Europe’s Rail Joint Undertaking.
in scheme: EP taxonomy on entities.
preferred label: Wspólne Europejskie Przedsięwzięcie Kolejowe @pl
preferred label: Společný podnik pro evropské železnice @cs
preferred label: Euroopa raudtee ühisettevõte @et
preferred label: Empresa Común para el Ferrocarril Europeo @es
preferred label: Europos geležinkelių bendroji įmonė @lt
preferred label: Κοινή επιχείρηση «Ευρωπαϊκοί σιδηρόδρομοι» @el
preferred label: Empresa Comum do Sector Ferroviário Europeu @pt
preferred label: Kopuzņēmums “Eiropas dzelzceļš” @lv
preferred label: Skupno podjetje za evropske železnice @sl
preferred label: Euroopan rautatiet -yhteisyritys @fi
preferred label: Comhghnóthas um Iarnród na hEorpa @ga
preferred label: Zajedničko poduzeće za europsku željeznicu @hr
preferred label: Entreprise commune «Système ferroviaire européen» @fr
preferred label: Spoločný podnik pre európske železnice @sk
preferred label: Gemeinsames Unternehmen für Europas Eisenbahnen @de
preferred label: Fællesforetagendet for Europas jernbaner @da
preferred label: Det gemensamma företaget för Europas järnvägar @sv
preferred label: Európai Vasút Közös Vállalkozás @hu
preferred label: L-Impriża Konġunta Sistema Ferrovjarja Ewropea @mt
preferred label: Întreprinderea comună pentru căile ferate ale Europei @ro
preferred label: Impresa comune «Ferrovie europee» @it
preferred label: Gemeenschappelijke Onderneming “Europese spoorwegen” @nl

Delegation for relations with Albania, Bulgaria and Romania
type: Concept
created: 2023-10-31
deprecated: true
alternative label: Albanija, Bolgarija in Romunija @sl
alternative label: Albania, Bulgaria and Romania
alternative label: Albanija, Bulgarija ir Rumunija @lt
alternative label: Albanija,Bulgarija u Romanija @mt
alternative label: Albanien, Bulgarien und Rumänien @de
alternative label: Albânia, Bulgária e Roménia @pt
alternative label: Albania, Bulgaria ja Romania @fi
alternative label: Albania, Bulgaria y Rumania @es
alternative label: Albania, Bulgaria i Rumunia @pl
alternative label: Albánie, Bulharsko a Rumunsko @cs
alternative label: Albania, Bulgaria și România @ro
alternative label: Albanija, Bulgarija un Rumanija @lv
alternative label: Albanien, Bulgarien och Rumänien @sv
alternative label: Albanië, Bulgarije en Roemenië @nl
alternative label: Албания, България и Румъния @bg
alternative label: Albaania, Bulgaaria ja Rumeenia @et
alternative label: An Albáin, an Bhulgáir agus an Rómáin @ga
alternative label: Albanie, Bulgarie et Roumanie @fr
alternative label: Albánsko, Bulharsko a Rumunsko @sk
alternative label: Albania, Bulgaria e Romania @it
alternative label: Albanija, Bugarska i Rumunjska @hr
alternative label: Albanien, Bulgarien og Rumænien @da
alternative label: Αλβανία, Βουλγαρία, Ρουμανία @el
alternative label: Albánia, Bulgária és Románia @hu
broader: Parliamentary delegation
definition: Delegation for relations with Albania, Bulgaria and Romania.
in scheme: EP taxonomy on entities.
preferred label: Делегация за връзки с Албания, България и Румъния @bg
preferred label: Delegacija attiecibam ar Albaniju, Bulgariju un Rumaniju @lv
preferred label: Delegationen for Forbindelserne med Albanien, Bulgarien og Rumænien @da
preferred label: Delegation für die Beziehungen zu Albanien, Bulgarien und Rumänien @de
preferred label: Αντιπροσωπεία για τις σχέσεις με την Αλβανία, τη Βουλγαρία και τη Ρουμανία @el
preferred label: Delegația pentru Albania, Bulgaria și România @ro
preferred label: Delegazione per le relazioni con l'Albania, la Bulgaria e la Romania @it
preferred label: Delegazzjoni ghar-relazzjonijiet ma’ l-Albanija, Bulgarija u Rumanija @mt
preferred label: Delegação para as relações com a Albânia, a Bulgária e a Roménia @pt
preferred label: Delegacija za odnose z Albanijo, Bolgarijo in Romunijo @sl
preferred label: Delegácia pre vztahy s Albánskom, Bulharskom a Rumunskom @sk
preferred label: Delegace pro vztahy s Albánií, Bulharskem a Rumunskem @cs
preferred label: Delegacja ds. stosunków z Albania, Bulgaria i Rumunia @pl
preferred label: Delegacija ryšiams su Albanija, Bulgarija ir Rumunija @lt
preferred label: Delegatie voor de betrekkingen met Albanië, Bulgarije en Roemenië @nl
preferred label: Ühenduse ja Albaania, Bulgaaria ning Rumeenia vaheliste suhetega tegelev delegatsioon @et
preferred label: Delegationen för förbindelserna med Albanien, Bulgarien och Rumänien @sv
preferred label: Suhteista Albaniaan, Bulgariaan ja Romaniaan vastaava valtuuskunta @fi
preferred label: Izaslanstvo za odnose s Albanijom, Bugarskom i Rumunjskom @hr
preferred label: Delegación para la relaciones con Albania, Bulgaria y Rumania @es
preferred label: Toscaireacht don chaidreamh leis an Albáin, leis an mBulgáir agus leis an Rómáin @ga
preferred label: Az Albániával, Bulgáriával és Romániával való kapcsolatokért felelos küldöttség @hu
preferred label: Délégation pour les relations avec l'Albanie, la Bulgarie et la Roumanie @fr

Standing parliamentary committee
type: CorporateBodyClassification
type: Concept
created: 2023-10-31
deprecated: false
broader: Parliamentary committee
definition: Standing Parliamentary Committee of the European Parliament.
in scheme: EP taxonomy on entities.
preferred label: Ständiger parlamentarischer Ausschuss @de
preferred label: Alaline parlamendikomisjon @et
preferred label: Kumitat parlamentari permanenti @mt
preferred label: Stalni parlamentarni odbor @sl
preferred label: Buanchoiste parlaiminteach @ga
preferred label: Állandó parlamenti bizottság @hu
preferred label: Stály parlamentný výbor @sk
preferred label: Μόνιμη κοινοβουλευτική επιτροπή @el
preferred label: Comissão parlamentar permanente @pt
preferred label: Commissione parlamentare permanente @it
preferred label: Pastāvīgā parlamentārā komiteja @lv
preferred label: Постоянна парламентарна комисия @bg
preferred label: Comisión parlamentaria permanente @es
preferred label: Vaste parlementaire commissie @nl
preferred label: Commission parlementaire permanente @fr
preferred label: Stała komisja parlamentarna @pl
preferred label: Stálý parlamentní výbor @cs
preferred label: Nuolatinis parlamentinis komitetas @lt
preferred label: Det stående parlamentsudvalg @da
preferred label: Pysyvä parlamentaarinen valiokunta @fi
preferred label: Comisia parlamentară permanentă @ro
preferred label: Ständiga parlamentsutskottet @sv

European Foundation for the Improvement of Living and Working Conditions
type: Concept
created: 2023-10-31
deprecated: false
broader: Decentralised agency
definition: European Foundation for the Improvement of Living and Working Conditions.
in scheme: EP taxonomy on entities.
preferred label: Europese Stichting tot verbetering van de levens- en arbeidsomstandigheden @nl
preferred label: Europeiska fonden för förbättring av levnads- och arbetsvillkor @sv
preferred label: Európai Alapítvány az Élet- és Munkakörülmények Javításáért @hu
preferred label: Europejska Fundacja na rzecz Poprawy Warunków Życia i Pracy @pl
preferred label: Fondazione europea per il miglioramento delle condizioni di vita e di lavoro @it
preferred label: Europos gyvenimo ir darbo sąlygų gerinimo fondas @lt
preferred label: Evropska fundacija za izboljšanje življenjskih in delovnih razmer @sl
preferred label: Evropská nadace pro zlepšení životních a pracovních podmínek @cs
preferred label: Det Europæiske Institut til Forbedring af Leve- og Arbejdsvilkårene @da
preferred label: Eiropas Dzīves un darba apstākļu uzlabošanas fonds @lv
preferred label: Európska nadácia pre zlepšovanie životných a pracovných podmienok @sk
preferred label: Euroopan elin- ja työolojen kehittämissäätiö @fi
preferred label: Europäische Stiftung zur Verbesserung der Lebens- und Arbeitsbedingungen @de
preferred label: Fundação Europeia para a Melhoria das Condições de Vida e de Trabalho @pt
preferred label: Il-Fondazzjoni Ewropea għat-Titjib tal-Kondizzjonijiet tal-Ħajja u tax-Xogħol @mt
preferred label: Fundația Europeană pentru Îmbunătățirea Condițiilor de Viață și de Muncă @ro
preferred label: Euroopa Elu- ja Töötingimuste Parandamise Fond @et
preferred label: Europska zaklada za poboljšanje životnih i radnih uvjeta @hr
preferred label: An Foras Eorpach chun Dálaí Maireachtála agus Oibre a Fheabhsú @ga
preferred label: Fondation européenne pour l’amélioration des conditions de vie et de travail @fr
preferred label: Европейска фондация за подобряване на условията на живот и труд @bg
preferred label: Ευρωπαϊκό Ίδρυμα για τη Βελτίωση των Συνθηκών Διαβίωσης και Εργασίας @el
preferred label: Fundación Europea para la Mejora de las Condiciones de Vida y de Trabajo @es

Council of the European Union
type: Concept
created: 2023-10-31
deprecated: false
broader: EU institution
definition: Council of the European Union.
in scheme: EP taxonomy on entities.
preferred label: Съвет на Европейския съюз @bg
preferred label: Kunsill ta' l-Unjoni Ewropea @mt
preferred label: Rada Európskej únie @sk
preferred label: De Raad van de Europese Unie @nl
preferred label: Conselho da União Europeia @pt
preferred label: Consiglio dell'Unione Europea @it
preferred label: Euroopa Liidu Nõukogu @et
preferred label: Rada Evropské unie @cs
preferred label: Consiliul Uniunii Europene @ro
preferred label: Euroopan unionin neuvosto @fi
preferred label: Svet Evropske unije @sl
preferred label: Ministerrådet @da
preferred label: Az Európai Unió Tanácsa @hu
preferred label: Rada Unii Europejskiej @pl
preferred label: Comhairle an Aontais Eorpaigh @ga
preferred label: Vijeće Europske Unije @hr
preferred label: Συμβούλιο της Ευρωπαίκής Ενωσης @el
preferred label: Eiropas Savienības Padome @lv
preferred label: Europos Sąjungos Taryba @lt
preferred label: Consejo de la Unión Europea @es
preferred label: Europeiska unionens råd @sv
preferred label: Conseil de l'Union Européenne @fr
preferred label: Rat der Europäischen Union @de

Slovene National Council
type: Concept
created: 2023-10-31
deprecated: false
broader: National chamber
definition: Slovene National Council.
in scheme: EP taxonomy on entities.
preferred label: Slovėnijos Respublikos Valstybės Taryba @lt
preferred label: Consiglio nazionale sloveno @it
preferred label: slovenski državni svet @sl
preferred label: slovinská Štátna rada @sk
preferred label: Conselho Nacional esloveno @pt
preferred label: det slovenske Nationalråd @da
preferred label: Slovenian kansallisneuvosto @fi
preferred label: Държавен съвет на Република Словения @bg
preferred label: Kunsill Nazzjonali Sloven @mt
preferred label: Det slovenska nationalrådet @sv
preferred label: Rada Państwowa Słowenii @pl
preferred label: Sloveenia Riiginõukogu @et
preferred label: Slovēnijas Nacionālā padome @lv
preferred label: Consiliul Național al Sloveniei @ro
preferred label: Σλοβενικό Εθνικό Συμβούλιο @el
preferred label: slowenischer Staatsrat @de
preferred label: Comhairle Náisiúnta na Slóivéine @ga
preferred label: Sloveense Nationale Raad @nl
preferred label: Conseil national slovène @fr
preferred label: slovensko Državno vijeće @hr
preferred label: slovinská Státní rada @cs
preferred label: Consejo Nacional esloveno @es
preferred label: szlovén nemzeti tanács @hu

Joint committee procedure - ITRE and IMCO
type: Concept
created: 2023-10-31
deprecated: false
alternative label: ITRE und IMCO @de
alternative label: Joint ITRE - IMCO
alternative label: Commissions conjointes ITRE - IMCO @fr
broader: Joint parliamentary committees
definition: Joint committee procedure - ITRE and IMCO.
in scheme: EP taxonomy on entities.
preferred label: Gemeinsames Ausschussverfahren - ITRE und IMCO @de
preferred label: Procédure avec commissions conjointes - ITRE et IMCO @fr

German Bundesrat
type: Concept
created: 2023-10-31
deprecated: false
broader: National chamber
definition: German Bundesrat.
in scheme: EP taxonomy on entities.
preferred label: Бундесрат на Федерална република Германия @bg
preferred label: Duitse Bondsraad @nl
preferred label: Bundesrat tedesco @it
preferred label: det tyske Forbundsråd @da
preferred label: Saksamaa Liidunõukogu @et
preferred label: Bundesrat na Gearmáine @ga
preferred label: Bundesratul Germaniei @ro
preferred label: Conselho Federal alemão @pt
preferred label: njemačko Savezno vijeće ‒ Bundesrat @hr
preferred label: Bundesrat alemán @es
preferred label: Bundesrat allemand @fr
preferred label: nemecká Spolková rada @sk
preferred label: Rada Federalna Niemiec @pl
preferred label: německá Spolková rada @cs
preferred label: német Bundesrat @hu
preferred label: deutscher Bundesrat @de
preferred label: Det tyska förbundsrådet @sv
preferred label: nemški zvezni svet @sl
preferred label: Vācijas Bundesrāts @lv
preferred label: Γερμανικό Ομοσπονδιακό Συμβούλιο @el
preferred label: Bundesrat Ġermaniż @mt
preferred label: Saksan liittoneuvosto @fi
preferred label: Vokietijos Federacinės Respublikos Bundesratas @lt

Temporary committee instructed to monitor the action taken on the recommendations made concerning BSE (bovine spongiform encephalopathy)
type: Concept
created: 2023-10-31
deprecated: true
alternative label: Coiste sealadach (ESB) @ga
alternative label: Docasný výbor (BSE) @sk
alternative label: Commissione temporanea (ESB) @it
alternative label: Comisia temporară (ESB) @ro
alternative label: Privremeni odbor (GSE) @hr
alternative label: Komisja tymczasowa (BSE) @pl
alternative label: Временна комисия (BSE) @bg
alternative label: Tillfälligt utskott om BSE (uppföljning) @sv
alternative label: Comissão Temporária (BSE) @pt
alternative label: Comisión temporal EEB @es
alternative label: Väliaikainen valiokunta (BSE) @fi
alternative label: Nichtständiger Ausschuß für BSE @de
alternative label: Dočasný výbor (BSE) @cs
alternative label: Det Midlertidige Udvalg om BSE (opfølgning) @da
alternative label: Začasni odbor (BSE) @sl
alternative label: Temporary committee (BSE)
alternative label: Pagaidu komisija (BSE) @lv
alternative label: Προσωρινή επιτροπή για την παρακολούθηση των συστά @el
alternative label: Tijdelijke Commissie follow-up BSE-aanbevelingen @nl
alternative label: Ajutine komitee (BSE) @et
alternative label: Laikinasis komitetas (BSE) @lt
alternative label: Ideiglenes bizottság (BSE) @hu
alternative label: Kumitat temporanju(ESB) @mt
alternative label: Commission temporaire (ESB) @fr
broader: Temporary parliamentary committee
definition: European temporary parliamentary committee of inquiry into BSE.
in scheme: EP taxonomy on entities.
narrow match: https://data.europarl.europa.eu/org/114
narrow match: EP TC BSE
narrow match: EP TC BSE2
narrow match: https://data.europarl.europa.eu/org/136
preferred label: Временна комисия за мониторинг на действията, предприети в резултат на препоръките във връзка с BSE (спонгиформна енцефалопатия по говедата) @bg
preferred label: Dočasný výbor pověřený sledováním kroků přijatých v rámci doporučení týkajících se BSE (bovinní spongiformní encefalopatie) @cs
preferred label: Začasni odbor za spremljanje ukrepov, sprejetih na podlagi priporočil o BSE (bovini spongiformni encefalopatiji) @sl
preferred label: Docasný výbor poverený monitorovat cinnost, podnikanú na základe urobených odporúcaní týkajúcich sa BSE (hubová encefalopatia hovädzieho dobytka) @sk
preferred label: Det midlertidige udvalg om opfølgning af henstillingerne vedrørende BSE (Bovin Spongiform Encephalopati) @da
preferred label: Commissione temporanea incaricata di verificare il seguito dato alle raccomandazioni concernenti l'ESB (Encefalopatia spongiforme bovina) @it
preferred label: Pagaidu komisija, izveidota ricibas saskana ar rekomendacijam attieciba uz BSE (liellopu suklveida encefalopatijas) parraudzibai @lv
preferred label: Comissão Temporária encarregada do seguimento dado às recomendações relativas à BSE (Encefalopatia Espongiforme Bovina) @pt
preferred label: Tymczasowa komisja majaca za zadanie monitorowanie dzialan podejmowanych na podstawie zalecen dotyczacych BSE (gabczastego zwyrodnienia mózgu) @pl
preferred label: Commission temporaire chargée du suivi des recommandations concernant l'ESB (encéphalopathie spongiforme bovine) @fr
preferred label: Tijdelijke Commissie follow-up BSE-aanbevelingen (boviene spongiforme encefalopathie) @nl
preferred label: BSE-tautia (bovine spongiform encephalopathy) koskevien suositusten seurannasta vastaava väliaikaisen valiokunta @fi
preferred label: Προσωρινή επιτροπή για την παρακολούθηση των συστάσεων σχετικά με την ΣΕΒ (Σπογγώδης Εγκεφαλοπάθεια των Βοοειδών) @el
preferred label: Comisión temporal encargada del seguimiento de las recomendaciones sobre la EEB (Encefalopatía Espongiforme Bovina) @es
preferred label: Privremeni odbor zadužen za praćenje radnji poduzetih u vezi s preporukama za GSE (goveđa spongiformna encefalopatija) @hr
preferred label: Nichtständiger Ausschuß für die Weiterbehandlung der Empfehlungen zu BSE (spongiforme Rinderenzephalopathie) @de
preferred label: Coiste sealadach ar a gcuirfear de chúram faireachán a dhéanamh ar an mbeart arna dhéanamh maidir leis na moltaí a rinneadh i dtaobh ESB (einceifileapaite spúinseach bhólachta) @ga
preferred label: A szivacsos agysorvadással kapcsolatban javasolt intézkedések ellenorzésére létrehozott ideiglenes bizottság @hu
preferred label: Kumitat Temporanju bl-ordni li jzomm taht ghajnejh l-azzjoni mehuda fuq ir-rakkomandazzjonijiet maghmula li jirrigwardaw l-ESB (encefalopatija spongiformi bovina) @mt
preferred label: Ajutine komitee, mis jälgib meetmete rakendamist BSE (veiste spongioosse entsefalopaatia) suhtes tehtud soovituste põhjal @et
preferred label: Comisia temporară însărcinată cu monitorizarea recomandărilor privind ESB (encefalopatia spongiformă bovină) @ro
preferred label: Laikinasis komitetas tikrinti, kaip praktikoje taikomos rekomendacijos del BSE (galviju spongiformos encefalopatijos) @lt
preferred label: Tillfälligt utskott för uppföljning av rekommendationerna beträffande BSE (Bovin spongiform encefalopati) @sv

Fractie Renew Europe
type: Concept
created: 2023-10-31
deprecated: false
alternative label: Renew Europe @et
broader: POLITICAL GROUP
definition: European political group Renew.
in scheme: EP taxonomy on entities.
preferred label: Grupo Renew Europe @pt
preferred label: “Renew Europe” @lv
preferred label: Groupe Renew Europe @fr
preferred label: Ομάδα Renew Europe @el
preferred label: Uudistuva Eurooppa - ryhmä @fi
preferred label: Fraktion Renew Europe @de
preferred label: група „Renew Europe“ @bg
preferred label: Klub zastupnika Renew Europe @hr
preferred label: Frakcija „Renew Europe“ @lt
preferred label: Grupp Renew Europe @mt
preferred label: Grupa Renew Europe @pl
preferred label: Grupul Renew Europe @ro
preferred label: Renew Europe Group
preferred label: Renew Europe képviselőcsoport @hu
preferred label: Grúpa Renew Europe @ga
preferred label: Gruppo Renew Europe @it
preferred label: Uueneva Euroopa fraktsioon @et
preferred label: Gruppen Renew Europe @da
preferred label: skupina Renew Europe @sl

Latvian Parliament
type: Concept
created: 2023-10-31
deprecated: false
broader: National chamber
definition: Latvian Parliament.
in scheme: EP taxonomy on entities.
preferred label: Latvian parlamentti @fi
preferred label: Lets parlement @nl
preferred label: Parlament Latvjan @mt
preferred label: Parlaimint na Laitvia @ga
preferred label: lotyšský parlament @cs
preferred label: lettisches Parlament @de
preferred label: Parlamento letón @es
preferred label: Latvijski parlament @hr
preferred label: Läti Seim @et
preferred label: det lettiske parlament @da
preferred label: Det lettiska parlamentet @sv
preferred label: Parlamentul Letoniei @ro
preferred label: lett parlament @hu
preferred label: latvijski parlament @sl
preferred label: Latvijos Respublikos Saeima @lt
preferred label: Parlamento lettone @it
preferred label: Λετονικό Κοινοβούλιο @el
preferred label: Сейм на Република Латвия @bg
preferred label: Parlamento letão @pt
preferred label: Latvijas Republikas Saeima @lv
preferred label: Parlement letton @fr
preferred label: parlament Łotwy @pl

Delegation for relations with the countries of Eastern Europe - Group II
type: Concept
created: 2023-10-31
deprecated: true
alternative label: Ανατολική Ευρώπη - Ομάδα ΙΙ @el
alternative label: Austrumeiropa II grupa @lv
alternative label: Europa Oriental - Grupo II @es
alternative label: Østeuropa - Gruppe II @da
alternative label: Eastern Europe - Group II
alternative label: Rytu Europa – II grupe @lt
alternative label: Oost-Europa - Groep II @nl
alternative label: Východná Európa - skupina II @sk
alternative label: Europa dell'Est - Gruppo II @it
alternative label: Itä-Eurooppa - ryhmä II @fi
alternative label: Europa de Leste - Grupo II @pt
alternative label: Ewropa tal-Lvant - Grupp II @mt
alternative label: Europa de Est - Grupa II @ro
alternative label: Östeuropa - grupp 2 @sv
alternative label: Ida-Euroopa – II grupp @et
alternative label: Oirthear na hEorpa - Grúpa II @ga
alternative label: Източна Европа - Група II @bg
alternative label: Východní Evropa – Skupina II @cs
alternative label: Europe de l'Est - Groupe II @fr
alternative label: Kelet-Európa – II. Csoport @hu
alternative label: Vzhodna Evropa – skupina II @sl
alternative label: Osteuropa - Gruppe II @de
alternative label: Europa Wschodnia – Grupa II @pl
alternative label: Istočna Europa – skupina II. @hr
broader: Parliamentary delegation
definition: Delegation for relations with the countries of Eastern Europe - Group II.
in scheme: EP taxonomy on entities.
preferred label: Delegación para las relaciones con los países de Europa Oriental - Grupo II @es
preferred label: Delegacija za odnose z državami vzhodne Evrope – skupina II @sl
preferred label: Delegacja ds. stosunków z panstwami Europy Wschodniej – Grupa II @pl
preferred label: Delegacija ryšiams su Rytu Europa – II grupe @lt
preferred label: Delegationen for Forbindelserne med landerne i Østeurope - Gruppe II @da
preferred label: Delegazzjoni ghar-relazzjonijiet mal-pajjizi ta’ l-Ewropa tal-Lvant - Grupp II @mt
preferred label: Delegácia pre vztahy s krajinami Východnej Európy - skupina II @sk
preferred label: Ühenduse ja Ida-Euroopa II grupi riikide vaheliste suhetega tegelev delegatsioon @et
preferred label: Delegatie voor de betrekkingen met de Oosteuropese landen - Groep II @nl
preferred label: Délégation pour les relations avec les pays de l'Europe de l'Est - Groupe II @fr
preferred label: Αντιπροσωπεία για τις σχέσεις με τις χώρες της Ανατολικής Ευρώπης - Ομάδα ΙI @el
preferred label: Delegația pentru relațiile cu țările din Europa de Est - Grupa II @ro
preferred label: Delegace pro vztahy se zeměmi východní Evropy – Skupina II @cs
preferred label: Делегация за връзки със страните от Източна Европа - Група II @bg
preferred label: Delegationen för förbindelserna med länderna i Östeuropa - grupp 2 @sv
preferred label: Toscaireacht don chaidreamh le tíortha Oirthear na hEorpa - Grúpa II @ga
preferred label: Delegacija attiecibam ar Austrumeiropas - II grupas valstim @lv
preferred label: Delegação para as relações com os países da Europa de Leste - Grupo II @pt
preferred label: Izaslanstvo za odnose sa zemljama Istočne Europe – skupinom II. @hr
preferred label: Delegazione per le relazioni con i paesi dell'Europa dell'Est - Gruppo II @it
preferred label: Suhteista Itä-Euroopan maihin - ryhmä II - vastaava valtuuskunta @fi
preferred label: A kelet-európai II. Csoporttal való kapcsolatokért felelos küldöttség @hu
preferred label: Delegation für die Beziehungen zu den Ländern Osteuropas - Gruppe II @de

Delegation for relations with the Republics of the Commonwealth of Independent States (CIS)
type: Concept
created: 2023-10-31
deprecated: true
alternative label: Общност на независимите държави (ОНД) @bg
alternative label: Comunità di Stati indipendenti (CSI) @it
alternative label: Wspólnota Niepodleglych Panstw (WNP) @pl
alternative label: Comunidad de Estados Independientes (CEI) @es
alternative label: Comunidade de Estados Independentes (CEI) @pt
alternative label: Κοινοπολιτεία Ανεξάρτητων Κρατών (ΚΑΚ) @el
alternative label: zveze neodvisnih držav (CIS) @sl
alternative label: Oberoende staters samvälde (OSS) @sv
alternative label: Delegatie voor de betrekkingen met de republieken @nl
alternative label: Gidkomuni ta’ l-Istati Indipendenti (GII) @mt
alternative label: Zajednica nezavisnih država (ZND) @hr
alternative label: Commonwealth of Independent States (CIS)
alternative label: Comunitatea Statelor Independente (CSI) @ro
alternative label: Gemeinschaft Unabhängiger Staaten (GUS) @de
alternative label: Itsenäisten valtioiden yhteisö (IVY) @fi
alternative label: Sõltumatute Riikide Ühendus (SRÜ) @et
alternative label: Společenství nezávislých států (SNS) @cs
alternative label: Független Államok Nemzetközössége @hu
alternative label: Nepriklausomu valstybiu federacija (CIS) @lt
alternative label: Samfundet af Uafhængige Stater (SNG) @da
alternative label: Communauté des Etats indépendants (CEI) @fr
alternative label: Comhlathas na Stát Neamhspleách (CSN) @ga
alternative label: Neatkarigo valstu savieniba (NVS) @lv
alternative label: Spolocenstvo nezávislých štátov (CIS) @sk
broader: Parliamentary delegation
definition: Delegation for relations with the Republics of the Commonwealth of Independent States (CIS).
in scheme: EP taxonomy on entities.
preferred label: Delegace pro vztahy s republikami Společenství nezávislých států (SNS) @cs
preferred label: Delegazzjoni ghar-relazzjonijiet mar-Repubbliki tal-Gidkomuni ta’ l-Istati Indipendenti (GII) @mt
preferred label: Delegacija za odnose z republikami Zveze neodvisnih držav (CIS) @sl
preferred label: Delegación para las relaciones con las Repúblicas de la Comunidad de Estados Independientes (CEI) @es
preferred label: Delegazione per le relazioni con le Repubbliche della Comunità di Stati indipendenti (CSI) @it
preferred label: Delegația pentru relațiile cu republicile din Comunitatea Statelor Independente (CSI) @ro
preferred label: Suhteista itsenäisten valtioiden yhteisön (IVY) tasavaltoihin vastaava @fi
preferred label: Izaslanstvo za odnose s republikama Zajednice nezavisnih država (ZND) @hr
preferred label: Delegationen for Forbindelserne med Republikkerne i Samfundet af Uafhængige Stater (SNG) @da
preferred label: Делегация за връзки с републиките от Общността на независимите държави (ОНД) @bg
preferred label: Toscaireacht don chaidreamh le poblachtaí Chomhlathas na Stát Neamhspleách (CSN) @ga
preferred label: Delegacija ryšiams su Nepriklausomu valstybiu federacijos (CIS) respublikomis @lt
preferred label: Ühenduse ja Sõltumatute Riikide Ühenduse (SRÜ) vabariikide vaheliste suhetega tegelev delegatsioon @et
preferred label: Delegácia pre vztahy s republikami Spolocenstva nezávislých štátov (CIS) @sk
preferred label: Delegacja ds. stosunków z republikami ze Wspólnoty Niepodleglych Panstw (WNP) @pl
preferred label: Delegação para as relações com as Repúblicas da Comunidade de Estados Independentes (CEI) @pt
preferred label: Delegatie voor de betrekkingen met de republieken van het Gemenebest van Onafhankelijke Staten (GOS) @nl
preferred label: Αντιπροσωπεία για τις σχέσεις με τις δημοκρατίες της Κοινοπολιτείας Ανεξαρτήτων Κρατών (ΚΑΚ) @el
preferred label: Delegation für die Beziehungen zu den Republiken der Gemeinschaft Unabhängiger Staaten (GUS) @de
preferred label: Délégation pour les relations avec les Républiques de la Communauté des Etats indépendants (CEI) @fr
preferred label: Delegacija attiecibam ar Neatkarigo valstu savienibas republikam (NVS) @lv
preferred label: Delegationen för förbindelserna med republikerna i Oberoende staters samvälde (OSS) @sv
preferred label: A Független Államok Nemzetközösségének (CIS) köztársaságaival való kapcsolattartáshoz delegáltak @hu

Committee on Foreign Affairs
type: Concept
created: 2023-10-31
deprecated: false
alternative label: Buitenlandse zaken @nl
alternative label: Ulkoasiat @fi
alternative label: Utrikesfrågor @sv
alternative label: Foreign Affairs
alternative label: Zahraniční věci @cs
alternative label: Affari esteri @it
alternative label: Vanjski poslovi @hr
alternative label: Afaceri externe @ro
alternative label: Külügy @hu
alternative label: Външни работи @bg
alternative label: Užsienio reikalai @lt
alternative label: Gnóthaí Eachtracha @ga
alternative label: Välisasjad @et
alternative label: Ārlietas @lv
alternative label: Assuntos Externos @pt
alternative label: Affaires étrangères @fr
alternative label: Affarijiet Barranin @mt
alternative label: Auswärtige Angelegenheiten @de
alternative label: Εξωτερικές Υποθέσεις @el
alternative label: Zahraničné veci @sk
alternative label: Asuntos Exteriores @es
alternative label: Zunanje zadeve @sl
alternative label: Sprawy Zagraniczne @pl
preferred label: Udenrigsudvalget @da
broader: Standing parliamentary committee
definition: European parliamentary committee on foreign affairs.
in scheme: EP taxonomy on entities.
preferred label: An Coiste um Ghnóthaí Eachtracha @ga
preferred label: Kumitat għall-Affarijiet Barranin @mt
preferred label: Commission des affaires étrangères @fr
preferred label: Комисия по външни работи @bg
preferred label: Επιτροπή Εξωτερικών Υποθέσεων @el
preferred label: Ausschuss für auswärtige Angelegenheiten @de
preferred label: Užsienio reikalų komitetas @lt
preferred label: Utskottet för utrikesfrågor @sv
preferred label: Odbor za vanjske poslove @hr
preferred label: Odbor za zunanje zadeve @sl
preferred label: Väliskomisjon @et
preferred label: Comisia pentru afaceri externe @ro
preferred label: Výbor pre zahraničné veci @sk
preferred label: Ārlietu komiteja @lv
preferred label: Ulkoasiainvaliokunta @fi
preferred label: Comisión de Asuntos Exteriores @es
preferred label: Commissione per gli affari esteri @it
preferred label: Commissie buitenlandse zaken @nl
preferred label: Külügyi Bizottság @hu
preferred label: Comissão dos Assuntos Externos @pt
preferred label: Výbor pro zahraniční věci @cs
preferred label: Komisja Spraw Zagranicznych @pl

Delegation for relations with Austria
type: Concept
created: 2023-10-31
deprecated: true
alternative label: Austrija @hr
alternative label: Østrig @da
alternative label: Rakousko @cs
alternative label: Autriche @fr
alternative label: Österrike @sv
alternative label: Avstrija @sl
alternative label: Itävalta @fi
alternative label: Αυστρία @el
alternative label: Rakúsko @sk
alternative label: Ausztria @hu
alternative label: Oostenrijk @nl
alternative label: Áustria @pt
alternative label: An Ostair @ga
alternative label: Австрия @bg
alternative label: Austria
alternative label: Awstrija @mt
alternative label: Österreich @de
broader: Parliamentary delegation
definition: Delegation for relations with Austria.
in scheme: EP taxonomy on entities.
preferred label: Delegazzjoni ghar-relazzjonijiet ma’ l-Awstrija @mt
preferred label: Delegatie voor de betrekkingen met Oostenrijk @nl
preferred label: Delegacija za odnose z Avstrijo @sl
preferred label: Suhteista Itävaltaan vastaava valtuuskunta @fi
preferred label: Izaslanstvo za odnose s Austrijom @hr
preferred label: Delegation für die Beziehungen zu Österreich @de
preferred label: Delegación para las relaciones con Austria @es
preferred label: Toscaireacht don chaidreamh leis an Ostair @ga
preferred label: Αντιπροσωπεία για τις σχέσεις με την Αυστρία @el
preferred label: Delegationen för förbindelserna med Österrike @sv
preferred label: Delegace pro vztahy s Rakouskem @cs
preferred label: Delegação para as relações com a Áustria @pt
preferred label: Delegacija attiecibam ar Austriju @lv
preferred label: Delegazione per le relazioni con l'Austria @it
preferred label: Делегация за връзки с Австрия @bg
preferred label: Ühenduse ja Austria vaheliste suhetega tegelev delegatsioon @et
preferred label: Delegationen for Forbindelserne med Østrig @da
preferred label: Délégation pour les relations avec l'Autriche @fr
preferred label: Delegacja ds. stosunków z Austria @pl
preferred label: Delegacija ryšiams su Austrija @lt
preferred label: Az Ausztriával való kapcsolatokért felelos küldöttség @hu
preferred label: Delegația pentru relațiile cu Austria @ro
preferred label: Delegácia pre vztahy s Rakúskom @sk

Joint committee procedure - ECON, ENVI and LIBE
type: Concept
created: 2025-06-30
deprecated: false
alternative label: Commissions conjointes ECON - ENVI - LIBE @fr
alternative label: Joint ECON - ENVI - LIBE
alternative label: ECON, ENVI und LIBE @de
broader: Joint parliamentary committees
definition: Joint committee procedure - ECON, ENVI and LIBE.
in scheme: EP taxonomy on entities.
preferred label: Procédure avec commissions conjointes - ECON, ENVI et LIBE @fr
preferred label: Gemeinsames Ausschussverfahren - ECON, ENVI und LIBE @de

Delegation to the Euro-Latin American Parliamentary Assembly
type: Concept
created: 2023-10-31
deprecated: false
broader: Temporary parliamentary legislative committee
definition: Delegation to the Euro-Latin American Parliamentary Assembly.
in scheme: EP taxonomy on entities.
preferred label: Delegația la Adunarea Parlamentară Euro-Latinoamericană @ro
preferred label: Delegacija pri Evro-latinskoameriški parlamentarni skupščini @sl
preferred label: Delegation in der Parlamentarischen Versammlung Europa-Lateinamerika @de
preferred label: Delegacja do Europejsko-Latynoamerykańskiego Zgromadzenia Parlamentarnego @pl
preferred label: Delegazione all'Assemblea parlamentare euro-latinoamericana @it
preferred label: Delegace v Parlamentním shromáždění EU-Latinská Amerika @cs
preferred label: Delegácia pri Euro-latinskoamerickom parlamentnom zhromaždení @sk
preferred label: An Toscaireacht chun an Tionóil Pharlaimintigh idir an Eoraip agus Meiriceá Laidineach @ga
preferred label: Delegācija Eiropas un Latīņamerikas parlamentārajā asamblejā @lv
preferred label: Valtuuskunta EU:n ja Latinalaisen Amerikan parlamentaarisessa edustajakokouksessa @fi
preferred label: Αντιπροσωπεία στην Κοινοβουλευτική Συνέλευση ΕΕ - Λατινικής Αμερικής @el
preferred label: Delegação à Assembleia Parlamentar Euro-Latino-Americana @pt
preferred label: Delegazzjoni għall-Assemblea Parlamentari Ewro-Latino-Amerikana @mt
preferred label: Délégation à l'Assemblée parlementaire euro-latino-américaine @fr
preferred label: Delegatie in de Euro-Latijns-Amerikaanse Parlementaire Vergadering @nl
preferred label: Az Euro–Latin-amerikai Parlamenti Közgyűlésbe delegált küldöttség @hu
preferred label: Izaslanstvo u Europsko-latinskoameričkoj parlamentarnoj skupštini @hr
preferred label: Delegationen til Den Euro-Latinamerikanske Parlamentariske Forsamling @da
preferred label: Delegationen till den parlamentariska församlingen EU-Latinamerika @sv
preferred label: Delegatsioon Euroopa – Ladina-Ameerika parlamentaarses assamblees @et
preferred label: Delegación en la Asamblea Parlamentaria Euro-Latinoamericana @es
preferred label: Delegacija Europos ir Lotynų Amerikos šalių parlamentinėje asamblėjoje @lt
preferred label: Делегация в Евро-латиноамериканската парламентарна асамблея @bg

Delegation to the European Economic Area Joint Parliamentary Committee (EEA)
type: Concept
created: 2023-10-31
deprecated: true
alternative label: Europejski Obszar Gospodarczy (EOG) @pl
alternative label: Europæiske Økonomiske Samarbejdsområde (EØS) @da
alternative label: Euroopa Majanduspiirkond (EMP) @et
alternative label: Europese Economische Ruimte (EER) @nl
alternative label: Euroopan talousalue (ETA) @fi
alternative label: Európsky hospodársky priestor (EEA) @sk
alternative label: Evropski gospodarski prostor (EGP) @sl
alternative label: Spazio economico europeo (SEE) @it
alternative label: Europeiska ekonomiska samarbetsområdet (EES) @sv
alternative label: An Limistéar Eorpach Eacnamaíoch (LEE) @ga
alternative label: Evropský hospodářský prostor (EHP) @cs
alternative label: Европейско икономическо пространство (ЕИП) @bg
alternative label: Espacio Económico Europeo (EEE) @es
alternative label: Επιτροπή Ενιαίος Ευρωπαϊκός Χώρος @el
alternative label: Eiropas Ekonomikas zona (EEZ) @lv
alternative label: Espaço Económico Europeu (EEE) @pt
alternative label: Europski gospodarski prostor (EGP) @hr
alternative label: Spațiul Economic European (SEE) @ro
alternative label: Europos ekonominė erdvė (EEE) @lt
alternative label: Espace économique européen (EEE) @fr
alternative label: Európai Gazdasági Térség (EGT) @hu
alternative label: Arja Ekonomika Ewropea (AEE) @mt
alternative label: Europäischer Wirtschaftsraum (EWR) @de
alternative label: European Economic Area (EEA)
broader: Delegation to Joint Parliamentary Committee
definition: Delegation to the European Economic Area Joint Parliamentary Committee (EEA).
in scheme: EP taxonomy on entities.
preferred label: Izaslanstvo u Zajedničkom parlamentarnom odboru Europskog gospodarskog prostora (EGP) @hr
preferred label: Αντιπροσωπεία στη Μικτή Κοινοβουλευτική Επιτροπή Ενιαίος Ευρωπαϊκός Χώρος (ΕΕΧ) @el
preferred label: Delegationen till den gemensamma parlamentarikerkommittén Europeiska ekonomiska samarbetsområdet (EES) @sv
preferred label: Toscaireacht chun an Chomhchoiste Pharlaimintigh an Limistéir Eorpaigh Eacnamaíoch (LEE) @ga
preferred label: Az Európai Gazdasági Térség (EGT) Parlamenti Vegyes Bizottságba delegált küldöttség @hu
preferred label: Делегация в Съвместния парламентарен комитет на Европейското икономическо пространство (ЕИП) @bg
preferred label: Eiropas Ekonomikas zonas Apvienotās parlamentārās komitejas delegācija (EEZ) @lv
preferred label: Delegatsioon parlamendi Euroopa Majanduspiirkonna (EMP) ühiskomisjonis @et
preferred label: Valtuuskunta Euroopan talousalueen parlamentaarisessa sekavaliokunnassa (ETA) @fi
preferred label: Delegacija Europos ekonominės erdvės jungtiniame parlamentiniame komitete (EEE) @lt
preferred label: Delegația la Comisia parlamentară mixtă a Spațiului Economic European (SEE) @ro
preferred label: Delegazione alla commissione parlamentare mista Spazio economico europeo (SEE) @it
preferred label: Delegácia pri Spoločnom parlamentnom výbore Európskeho hospodárskeho priestoru (EHP) @sk
preferred label: Delegação à Comissão Parlamentar Mista Espaço Económico Europeu (EEE) @pt
preferred label: Delegation im gemischten parlamentarischen Ausschuss Europäischer Wirtschaftsraum (EWR) @de
preferred label: Délégation à la commission parlementaire mixte Espace économique européen (EEE) @fr
preferred label: Delegatie in de Gemengde Parlementaire Commissie Europese Economische Ruimte (EER) @nl
preferred label: Delegazzjoni lejn il-Kumitat Parlamentari Maghqud Arja Ekonomika Ewropea (AEE) @mt
preferred label: Delegacja do wspólnej komisji parlamentarnej do spraw Europejskiego Obszaru Gospodarczego (EOG) @pl
preferred label: Delegacija pri Skupnem parlamentarnem odboru za Evropski gospodarski prostor (EGP) @sl
preferred label: Delegationen til Det Blandede Parlamentariske Udvalg for Det Europæiske Økonomiske Samarbejdsområde (EØS) @da
preferred label: Delegación en la Comisión Parlamentaria Mixta del Espacio Económico Europeo (EEE) @es
preferred label: Delegace při smíšeném parlamentním výboru Evropského hospodářského prostoru @cs

Committee on Security and Defence
type: Concept
created: 2025-01-31
deprecated: false
alternative label: Sicherheit und Verteidigung @de
alternative label: Sigurtà u d-Difiża @mt
alternative label: Biztonság- és védelempolitika @hu
alternative label: Sikkerhed og Forsvar @da
alternative label: Bezpieczeństwo i Obrona @pl
alternative label: Seguridad y Defensa @es
alternative label: Veiligheid en defensie @nl
alternative label: Segurança e Defesa @pt
alternative label: Sigurnost i obrana @hr
alternative label: Drošība un aizsardzība @lv
alternative label: Turvallisuus- ja puolustuspolitiikka @fi
alternative label: Saugumas ir gynyba @lt
alternative label: Security and Defence
alternative label: Ασφάλεια και Άμυνα @el
alternative label: Sicurezza e difesa @it
alternative label: Bezpečnost a obrana @cs
alternative label: Slándáil agus Cosaint @ga
alternative label: Julgeolek ja kaitse @et
alternative label: Bezpečnosť a obrana @sk
alternative label: Securitate și apărare @ro
alternative label: Varnost in obramba @sl
alternative label: Sécurité et défense @fr
alternative label: Сигурност и отбрана @bg
alternative label: Säkerhet och försvar @sv
broader: Standing parliamentary committee
definition: European parliamentary subcommittee on security and defence.
in scheme: EP taxonomy on entities.
preferred label: Comisión de Seguridad y Defensa @es
preferred label: Výbor pro bezpečnost a obranu @cs
preferred label: Kumitat għas-Sigurtà u d-Difiża @mt
preferred label: Komisja Bezpieczeństwa i Obrony @pl
preferred label: Udvalget om Sikkerhed og Forsvar @da
preferred label: Ausschuss für Sicherheit und Verteidigung @de
preferred label: Utskottet för säkerhet och försvar @sv
preferred label: Commission "sécurité et défense" @fr
preferred label: Biztonság- és Védelempolitikai Bizottság @hu
preferred label: Odbor za varnost in obrambo @sl
preferred label: Výbor pre bezpečnosť a obranu @sk
preferred label: An Coiste um Shlándáil agus Cosaint @ga
preferred label: Commissione per la sicurezza e la difesa @it
preferred label: Drošības un aizsardzības komiteja @lv
preferred label: Saugumo ir gynybos komitetas @lt
preferred label: Комисия по сигурност и отбрана @bg
preferred label: Επιτροπή Ασφάλειας και Άμυνας @el
preferred label: Julgeoleku- ja kaitsekomisjon @et
preferred label: Turvallisuus- ja puolustuspolitiikan valiokunta @fi
preferred label: Odbor za sigurnost i obranu @hr
preferred label: Comisia pentru securitate și apărare @ro
preferred label: Comissão da Segurança e da Defesa @pt
preferred label: Commissie veiligheid en defensie @nl

European Education and Culture Executive Agency
type: Concept
created: 2023-10-31
deprecated: false
broader: Executive agency
definition: European Education and Culture Executive Agency.
in scheme: EP taxonomy on entities.
preferred label: Europejska Agencja Wykonawcza ds. Edukacji i Kultury @pl
preferred label: Európai Oktatási és Kulturális Végrehajtó Ügynökség @hu
preferred label: Agencia Ejecutiva Europea de Educación y Cultura @es
preferred label: Agence exécutive européenne pour l’éducation et la culture @fr
preferred label: Европейска изпълнителна агенция за образование и култура @bg
preferred label: Det Europæiske Forvaltningsorgan for Uddannelse og Kultur @da
preferred label: Agência de Execução Europeia da Educação e da Cultura @pt
preferred label: Europäische Exekutivagentur für Bildung und Kultur @de
preferred label: Euroopan koulutuksen ja kulttuurin toimeenpanovirasto @fi
preferred label: L-Aġenzija Eżekuttiva Ewropea għall-Edukazzjoni u għall-Kultura @mt
preferred label: An Ghníomhaireacht Feidhmiúcháin Eorpach um Oideachas agus Cultúr @ga
preferred label: Európska výkonná agentúra pre vzdelávanie a kultúru @sk
preferred label: Euroopa Hariduse ja Kultuuri Rakendusamet @et
preferred label: Europeiska genomförandeorganet för utbildning och kultur @sv
preferred label: Agenzia esecutiva europea per l’istruzione e la cultura @it
preferred label: Europska izvršna agencija za obrazovanje i kulturu @hr
preferred label: Europos švietimo ir kultūros vykdomoji įstaiga @lt
preferred label: Europees Uitvoerend Agentschap onderwijs en cultuur @nl
preferred label: Agenția Executivă Europeană pentru Educație și Cultură @ro
preferred label: Evropská výkonná agentura pro vzdělávání a kulturu @cs
preferred label: Ευρωπαϊκός Εκτελεστικός Οργανισμός Εκπαίδευσης και Πολιτισμού @el
preferred label: Eiropas Izglītības un kultūras izpildaģentūra @lv
preferred label: Evropska izvajalska agencija za izobraževanje in kulturo @sl

Joint committee procedure - EMPL and IMCO
type: Concept
created: 2025-01-31
deprecated: false
alternative label: EMPL und IMCO @de
alternative label: Commissions conjointes EMPL - IMCO @fr
alternative label: Joint EMPL - IMCO
broader: Joint parliamentary committees
definition: Joint committee procedure - EMPL and IMCO.
in scheme: EP taxonomy on entities.
preferred label: Gemeinsames Ausschussverfahren - EMPL und IMCO @de
preferred label: Procédure avec commissions conjointes - EMPL et IMCO @fr

Joint committee procedure - BUDG and CONT
type: Concept
created: 2023-10-31
deprecated: false
alternative label: Joint BUDG - CONT
alternative label: Commissions conjointes BUDG - CONT @fr
alternative label: BUDG und CONT @de
broader: Joint parliamentary committees
definition: Joint committee procedure - BUDG and CONT.
in scheme: EP taxonomy on entities.
preferred label: Procédure avec commissions conjointes - BUDG et CONT @fr
preferred label: Gemeinsames Ausschussverfahren - BUDG und CONT @de

Lithuanian Parliament
type: Concept
created: 2023-10-31
deprecated: false
broader: National chamber
definition: Lithuanian Parliament.
in scheme: EP taxonomy on entities.
preferred label: Parlamento lituano @es
preferred label: Det litauiska parlamentet @sv
preferred label: parlament Litwy @pl
preferred label: Сейм на Република Литва @bg
preferred label: Leedu Seim @et
preferred label: Litouws parlement @nl
preferred label: det litauiske parlament @da
preferred label: Parlement lituanien @fr
preferred label: Liettuan parlamentti @fi
preferred label: Parlament Litwan @mt
preferred label: litauisches Parlament @de
preferred label: litván parlament @hu
preferred label: Lietuvos Respublikos Seimas @lt
preferred label: Parlamentul Lituaniei @ro
preferred label: Parlaimint na Liotuáine @ga
preferred label: Litavski parlament @hr
preferred label: Lietuvas Republikas Seims @lv
preferred label: Λιθουανικό Κοινοβούλιο @el
preferred label: litovský parlament @sk
preferred label: litovski parlament @sl
preferred label: litevský parlament @cs

Delegation for relations with the Gulf States, including Yemen
type: Concept
created: 2023-10-31
deprecated: true
alternative label: Države Perzijskog zaljeva @hr
alternative label: Pajjiżi tal-Golf, Jemen @mt
alternative label: Golfstaaten, Jemen @de
alternative label: Statele din Golf, Yemen @ro
alternative label: Státy Perského zálivu, Jemen @cs
alternative label: Pärsia lahe riigid (k.a Jeemen) @et
alternative label: Персийски залив, Йемен @bg
alternative label: Persijas līča valstis, Jemena @lv
alternative label: Stáit na Murascaille, Éimin @ga
alternative label: Štáty Perzského zálivu, Jemen @sk
alternative label: Golfstaten, Jemen @nl
alternative label: Persijos įlankos valstybės, Jemenas @lt
alternative label: Zalivske države, Jemen @sl
alternative label: Państwa rejonu Zatoki Perskiej, w tym Jemen @pl
alternative label: Golfstaterne, Yemen @da
alternative label: États du Golfe, Yémen @fr
alternative label: Stati del Golfo, Yemen @it
alternative label: Κράτη του Κόλπου, Υεμένη @el
alternative label: Persianlahden valtiot, Jemen @fi
alternative label: Estados do Golfo, Iémen @pt
alternative label: Gulf States, Yemen
alternative label: Estados del Golfo, Yemen @es
alternative label: Gulfstaterna (inklusive Jemen) @sv
alternative label: Öböl-országok, Jemen @hu
broader: Parliamentary delegation
definition: Delegation for relations with the Gulf States, including Yemen.
in scheme: EP taxonomy on entities.
preferred label: Az Öböl-országokkal, beleértve Jement, fenntartott kapcsolatokért felelős küldöttség @hu
preferred label: Delegácia pre vzťahy so štátmi Perzského zálivu vrátane Jemenu @sk
preferred label: Delegacija ryšiams su Persijos įlankos valstybėmis, įskaitant Jemeną @lt
preferred label: Izaslanstvo za odnose s državama Perzijskog zaljeva, uključujući Jemen @hr
preferred label: Delegazione per le relazioni con gli Stati del Golfo, compreso lo Yemen @it
preferred label: Delegationen för förbindelserna med Gulfstaterna (inklusive Jemen) @sv
preferred label: Suhteista Persianlahden valtioihin mukaan lukien Jemen vastaava valtuuskunta @fi
preferred label: Delegace pro vztahy se státy Perského zálivu včetně Jemenu @cs
preferred label: Делегация за връзки с държавите от Персийския залив, включително Йемен @bg
preferred label: Delegacija za odnose z zalivskimi državami vključno z Jemnom @sl
preferred label: Delegatsioon Pärsia lahe riikidega (k.a Jeemen) suhtlemiseks @et
preferred label: Delegatie voor de betrekkingen met de Golfstaten, inclusief Jemen @nl
preferred label: Delegationen for Forbindelserne med Golfstaterne, herunder Yemen @da
preferred label: Délégation pour les relations avec les États du Golfe, y compris le Yémen @fr
preferred label: Delegação para as Relações com os Estados do Golfo, incluindo o Iémen @pt
preferred label: Delegacja do spraw stosunków z państwami rejonu Zatoki Perskiej, w tym z Jemenem @pl
preferred label: Delegația pentru relațiile cu statele din Golf, inclusiv Yemen @ro
preferred label: Delegācija attiecībām ar Persijas līča valstīm, ieskaitot Jemenu @lv
preferred label: Toscaireacht don chaidreamh le Stáit na Murascaille, Éimin san áireamh @ga
preferred label: Delegazzjoni għar-relazzjonijiet mal-pajjiżi tal-Golf inkluż il-Jemen @mt
preferred label: Delegación para las Relaciones con los Estados del Golfo, incluido el Yemen @es
preferred label: Αντιπροσωπεία για τις σχέσεις με τα Κράτη του Κόλπου, συμπεριλαμβανομένης της Υεμένης @el
preferred label: Delegation für die Beziehungen zu den Golfstaaten, einschließlich Jemen @de

Delegation for relations with Bosnia and Herzegovina, and Kosovo
type: Concept
created: 2023-10-31
deprecated: false
alternative label: Bosznia-Hercegovina, Koszovó @hu
alternative label: Βοσνία-Ερζεγοβίνη, Κοσσυφοπέδιο @el
alternative label: Bosnien och Hercegovina, Kosovo @sv
alternative label: Bośnia i Hercegowina, Kosowo @pl
alternative label: Bosnie-Herzégovine et Kosovo @fr
alternative label: Bosna a Hercegovina, Kosovo @sk
alternative label: Bosnien und Herzegowina, Kosovo @de
alternative label: An Bhoisnia-Heirseavaigéin, An Chosaiv @ga
alternative label: Bosna i Hercegovina, Kosovo @hr
alternative label: Bosnia ja Hertsegovina, Kosovo @fi
alternative label: Bosnia și Herțegovina, Kosovo @ro
alternative label: Bosnija ir Hercegovina ir Kosovu @lt
alternative label: Bosnia ja Hertsegoviina, Kosovo @et
alternative label: Bósnia e Herzegovina, Kosovo @pt
alternative label: Bosnija un Hercegovina, Kosova @lv
alternative label: Bosnia y Herzegovina, Kosovo @es
alternative label: Bosnia-Erzegovina, Kosovo @it
alternative label: Босна и Херцеговина, Косово @bg
alternative label: Bosnien-Hercegovina, Kosovo @da
alternative label: Bosnië-Herzegovina, Kosovo @nl
alternative label: Bosnia and Herzegovina, Kosovo
alternative label: Bosnia-Ħerżegovìna, Kosovo @mt
broader: Parliamentary delegation
definition: Delegation for relations with Bosnia and Herzegovina, and Kosovo.
in scheme: EP taxonomy on entities.
preferred label: Делегация за връзки с Босна и Херцеговина и с Косово @bg
preferred label: Délégation pour les relations avec la Bosnie-Herzégovine et le Kosovo @fr
preferred label: Delegația pentru relațiile cu Bosnia-Herțegovina și Kosovo @ro
preferred label: Delegazione per le relazioni con la Bosnia-Erzegovina e il Kosovo @it
preferred label: Delegationen for Forbindelserne med Bosnien-Hercegovina og Kosovo @da
preferred label: Αντιπροσωπεία για τις σχέσεις με τη Βοσνία και Ερζεγοβίνη και το Κοσσυφοπέδιο @el
preferred label: An Toscaireacht don chaidreamh leis an mBoisnia agus an Heirseagaivéin agus leis an gCosaiv @ga
preferred label: Suhteista Bosnia ja Hertsegovinaan ja Kosovoon vastaava valtuuskunta @fi
preferred label: Delegacja do spraw stosunków z Bośnią i Hercegowiną oraz Kosowem @pl
preferred label: Delegation für die Beziehungen zu Bosnien und Herzegowina und dem Kosovo @de
preferred label: Delegação para as Relações com a Bósnia-Herzegovina e o Kosovo @pt
preferred label: Delegación para las Relaciones con Bosnia y Herzegovina y Kosovo @es
preferred label: Delegācija attiecībām ar Bosniju un Hercegovinu un Kosovu @lv
preferred label: A Bosznia-Hercegovinával és Koszovóval fenntartott kapcsolatokért felelős küldöttség @hu
preferred label: Delegatie voor de betrekkingen met Bosnië en Herzegovina, en Kosovo @nl
preferred label: Delegace pro vztahy s Bosnou a Hercegovinou a s Kosovem @cs
preferred label: Delegationen för förbindelserna med Bosnien och Hercegovina och Kosovo @sv
preferred label: Delegácia pre vzťahy s Bosnou a Hercegovinou a Kosovom @sk
preferred label: Izaslanstvo za odnose s Bosnom i Hercegovinom te Kosovom @hr
preferred label: Delegazzjoni għar-relazzjonijiet mal-Bosnja-Ħerzegovina u l-Kosovo @mt
preferred label: Delegatsioon Bosnia ja Hertsegoviina ning Kosovoga suhtlemiseks @et
preferred label: Delegacija ryšiams su Bosnija ir Hercegovina ir Kosovu @lt
preferred label: Delegacija za odnose z Bosno in Hercegovino ter Kosovom @sl

Group of the Progressive Alliance of Socialists and Democrats in the European Parliament
type: Concept
created: 2023-10-31
deprecated: false
preferred label: Gruppen for Det Progressive Forbund af Socialdemokrater i Europa-Parlamentet @da
preferred label: Ομάδα της Προοδευτικής Συμμαχίας των Σοσιαλιστών και Δημοκρατών στο Ευρωπαϊκό Κοινοβούλιο @el
preferred label: Gruppo dell'Alleanza progressista di Socialisti e Democratici al Parlamento Europeo @it
preferred label: skupina Progresivní aliance socialistů a demokratů v Evropském parlamentu @cs
preferred label: Fraktion der Progressiven Allianz der Sozialdemokraten im Europäischen Parlament @de
preferred label: Grupp tal-Alleanza Progressiva tas-Soċjalisti u d-Demokratiċi fil-Parlament Ewropew @mt
preferred label: Grupul Alianței Progresiste a Socialiștilor si Democraților din Parlamentul European @ro
preferred label: Eiropas Parlamenta sociālistu un demokrātu progresīvās alianses grupa @lv
preferred label: Skupina naprednega zavezništva socialistov in demokratov v Evropskem parlamentu @sl
preferred label: Grupo da Aliança Progressista dos Socialistas e Democratas no Parlamento Europeu @pt
preferred label: Sotsiaaldemokraatide ja demokraatide fraktsioon Euroopa Parlamendis @et
preferred label: Europos Parlamento socialistų ir demokratų pažangiojo aljanso frakcija @lt
preferred label: Euroopan parlamentin sosialistien ja demokraattien ryhmä @fi
preferred label: Klub zastupnika Progresivnog saveza socijalista i demokrata u Europskom parlamentu @hr
preferred label: Szocialisták és Demokraták Progresszív Szövetsége az Európai Parlamentben képviselőcsoport @hu
preferred label: Skupina progresívnej aliancie socialistov a demokratov v Európskom parlamente @sk
preferred label: Grúpa an Aontais Fhorásach na Sóisialaithe agus na nDaonlathaithe i bParliament na hEorpa @ga
preferred label: Fractie van de Progressieve Alliantie van Socialisten en Democraten in het Europees Parlement @nl
preferred label: Група на Прогресивния алианс на социалистите и демократите в Европейския парламент @bg
preferred label: Grupa Postępowego Sojuszu Socjalistów i Demokratów w Parlamencie Europejskim @pl
preferred label: Gruppen Progressiva förbundet av Socialdemokrater i Europaparlamentet @sv
preferred label: Grupo de la Alianza Progresista de Socialistas y Demócratas en el Parlamento Europeo @es
preferred label: Groupe de l'Alliance Progressiste des Socialistes et Démocrates au Parlement européen @fr
broader: POLITICAL GROUP
definition: European political group of the Progressive Alliance of Socialists and Democrats.
in scheme: EP taxonomy on entities.

European Centre for the Development of Vocational Training
type: Concept
created: 2023-10-31
deprecated: false
broader: Decentralised agency
definition: European Centre for the Development of Vocational Training.
in scheme: EP taxonomy on entities.
preferred label: Det Europæiske Center for Udvikling af Erhvervsuddannelse @da
preferred label: Europejskie Centrum Rozwoju Kształcenia Zawodowego @pl
preferred label: Centro Europeo para el Desarrollo de la Formación Profesional @es
preferred label: Ευρωπαϊκό Κέντρο για την Ανάπτυξη της Επαγγελματικής Κατάρτισης @el
preferred label: Europäisches Zentrum für die Förderung der Berufsbildung @de
preferred label: Euroopan ammatillisen koulutuksen kehittämiskeskus @fi
preferred label: Eiropas Profesionālās izglītības attīstības centrs @lv
preferred label: Centro Europeu para o Desenvolvimento da Formação Profissional @pt
preferred label: Europees Centrum voor de ontwikkeling van de beroepsopleiding @nl
preferred label: Centrul European pentru Dezvoltarea Formării Profesionale @ro
preferred label: Iċ-Ċentru Ewropew għall-Iżvilupp ta’ Taħriġ Vokazzjonali @mt
preferred label: Europos profesinio mokymo plėtros centras @lt
preferred label: Europeiskt centrum för utveckling av yrkesutbildning @sv
preferred label: Euroopa Kutseõppe Arenduskeskus @et
preferred label: An Lárionad Eorpach um Fhobairt na Gairmoiliúna @ga
preferred label: Európske stredisko pre rozvoj odborného vzdelávania @sk
preferred label: Centre européen pour le développement de la formation professionnelle @fr
preferred label: Europski centar za razvoj strukovnog osposobljavanja @hr
preferred label: Evropské středisko pro rozvoj odborného vzdělávání @cs
preferred label: Evropski center za razvoj poklicnega usposabljanja @sl
preferred label: Európai Szakképzés-fejlesztési Központ @hu
preferred label: Centro europeo per lo sviluppo della formazione professionale @it
preferred label: Европейски център за развитие на професионалното обучение @bg

Delegation for relations with Estonia
type: Concept
created: 2023-10-31
deprecated: true
alternative label: Estónia @pt
alternative label: Estland @da
alternative label: An Eastóin @ga
alternative label: Естония @bg
alternative label: Estonja @mt
alternative label: Esztország @hu
alternative label: Viro @fi
alternative label: Estonia
alternative label: Εσθονία @el
alternative label: Estija @lt
alternative label: Estonsko @cs
alternative label: Estonija @sl
alternative label: Estonie @fr
alternative label: Estónsko @sk
alternative label: Eesti @et
alternative label: Igaunija @lv
broader: Parliamentary delegation
definition: Delegation for relations with Estonia.
in scheme: EP taxonomy on entities.
preferred label: Suhteista Viroon vastaava valtuuskunta @fi
preferred label: Toscaireacht don chaidreamh leis an Eastóin @ga
preferred label: Delegationen för förbindelserna med Estland @sv
preferred label: Delegation für die Beziehungen zu Estland @de
preferred label: Delegacija za odnose z Estonijo @sl
preferred label: Delegace pro vztahy s Estonskem @cs
preferred label: Delegacija ryšiams su Estija @lt
preferred label: Izaslanstvo za odnose s Estonijom @hr
preferred label: Délégation pour les relations avec l'Estonie @fr
preferred label: Delegácia pre vztahy s Estónskom @sk
preferred label: Az Észtországgal kapcsolatokért felelos küldöttség @hu
preferred label: Delegazione per le relazioni con l'Estonia @it
preferred label: Delegação para as relações com a Estónia @pt
preferred label: Delegazzjoni ghar-relazzjonijiet ma’ l-Estonja @mt
preferred label: Delegatie voor de betrekkingen met Estland @nl
preferred label: Delegación para las Relaciones con Estonia @es
preferred label: Delegacija attiecibam ar Igauniju @lv
preferred label: Delegationen for Forbindelserne med Estland @da
preferred label: Delegația pentru relațiile cu Estonia @ro
preferred label: Ühenduse ja Eesti vaheliste suhetega tegelev delegatsioon @et
preferred label: Αντιπροσωπεία για τις σχέσεις με την Εσθονία @el
preferred label: Delegacja ds. stosunków z Estonia @pl
preferred label: Делегация за връзки с Естония @bg

European Border and Coast Guard Agency
type: Concept
created: 2023-10-31
deprecated: false
broader: Decentralised agency
definition: European Border and Coast Guard Agency.
in scheme: EP taxonomy on entities.
preferred label: L-Aġenzija Ewropea għall-Gwardja tal-Fruntiera u tal-Kosta @mt
preferred label: Agencia Europea de la Guardia de Fronteras y Costas @es
preferred label: Európai Határ- és Partvédelmi Ügynökség @hu
preferred label: Euroopa Piiri- ja Rannikuvalve Amet @et
preferred label: Euroopan raja- ja merivartiovirasto @fi
preferred label: Agência Europeia da Guarda de Fronteiras e Costeira @pt
preferred label: Europäische Agentur für die Grenz- und Küstenwache @de
preferred label: Európska agentúra pre pohraničnú a pobrežnú stráž @sk
preferred label: Agence européenne de garde-frontières et de garde-côtes @fr
preferred label: An Ghníomhaireacht Eorpach um an nGarda Teorann agus Cósta @ga
preferred label: Evropská agentura pro pohraniční a pobřežní stráž @cs
preferred label: Evropska agencija za mejno in obalno stražo @sl
preferred label: Europees Grens- en kustwachtagentschap @nl
preferred label: Agenția Europeană pentru Poliția de Frontieră și Garda de Coastă @ro
preferred label: Agenzia europea della guardia di frontiera e costiera @it
preferred label: Agencija za europsku graničnu i obalnu stražu @hr
preferred label: Europejska Agencja Straży Granicznej i Przybrzeżnej @pl
preferred label: Europeiska gräns- och kustbevakningsbyrån @sv
preferred label: Det Europæiske Agentur for Grænse- og Kystbevogtning @da
preferred label: Europos sienų ir pakrančių apsaugos agentūra @lt
preferred label: Ευρωπαϊκός Οργανισμός Συνοριοφυλακής και Ακτοφυλακής @el
preferred label: Eiropas Robežu un krasta apsardzes aģentūra @lv
preferred label: Европейска агенция за гранична и брегова охрана @bg

Delegation to the EU-Poland Joint Parliamentary Committee
type: Concept
created: 2023-10-31
deprecated: true
alternative label: EU-Poland
alternative label: EU-Puola @fi
alternative label: EU-Polen @nl
alternative label: EL-Poola @et
alternative label: ΕΕ-Πολωνία @el
alternative label: EU-Polsko @cs
alternative label: UE-Polonja @mt
alternative label: EÚ-Polsko @sk
alternative label: ЕС-Полша @bg
alternative label: UE-Pologne @fr
alternative label: UE-Polska @pl
alternative label: EU-Poljska @sl
alternative label: ES-Lenkija @lt
alternative label: UE-Polonia @ro
alternative label: ES-Polija @lv
alternative label: AE-an Pholainn @ga
alternative label: EU – Poljska @hr
alternative label: EU-Lengyelország @hu
alternative label: UE-Polónia @pt
broader: Delegation to Joint Parliamentary Committee
definition: Delegation to the EU-Poland Joint Parliamentary Committee.
in scheme: EP taxonomy on entities.
preferred label: Delegacja do wspólnej komisji parlamentarnej UE-Polska @pl
preferred label: Delegácia pri Spoločnom parlamentnom výbore EÚ-Poľsko @sk
preferred label: Delegationen til Det Blandede Parlamentariske Udvalg EU-Polen @da
preferred label: Délégation à la commission parlementaire mixte UE-Pologne @fr
preferred label: Αντιπροσωπεία στη Μικτή Κοινοβουλευτική Επιτροπή ΕΕ-Πολωνίας @el
preferred label: Delegación en la Comisión Parlamentaria Mixta UE-Polonia @es
preferred label: Az EU-Lengyelország Parlamenti Vegyes Bizottságba delegált küldöttség @hu
preferred label: Delegacija pri Skupnem parlamentarnem odboru EU-Poljska @sl
preferred label: Toscaireacht chun an Chomhchoiste Pharlaimintigh den AE-an Pholainn @ga
preferred label: Delegazzjoni lejn il-Kumitat Parlamentari Maghqud UE-Polonja @mt
preferred label: Delegação à Comissão Parlamentar Mista UE-Polónia @pt
preferred label: Delegatie in de Gemengde Parlementaire Commissie EU-Polen @nl
preferred label: Valtuuskunta EU:n ja Puolan välisessä parlamentaarisessa sekavaliokunnassa @fi
preferred label: Delegația la Comisia parlamentară mixtă UE-Polonia @ro
preferred label: Delegationen till den gemensamma parlamentarikerkommittén EU-Polen @sv
preferred label: Delegatsioon parlamendi ELi-Poola ühiskomisjonis @et
preferred label: Delegazione alla commissione parlamentare mista UE-Polonia @it
preferred label: ES-Polijas Apvienotās parlamentārās komitejas delegācija @lv
preferred label: Delegacija ES-Lenkijos jungtiniame parlamentiniame komitete @lt
preferred label: Делегация в Съвместния парламентарен комитет ЕС-Полша @bg
preferred label: Delegation im gemischten parlamentarischen Ausschuss EU-Polen @de
preferred label: Delegace při smíšeném parlamentním výboru EU-Polsko @cs
preferred label: Izaslanstvo u Zajedničkom parlamentarnom odboru EU-a i Poljske @hr

Joint committee procedure - AFET and INTA
type: Concept
created: 2023-10-31
deprecated: false
alternative label: AFET und INTA @de
alternative label: Joint AFET - INTA
alternative label: Commissions conjointes AFET - INTA @fr
broader: Joint parliamentary committees
definition: Joint committee procedure - AFET and INTA.
in scheme: EP taxonomy on entities.
preferred label: Gemeinsames Ausschussverfahren – AFET und INTA @de
preferred label: Procédure avec commissions conjointes - AFET et INTA @fr

Greek Parliament
type: Concept
created: 2023-10-31
deprecated: false
broader: National chamber
definition: Greek Parliament.
in scheme: EP taxonomy on entities.
preferred label: griechisches Parlament @de
preferred label: Камара на депутатите на Република Гърция @bg
preferred label: parlament Grecji @pl
preferred label: grški parlament @sl
preferred label: Kreeka Esindajatekogu @et
preferred label: Parlament Grieg @mt
preferred label: Parlamento grego @pt
preferred label: Graikijos Respublikos Parlamentas @lt
preferred label: Kreikan parlamentti @fi
preferred label: Parlamento griego @es
preferred label: Grčki parlament @hr
preferred label: det græske parlament @da
preferred label: Βουλή των Ελλήνων @el
preferred label: Parlaimint na Gréige @ga
preferred label: görög parlament @hu
preferred label: řecký parlament @cs
preferred label: Parlamentul Greciei @ro
preferred label: grécky parlament @sk
preferred label: Grieķijas parlaments @lv
preferred label: Det grekiska parlamentet @sv
preferred label: Parlamento greco @it
preferred label: Parlement grec @fr
preferred label: Grieks parlement @nl

Common foreign and security policy agency
type: Concept
created: 2023-10-31
deprecated: false
broader: EU agency
definition: European common foreign and security policy agency.
in scheme: EP taxonomy on entities.
narrow match: AGENCY CFSP
preferred label: Bendra užsienio ir saugumo politika agentūra @lt
preferred label: Közös kül- és biztonságpolitikai ügynökség @hu
preferred label: Agência da política externa e de segurança comum @pt
preferred label: Agentschap van het gemeenschappelijk buitenlands en veiligheidsbeleid @nl
preferred label: Agentur der Gemeinsamen Außen- und Sicherheitspolitik @de
preferred label: Aġenzija tal-politika estera u ta’ sigurtà komuni @mt
preferred label: Agence de la politique étrangère et de sécurité commune @fr
preferred label: Οργανισμός της κοινής εξωτερικής πολιτικής και πολιτικής ασφάλειας @el
preferred label: Agentúra spoločnej zahraničnej a bezpečnostnej politiky @sk
preferred label: Agentura společné zahraniční a bezpečnostní politiky @cs
preferred label: Yhteisen ulko- ja turvallisuuspolitiikan virasto @fi
preferred label: Agenția de politică externă și de securitate comune @ro
preferred label: Agenzia per la politica estera e di sicurezza comune @it
preferred label: Агенции на общата външна политика и политика на сигурност @bg
preferred label: Ghníomhaireacht an chomhbheartais eachtraigh agus slándála @ga
preferred label: Agentur af den fælles udenrigs- og sikkerhedspolitik @da
preferred label: Agencija za zajedničku vanjsku i sigurnosnu politiku @hr
preferred label: Kopējās ārpolitikas un drošības politikas aģentūra @lv
preferred label: Agencja wspólnej polityki zagranicznej i bezpieczeństwa @pl
preferred label: Agencia de política exterior y de seguridad común @es
preferred label: Byrån för gemensam utrikes- och säkerhetspolitik @sv
preferred label: Ühise välis- ja julgeolekupoliitika asutus @et
preferred label: Agencija za skupno zunanjo in varnostno politiko @sl

Committee on Transport and Tourism
type: Concept
created: 2023-10-31
deprecated: false
alternative label: Trasport u Turiżmu @mt
alternative label: Transportes e Turismo @pt
alternative label: Μεταφορές και Τουρισμός @el
alternative label: Transport și turism @ro
alternative label: Vervoer en toerisme @nl
alternative label: Transport and Tourism
alternative label: Transport ja turism @et
alternative label: Doprava a cestovný ruch @sk
alternative label: Transports et tourisme @fr
alternative label: Közlekedés és idegenforgalom @hu
alternative label: Transports un tūrisms @lv
alternative label: Transportes y Turismo @es
alternative label: Liikenne ja matkailu @fi
alternative label: Verkehr und Tourismus @de
alternative label: Transportas ir turizmas @lt
alternative label: Promet in turizem @sl
alternative label: Transport i Turystyka @pl
alternative label: Trasporti e turismo @it
alternative label: Transport og Turisme @da
alternative label: Iompar agus Turasóireacht @ga
alternative label: Doprava a cestovní ruch @cs
alternative label: Transport och turism @sv
alternative label: Promet i turizam @hr
alternative label: Транспорт и туризъм @bg
broader: Standing parliamentary committee
definition: European parliamentary committee on transport and tourism.
in scheme: EP taxonomy on entities.
preferred label: Transporta un tūrisma komiteja @lv
preferred label: Comisión de Transportes y Turismo @es
preferred label: Transporto ir turizmo komitetas @lt
preferred label: Výbor pro dopravu a cestovní ruch @cs
preferred label: Odbor za promet i turizam @hr
preferred label: Odbor za promet in turizem @sl
preferred label: Комисия по транспорт и туризъм @bg
preferred label: Comissão dos Transportes e do Turismo @pt
preferred label: Kumitat għat-Trasport u t-Turiżmu @mt
preferred label: Commissie vervoer en toerisme @nl
preferred label: Transpordi- ja turismikomisjon @et
preferred label: An Coiste um Iompar agus um Thurasóireacht @ga
preferred label: Komisja Transportu i Turystyki @pl
preferred label: Commission des transports et du tourisme @fr
preferred label: Liikenne- ja matkailuvaliokunta @fi
preferred label: Közlekedési és Idegenforgalmi Bizottság @hu
preferred label: Utskottet för transport och turism @sv
preferred label: Transport- og Turismeudvalget @da
preferred label: Επιτροπή Μεταφορών και Τουρισμού @el
preferred label: Commissione per i trasporti e il turismo @it
preferred label: Výbor pre dopravu a cestovný ruch @sk
preferred label: Comisia pentru transport și turism @ro
preferred label: Ausschuss für Verkehr und Tourismus @de

Joint committee procedure - EMPL, IMCO and ITRE
type: CorporateBodyClassification
type: Concept
created: 2026-01-31
deprecated: false
alternative label: Joint EMPL - IMCO - ITRE
alternative label: Commissions conjointes EMPL - IMCO - ITRE @fr
alternative label: EMPL, IMCO und ITRE @de
broader: Joint parliamentary committees
definition: Joint committee procedure - EMPL, IMCO and ITRE.
in scheme: EP taxonomy on entities.
preferred label: Gemeinsames Ausschussverfahren - EMPL, IMCO und ITRE @de
preferred label: Procédure avec commissions conjointes - EMPL, IMCO et ITRE @fr

Delegation to the EU-Armenia, EU-Azerbaijan and EU-Georgia Parliamentary Cooperation Committees
type: Concept
created: 2023-10-31
deprecated: true
alternative label: Armenien, Aserbaidschan und Georgien @de
alternative label: Armenia, Azerbaidjan și Georgia @ro
alternative label: Armenia, Azerbejdżan i Gruzja @pl
alternative label: Armenië, Azerbeidzjan en Georgië @nl
alternative label: Arménie, Azerbaïdjan et Géorgie @fr
alternative label: Armenien, Azerbajdzjan och Georgien @sv
alternative label: Armeenia, Aserbaidžaan ja Gruusia @et
alternative label: Armenien, Aserbajdsjan og Georgien @da
alternative label: Örményország, Azerbajdzsán, Grúzia @hu
alternative label: Armenija, Azerbajdžan in Gruzija @sl
alternative label: Armenia, Azerbaiyán y Georgia @es
alternative label: Arménsko, Azerbajdžan a Gruzínsko @sk
alternative label: Armenja, Ażerbajġan u Ġeorġja @mt
alternative label: Armėnija, Azerbaidžanas ir Gruzija @lt
alternative label: Armenia, Azerbaijan and Georgia
alternative label: Armēnija, Azerbaidžāna un Gruzija @lv
alternative label: Armenia, Azerbaigian e Georgia @it
alternative label: Αρμενία, Αζερμπαϊτζάν και Γεωργία @el
alternative label: Armenia, Azerbaidžan ja Georgia @fi
alternative label: Армения, Азербайджан и Грузия @bg
alternative label: Arménia, Azerbeijão e Geórgia @pt
alternative label: An Airméin, an Asarbaiseáin agus an tSeoirsia @ga
alternative label: Armenija, Azerbajdžan i Gruzija @hr
alternative label: Arménie, Ázerbájdžán a Gruzie @cs
broader: Parliamentary delegation
definition: Delegation to the EU-Armenia, EU-Azerbaijan and EU-Georgia Parliamentary Cooperation Committees.
in scheme: EP taxonomy on entities.
preferred label: Delegatie in de parlementaire samenwerkingscommissies EU-Armenië, EU-Azerbeidzjan en EU-Georgië @nl
preferred label: Delegācija ES un Armēnijas, ES un Azerbaidžānas un ES un Gruzijas Parlamentārās sadarbības komitejās @lv
preferred label: Delegación en las Comisiones Parlamentarias de Cooperación UE-Armenia, UE-Azerbaiyán y UE-Georgia @es
preferred label: Izaslanstvo u odborima za parlamentarnu suradnju između EU-a i Armenije, EU-a i Azerbajdžana te EU-a i Gruzije @hr
preferred label: Delegação às Comissões Parlamentares de Cooperação UE-Arménia, UE-Azerbeijão e UE-Geórgia @pt
preferred label: Delegácia pri Parlamentných výboroch pre spoluprácu EÚ – Arménsko, EÚ – Azerbajdžan a EÚ – Gruzínsko @sk
preferred label: Toscaireacht chun na gCoistí um Chomhar Parlaiminteach den AE agus den Airméin, den AE agus den Asarbaiseáin agus den AE agus den tSeoirsia @ga
preferred label: Delegace ve Výborech pro parlamentní spolupráci EU-Arménie, EU-Ázerbájdžán a EU-Gruzie @cs
preferred label: Делегация в комитетите за парламентарно сътрудничество ЕС-Армения, ЕС-Азербайджан и ЕС-Грузия @bg
preferred label: Delegacja do komisji współpracy parlamentarnej UE-Armenia, UE-Azerbejdżan i UE-Gruzja @pl
preferred label: Delegazzjoni għall-Kumitati Parlamentari ta' Kooperazzjoni UE-Armenja, UE-Azerbajġan u UE-Ġeorġja @mt
preferred label: Délégation aux commissions de coopération parlementaire UE-Arménie, UE-Azerbaïdjan et UE-Géorgie @fr
preferred label: Delegazione alle commissioni di cooperazione parlamentare UE-Armenia, UE-Azerbaigian e UE-Georgia @it
preferred label: Delegacija pri odborih za parlamentarno sodelovanje EU-Armenija, EU-Azerbajdžan in EU-Gruzija @sl
preferred label: Delegatsioon ELi–Armeenia, ELi–Aserbaidžaani ja ELi–Gruusia parlamentaarsetes koostöökomisjonides @et
preferred label: Delegation in den Ausschüssen für parlamentarische Kooperation EU-Armenien, EU-Aserbaidschan und EU-Georgien @de
preferred label: Az EU–Örményország, EU–Azerbajdzsán, EU–Grúzia Parlamenti Együttműködési Bizottságokba delegált küldöttség @hu
preferred label: Αντιπροσωπεία στις Επιτροπές Κοινοβουλευτικής Συνεργασίας ΕΕ-Αρμενίας, ΕΕ-Αζερμπαϊτζάν και ΕΕ-Γεωργίας @el
preferred label: Delegationen til De Parlamentariske Samarbejdsudvalg EU-Armenien, EU-Aserbajdsjan og EU-Georgien @da
preferred label: Delegacija ES ir Armėnijos, ES ir Azerbaidžano, ES ir Gruzijos parlamentinio bendradarbiavimo komitetuose @lt
preferred label: Delegationen till de parlamentariska samarbetskommittéerna EU-Armenien, EU-Azerbajdzjan och EU-Georgien @sv
preferred label: Valtuuskunta EU:n ja Armenian, EU:n ja Azerbaidžanin ja EU:n ja Georgian parlamentaarisissa yhteistyövaliokunnissa @fi
preferred label: Delegația la comisiile parlamentare de cooperare UE-Armenia, UE-Azerbaidjan și UE-Georgia @ro

Temporary committee on climate change
type: Concept
created: 2023-10-31
deprecated: true
alternative label: Klimatske promjene @hr
alternative label: Klimatförändringar @sv
alternative label: Změna klimatu @cs
alternative label: Klimato kaita @lt
alternative label: Ilmastonmuutos @fi
alternative label: Zmiany klimatyczne @pl
alternative label: Athrú Aeráide @ga
alternative label: Climate Change
alternative label: Éghajlatváltozás @hu
alternative label: Il-Bidla fil-Klima @mt
alternative label: Klimata izmaiņas @lv
preferred label: Kliimamuutuste ajutine komisjon @et
alternative label: Schimbările climatice @ro
alternative label: Klimaatverandering @nl
alternative label: Podnebne spremembe @sl
alternative label: Alterações Climáticas @pt
alternative label: Klimaændringer @da
alternative label: Changement climatique @fr
alternative label: Klimawandel @de
alternative label: Cambiamento climatico @it
alternative label: Изменения на климата @bg
alternative label: Cambio Climático @es
alternative label: Klimatické zmeny @sk
alternative label: Αλλαγή του κλίματος @el
broader: Temporary parliamentary committee
definition: European temporary parliamentary committee on climate change.
in scheme: EP taxonomy on entities.
preferred label: Kumitat temporanju dwar il-bidla fil-klima @mt
preferred label: Laikinasis klimato kaitos komitetas @lt
preferred label: Začasni odbor za podnebne spremembe @sl
preferred label: Det Midlertidige Udvalg om Klimaændringer @da
preferred label: Tijdelijke Commissie klimaatverandering @nl
preferred label: Ilmastonmuutosta käsittelevä väliaikainen valiokunta @fi
preferred label: Comisie temporară pentru schimbările climatice @ro
preferred label: Commission temporaire sur le changement climatique @fr
preferred label: Nichtständiger Ausschuss zum Klimawandel @de
preferred label: Komisja tymczasowa do spraw zmian klimatycznych @pl
preferred label: Dočasný výbor pre klimatické zmeny @sk
preferred label: Tillfälligt utskott för klimatförändringar @sv
preferred label: Privremeni odbor za klimatske promjene @hr
preferred label: Az éghajlatváltozással foglalkozó ideiglenes bizottság @hu
preferred label: An Coiste Sealadach um Athrú Aeráide @ga
preferred label: Comisión Temporal sobre el Cambio Climático @es
preferred label: Pagaidu komiteja par klimata izmaiņām @lv
preferred label: Commissione temporanea sul cambiamento climatico @it
preferred label: Comissão temporária sobre as alterações climáticas @pt
preferred label: Προσωρινή επιτροπή για την αλλαγή του κλίματος @el
preferred label: Временна комисия по измененията на климата @bg
preferred label: Dočasný výbor pro změnu klimatu @cs

Delegation for relations with Hungary
type: Concept
created: 2023-10-31
deprecated: true
alternative label: Magyarország @hu
alternative label: Унгария @bg
alternative label: Madarsko @sk
alternative label: Hungary
alternative label: Hungria @pt
alternative label: Ungaria @ro
preferred label: Delegatie voor de betrekkingen met Hongarije @nl
alternative label: An Ungáir @ga
alternative label: Ungheria @it
alternative label: Mađarska @hr
alternative label: Ungarn @da
alternative label: l-Ungerija @mt
alternative label: Hungría @es
alternative label: Madžarska @sl
alternative label: Ungari @et
alternative label: Vengrija @lt
alternative label: Ουγγαρία @el
alternative label: Hongrie @fr
alternative label: Ungern @sv
alternative label: Unkari @fi
alternative label: Ungarija @lv
alternative label: Wegry @pl
alternative label: Maďarsko @cs
broader: Parliamentary delegation
definition: Delegation for relations with Hungary.
in scheme: EP taxonomy on entities.
preferred label: A Magyarországgal való kapcsolatokért felelos küldöttség @hu
preferred label: Delegation für die Beziehungen zu Ungarn @de
preferred label: Delegationen for Forbindelserne med Ungarn @da
preferred label: Delegación para las relaciones con Hungría @es
preferred label: Delegácia pre vztahy s Madarskom @sk
preferred label: Delegace pro vztahy s Maďarskem @cs
preferred label: Delegacija za odnose z Madžarsko @sl
preferred label: Délégation pour les relations avec la Hongrie @fr
preferred label: Delegația pentru relațiile cu Ungaria @ro
preferred label: Делегация за връзки с Унгария @bg
preferred label: Delegationen för förbindelserna med Ungern @sv
preferred label: Delegação para as relações com a Hungria @pt
preferred label: Ühenduse ja Ungari vaheliste suhetega tegelev delegatsioon @et
preferred label: Αντιπροσωπεία για τις σχέσεις με την Ουγγαρία @el
preferred label: Izaslanstvo za odnose s Mađarskom @hr
preferred label: Delegazione per le relazioni con l'Ungheria @it
preferred label: Delegacja ds. stosunków z Wegrami @pl
preferred label: Toscaireacht don chaidreamh leis an Ungáir @ga
preferred label: Delegazzjoni ghar-relazzjonijiet ma’ l-Ungerija @mt
preferred label: Suhteista Unkariin vastaava valtuuskunta @fi
preferred label: Delegacija ryšiams su Vengrija @lt
preferred label: Delegacija attiecibam ar Ungariju @lv

Spanish Congress of Deputies
type: Concept
created: 2023-10-31
deprecated: false
broader: National chamber
definition: Spanish Congress of Deputies.
in scheme: EP taxonomy on entities.
preferred label: Congresso dei deputati spagnolo @it
preferred label: Congresso dos Deputados espanhol @pt
preferred label: španjolski Kongres zastupnika @hr
preferred label: spanyol képviselőház @hu
preferred label: Конгрес на депутатите на Кралство Испания @bg
preferred label: Congreso de los Diputados español @es
preferred label: Kongres Deputowanych Hiszpanii @pl
preferred label: spanisches Abgeordnetenhaus @de
preferred label: Congrès des députés espagnol @fr
preferred label: Spaans Congres van Afgevaardigden @nl
preferred label: španělská Poslanecká sněmovna @cs
preferred label: Spānijas parlamenta Deputātu kongress @lv
preferred label: španski poslanski kongres @sl
preferred label: Comhdháil Teachtaí na Spáinne @ga
preferred label: det spanske Deputeretkammer @da
preferred label: Ispanijos Karalystės Deputatų Rūmai @lt
preferred label: Hispaania Saadikute Kongress @et
preferred label: Den spanska deputeradekammaren @sv
preferred label: Espanjan edustajainhuone @fi
preferred label: Congresul Deputaților din Spania @ro
preferred label: španielsky Poslanecký kongres @sk
preferred label: Ισπανική Βουλή @el
preferred label: Kungress tad-Deputati Spanjol @mt

Spanish Parliament
type: Concept
created: 2023-10-31
deprecated: false
broader: National chamber
definition: Spanish Parliament.
in scheme: EP taxonomy on entities.
preferred label: Kortezy Generalne Hiszpanii @pl
preferred label: Spaans parlement @nl
preferred label: Espanjan parlamentti @fi
preferred label: Det spanska parlamentet @sv
preferred label: Cortes Gerais espanholas @pt
preferred label: Parlamentul Spaniei @ro
preferred label: Cortes Generales españolas @es
preferred label: spanyol parlament @hu
preferred label: Ισπανικό Κοινοβούλιο @el
preferred label: Cúirteanna Ginearálta na Spáinne @ga
preferred label: Parlament Spanjol @mt
preferred label: spanisches Parlament @de
preferred label: det spanske parlament @da
preferred label: španielsky parlament @sk
preferred label: španělský parlament @cs
preferred label: Španjolski parlament @hr
preferred label: španski parlament @sl
preferred label: Ispanijos Karalystės Generaliniai Rūmai @lt
preferred label: Spānijas parlaments @lv
preferred label: Parlamento spagnolo @it
preferred label: Hispaania parlament @et
preferred label: Генерални кортеси на Кралство Испания @bg
preferred label: Parlement espagnol @fr

European Innovation Council and SMEs Executive Agency
type: Concept
created: 2023-10-31
deprecated: false
broader: Executive agency
definition: European Innovation Council and SMEs Executive Agency.
in scheme: EP taxonomy on entities.
preferred label: L-Aġenzija Eżekuttiva Ewropea għall-Kunsill Ewropew tal-Innovazzjoni u għall-SMEs @mt
preferred label: Euroopa Innovatsiooninõukogu ja VKEde Rakendusamet @et
preferred label: Europäische Exekutivagentur für den Innovationsrat und für KMU @de
preferred label: Gníomhaireacht Feidhmiúcháin na Comhairle Nuálaíochta Eorpaí agus na bhFiontar Beag agus Meánmhéide @ga
preferred label: Agence exécutive pour le Conseil européen de l’innovation et les PME @fr
preferred label: Eiropas Inovācijas padomes un MVU izpildaģentūra @lv
preferred label: Forvaltningsorganet for Det Europæiske Innovationsråd og SMV’er @da
preferred label: Agencia Ejecutiva para el Consejo Europeo de Innovación y las Pymes @es
preferred label: Európai Innovációs Tanács és Kkv-ügyi Végrehajtó Ügynökség @hu
preferred label: Agenzia esecutiva del Consiglio europeo per l’innovazione e delle PMI @it
preferred label: Europees Uitvoerend Agentschap Innovatieraad en het mkb @nl
preferred label: Izvršna agencija za Europsko vijeće za inovacije i MSP-ove @hr
preferred label: Izvajalska agencija Evropskega sveta za inovacije ter za mala in srednja podjetja @sl
preferred label: Genomförandeorganet för Europeiska innovationsrådet samt för små och medelstora företag @sv
preferred label: Agencja Wykonawcza Europejskiej Rady ds. Innowacji i ds. MŚP @pl
preferred label: Výkonná agentúra pre Európsku radu pre inováciu a MSP @sk
preferred label: Agenția Executivă pentru Consiliul European pentru Inovare și IMM-uri @ro
preferred label: Εκτελεστικός Οργανισμός για το Ευρωπαϊκό Συμβούλιο Καινοτομίας και τις ΜΜΕ @el
preferred label: Výkonná agentura Evropské rady pro inovace a pro malé a střední podniky @cs
preferred label: Europos inovacijų tarybos ir MVĮ reikalų vykdomoji įstaiga @lt
preferred label: Изпълнителна агенция за Европейския съвет по иновациите и за МСП @bg
preferred label: Euroopan innovaationeuvoston ja pk-yritysasioiden toimeenpanovirasto @fi
preferred label: Agência de Execução do Conselho Europeu de Inovação e das PME @pt

Sheanad Éireann
type: Concept
created: 2023-10-31
deprecated: false
broader: National chamber
definition: Sheanad Éireann.
in scheme: EP taxonomy on entities.
preferred label: Senado irlandés @es
preferred label: Senat Irlandii @pl
preferred label: Senatul Irlandei @ro
preferred label: Senat Irlandiż @mt
preferred label: Senado irlandês @pt
preferred label: Senato irlandese @it
preferred label: Сенат на Ирландия @bg
preferred label: irský Senát @cs
preferred label: irischer Senat @de
preferred label: Sénat irlandais @fr
preferred label: ír szenátus @hu
preferred label: Irlannin senaatti @fi
preferred label: írsky Senát @sk
preferred label: Ierse Senaat @nl
preferred label: Īrijas parlamenta Senāts @lv
preferred label: Iirimaa Senat @et
preferred label: irski Senat @hr
preferred label: Airijos Senatas @lt
preferred label: det irske Senat @da
preferred label: Seanad Éireann @ga
preferred label: Den iIrländska senaten @sv
preferred label: Ιρλανδική Γερουσία @el
preferred label: irski senat @sl

Delegation to the EU-Norway Joint Parliamentary Committee
type: Concept
created: 2023-10-31
deprecated: true
alternative label: EU-Norwegen @de
alternative label: EU-Norway
alternative label: UE-Norvegia @it
alternative label: AE-an Iorua @ga
alternative label: EU-Norge @da
alternative label: EÚ-Nórsko @sk
alternative label: EL-Norra @et
alternative label: ΕΕ-Νορβηγία @el
alternative label: UE - Norvegja @mt
alternative label: EU-Norja @fi
alternative label: EU-Norvégia @hu
alternative label: EU-Norsko @cs
alternative label: EU-Norveška @sl
alternative label: EU-Noorwegen @nl
alternative label: ES-Norvegija @lv
alternative label: EU – Norveška @hr
alternative label: UE-Norwegia @pl
alternative label: UE-Norvège @fr
alternative label: UE-Noruega @pt
alternative label: ЕС-Норвегия @bg
broader: Delegation to Joint Parliamentary Committee
definition: Delegation to the EU-Norway Joint Parliamentary Committee.
in scheme: EP taxonomy on entities.
preferred label: Delegácia pre Spolocný parlamentný výbor EÚ-Nórsko @sk
preferred label: Delegação à Comissão Parlamentar Mista UE-Noruega @pt
preferred label: Delegazione alla Commissione parlamentare mista UE-Norvegia @it
preferred label: Az EU-Norvégia Interparlamentáris Bizottsághoz delegáltak @hu
preferred label: Delegazzjoni lejn il-Kumitat Parlamentari Maghqud KE-Norvegja @mt
preferred label: Delegación en la Comisión parlamentaria mixta UE-Noruega @es
preferred label: Делегация в Съвместния парламентарен комитет ЕС-Норвегия @bg
preferred label: Αντιπροσωπεία στη Μικτή Κοινοβουλευτική Επιτροπή ΕΕ-Νορβηγίας @el
preferred label: Delegationen till det blandade parlamentariska utskottet EU-Norge @sv
preferred label: Delegacija skupnega parlamentarnega odbora EU in Norveške @sl
preferred label: Izaslanstvo u Zajedničkom parlamentarnom odboru EU-a i Norveške @hr
preferred label: Valtuuskunta EU:n ja Norjan välisessä parlamentaarisessa @fi
preferred label: Delegacija ES-Norvegijas kopigai parlamentarajai komisijai @lv
preferred label: Delegation til Det Blandede Parlamentariske Udvalg EU-Norge @da
preferred label: Delegația la Comisia parlamentară mixtă UE-Norvegia @ro
preferred label: Delegacja do Wspólnej Komisji Parlamentarnej UE-Norwegia @pl
preferred label: Delegatsioon EL-Norra parlamentaarses ühiskomitees @et
preferred label: Delegacija i ES-Norvegijos Jungtini parlamentini komiteta @lt
preferred label: Delegation im Gemischten Parlamentarischen Ausschuß EU-Norwegen @de
preferred label: Delegatie in de Gemengde Parlamentaire Commissie EU-Noorwegen @nl
preferred label: Délégation à la Commission parlementaire mixte UE-Norvège @fr
preferred label: Toscaireacht chun an Chomhchoiste Pharlaimintigh den AE-an Iorua @ga
preferred label: Delegace při smíšeném parlamentním výboru EU-Norsko @cs

European Union Agency for Criminal Justice Cooperation
type: Concept
created: 2023-10-31
deprecated: false
broader: Decentralised agency
definition: Eurojust.
in scheme: EP taxonomy on entities.
preferred label: Agenzia dell’Unione europea per la cooperazione giudiziaria penale @it
preferred label: Agence de l’Union européenne pour la coopération judiciaire en matière pénale @fr
preferred label: Euroopa Liidu Kriminaalõigusalase Koostöö Amet @et
preferred label: Agentur der Europäischen Union für justizielle Zusammenarbeit in Strafsachen @de
preferred label: Euroopan unionin rikosoikeudellisen yhteistyön virasto @fi
preferred label: Agência da União Europeia para a Cooperação Judiciária Penal @pt
preferred label: Eiropas Savienības Aģentūra tiesu iestāžu sadarbībai krimināllietās @lv
preferred label: Agentura Evropské unie pro justiční spolupráci v trestních věcech @cs
preferred label: Agencja Unii Europejskiej ds. Współpracy Wymiarów Sprawiedliwości w Sprawach Karnych @pl
preferred label: Den Europæiske Unions Agentur for Strafferetligt Samarbejde @da
preferred label: Агенция на Европейския съюз за сътрудничество в областта на наказателното правосъдие @bg
preferred label: Οργανισμός της Ευρωπαϊκής Ένωσης για τη Συνεργασία στον Τομέα της Ποινικής Δικαιοσύνης @el
preferred label: Europeiska unionens byrå för straffrättsligt samarbete @sv
preferred label: Europos Sąjungos bendradarbiavimo baudžiamosios teisenos srityje agentūra @lt
preferred label: Agentúra Európskej únie pre justičnú spoluprácu v trestných veciach @sk
preferred label: Agentschap van de Europese Unie voor justitiële samenwerking in strafzaken @nl
preferred label: Agencija Europske unije za suradnju u kaznenom pravosuđu @hr
preferred label: Agencija Evropske unije za pravosodno sodelovanje v kazenskih zadevah @sl
preferred label: Agencia de la Unión Europea para la Coperación Judicial Penal @es
preferred label: Agenția Uniunii Europene pentru Cooperare în Materie de Justiție Penală @ro
preferred label: Gníomhaireacht an Aontais Eorpaigh um Chomhar Ceartais Choiriúil @ga
preferred label: Az Európai Unió Büntető Igazságügyi Együttműködési Ügynöksége @hu
preferred label: L-Aġenzija tal-Unjoni Ewropea għall-Kooperazzjoni fil-Ġustizzja Kriminali @mt

Euratom agency
type: Concept
created: 2023-10-31
deprecated: false
broader: EU agency
definition: European EURATOM agency.
in scheme: EP taxonomy on entities.
preferred label: Agência da Euratom @pt
preferred label: Agencia de Euratom @es
preferred label: Euratom aģentūra @lv
preferred label: Euratomi asutus @et
preferred label: Euratom-ügynökség @hu
preferred label: Agencja Euratomu @pl
preferred label: Agenția Euratom @ro
preferred label: Euratoms byrå @sv
preferred label: Agenzia dell’Euratom @it
preferred label: Agence d’Euratom @fr
preferred label: Euratomin virasto @fi
preferred label: Agencija Euratom @sl
preferred label: Euratomo agentūra @lt
preferred label: Агенция към Евратом @bg
preferred label: Euratoms agentur @da
preferred label: Agentúra Euratomu @sk
preferred label: Euratom-agentschap @nl
preferred label: Οργανισμός της Ευρατόμ @el
preferred label: Agentura Euratomu @cs
preferred label: Gníomhaireacht Euratom @ga
preferred label: Agencija Euratoma @hr
preferred label: Aġenzija Euratom @mt
preferred label: Euratom-Agentur @de

Italian Senate
type: Concept
created: 2023-10-31
deprecated: false
broader: National chamber
definition: Italian Senate.
in scheme: EP taxonomy on entities.
preferred label: Seanad na hIodáile @ga
preferred label: Italian senaatti @fi
preferred label: Italiaanse Senaat @nl
preferred label: italský Senát @cs
preferred label: Itālijas parlamenta Senāts @lv
preferred label: Ιταλική Γερουσία @el
preferred label: Senat Taljan @mt
preferred label: Senatul Italiei @ro
preferred label: Senado italiano @es
preferred label: Italijos Respublikos Senatas @lt
preferred label: olasz szenátus @hu
preferred label: italijanski senat @sl
preferred label: italienischer Senat @de
preferred label: Itaalia Senat @et
preferred label: Den italienska senaten @sv
preferred label: det italienske Senat @da
preferred label: Senat Włoch @pl
preferred label: talijanski Senat @hr
preferred label: Сенат на Италианската република @bg
preferred label: Sénat italien @fr
preferred label: taliansky Senát @sk
preferred label: Senato italiano @it

Delegation for relations with Israel
type: Concept
created: 2023-10-31
deprecated: false
alternative label: Израел @bg
alternative label: Iosrael @ga
alternative label: Israel
alternative label: Izraelis @lt
alternative label: Iisrael @et
alternative label: Izraēla @lv
alternative label: Iżrael @mt
alternative label: Ισραήλ @el
alternative label: Israele @it
alternative label: Izrael @sl
alternative label: Israël @nl
broader: Parliamentary delegation
definition: Delegation for relations with Israel.
in scheme: EP taxonomy on entities.
preferred label: Delegacija za odnose z Izraelom @sl
preferred label: Delegación para las Relaciones con Israel @es
preferred label: Az Izraellel fenntartott kapcsolatokért felelős küldöttség @hu
preferred label: Delegația pentru relațiile cu Israel @ro
preferred label: Délégation pour les relations avec Israël @fr
preferred label: Suhteista Israeliin vastaava valtuuskunta @fi
preferred label: Delegazione per le relazioni con Israele @it
preferred label: Delegatsioon Iisraeliga suhtlemiseks @et
preferred label: Delegação para as Relações com Israel @pt
preferred label: Delegācija attiecībām ar Izraēlu @lv
preferred label: Делегация за връзки с Израел @bg
preferred label: Delegationen för förbindelserna med Israel @sv
preferred label: Delegationen for Forbindelserne med Israel @da
preferred label: An Toscaireacht don chaidreamh le hIosrael @ga
preferred label: Delegacja do spraw stosunków z Izraelem @pl
preferred label: Delegácia pre vzťahy s Izraelom @sk
preferred label: Delegacija ryšiams su Izraeliu @lt
preferred label: Delegation für die Beziehungen zu Israel @de
preferred label: Αντιπροσωπεία για τις σχέσεις με το Ισραήλ @el
preferred label: Delegazzjoni għar-relazzjonijiet mal-Iżrael @mt
preferred label: Delegace pro vztahy s Izraelem @cs
preferred label: Delegatie voor de betrekkingen met Israël @nl
preferred label: Izaslanstvo za odnose s Izraelom @hr

Committee on Culture and Education
type: Concept
created: 2023-10-31
deprecated: false
alternative label: Kultura in izobraževanje @sl
alternative label: Cultúr agus Oideachas @ga
alternative label: Cultura y Educación @es
alternative label: Култура и образование @bg
alternative label: Cultura e istruzione @it
alternative label: Culture and Education
alternative label: Kultūra un izglītība @lv
alternative label: Kultur och utbildning @sv
alternative label: Kultura u Edukazzjoni @mt
alternative label: Kultuur ja haridus @et
alternative label: Kultur und Bildung @de
alternative label: Cultura e Educação @pt
alternative label: Kulttuuri ja koulutus @fi
alternative label: Kultur og Uddannelse @da
alternative label: Πολιτισμός και Παιδεία @el
alternative label: Cultuur en onderwijs @nl
alternative label: Kultura i Edukacja @pl
alternative label: Kultūra ir švietimas @lt
alternative label: Kultura a vzdělávání @cs
alternative label: Kultúra a vzdelávanie @sk
alternative label: Cultură și educație @ro
alternative label: Culture et éducation @fr
alternative label: Kultura i obrazovanje @hr
alternative label: Kultúra és oktatás @hu
broader: Standing parliamentary committee
definition: European parliamentary committee on culture and education.
in scheme: EP taxonomy on entities.
preferred label: Výbor pre kultúru a vzdelávanie @sk
preferred label: Comissão da Cultura e da Educação @pt
preferred label: Kultūros ir švietimo komitetas @lt
preferred label: Kumitat għall-Kultura u l-Edukazzjoni @mt
preferred label: Commissie cultuur en onderwijs @nl
preferred label: Ausschuss für Kultur und Bildung @de
preferred label: Commission de la culture et de l'éducation @fr
preferred label: Výbor pro kulturu a vzdělávání @cs
preferred label: Comisión de Cultura y Educación @es
preferred label: Commissione per la cultura e l'istruzione @it
preferred label: Utskottet för kultur och utbildning @sv
preferred label: Kultuuri- ja hariduskomisjon @et
preferred label: Комисия по култура и образование @bg
preferred label: Odbor za kulturu i obrazovanje @hr
preferred label: Kulturális és Oktatási Bizottság @hu
preferred label: Επιτροπή Πολιτισμού και Παιδείας @el
preferred label: An Coiste um Chultúr agus um Oideachas @ga
preferred label: Kultur- og Uddannelsesudvalget @da
preferred label: Komisja Kultury i Edukacji @pl
preferred label: Comisia pentru cultură și educație @ro
preferred label: Kultūras un izglītības komiteja @lv
preferred label: Odbor za kulturo in izobraževanje @sl
preferred label: Kulttuuri- ja koulutusvaliokunta @fi

Joint committee procedure - DEVE and FEMM
type: Concept
created: 2023-10-31
deprecated: false
alternative label: DEVE und FEMM @de
alternative label: Joint DEVE - FEMM
alternative label: Commissions conjointes DEVE - FEMM @fr
broader: Joint parliamentary committees
definition: Joint committee procedure - DEVE and FEMM.
in scheme: EP taxonomy on entities.
preferred label: Procédure avec commissions conjointes - DEVE et FEMM @fr
preferred label: Gemeinsames Ausschussverfahren - DEVE und FEMM @de

Delegation to the EU-Bulgaria Joint Parliamentary Committee
type: Concept
created: 2023-10-31
deprecated: true
alternative label: EL-Bulgaaria @et
alternative label: ES un Bulgārija @lv
alternative label: EU-Bulgaria
alternative label: EU-Bulharsko @cs
alternative label: UE-Bulgaria @ro
alternative label: EU-Bulgarien @da
alternative label: EÚ – Bulharsko @sk
alternative label: UE-Bulgarija @mt
alternative label: UE-Bulgária @pt
alternative label: ES-Bulgarija @lt
alternative label: EU – Bugarska @hr
alternative label: UE-Bułgaria @pl
alternative label: UE-Bulgarie @fr
alternative label: AE-an Bhulgáir @ga
alternative label: EU-Bolgarija @sl
alternative label: ЕС-България @bg
alternative label: ΕΕ-Βουλγαρία @el
alternative label: EU-Bulgarije @nl
alternative label: EU-Bulgária @hu
broader: Delegation to Joint Parliamentary Committee
definition: Delegation to the EU-Bulgaria Joint Parliamentary Committee.
in scheme: EP taxonomy on entities.
preferred label: Delegationen til Det Blandede Parlamentariske Udvalg EU-Bulgarien @da
preferred label: Delegatie in de Gemengde Parlementaire Commissie EU-Bulgarije @nl
preferred label: Délégation à la commission parlementaire mixte UE-Bulgarie @fr
preferred label: Delegazione alla commissione parlamentare mista UE-Bulgaria @it
preferred label: Delegazzjoni għall-Kumitat Parlamentari Konġunt UE-Bulgarija @mt
preferred label: Delegación en la Comisión Parlamentaria Mixta UE-Bulgaria @es
preferred label: Delegația la Comisia parlamentară mixtă UE-Bulgaria @ro
preferred label: Valtuuskunta EU:n ja Bulgarian parlamentaarisessa sekavaliokunnassa @fi
preferred label: Delegacja do wspólnej komisji parlamentarnej UE-Bułgaria @pl
preferred label: Delegacija ES ir Bulgarijos jungtiniame parlamentiniame komitete @lt
preferred label: Delegace ve Smíšeném parlamentním výboru EU-Bulharsko @cs
preferred label: Delegationen till den gemensamma parlamentarikerkommittén EU-Bulgarien @sv
preferred label: Αντιπροσωπεία στη Μικτή Κοινοβουλευτική Επιτροπή ΕΕ-Βουλγαρίας @el
preferred label: Toscaireacht chun an Chomhchoiste Pharlaimintigh den AE agus den Bhulgáir @ga
preferred label: Delegatsioon ELi-Bulgaaria parlamentaarses ühiskomisjonis @et
preferred label: Delegação à Comissão Parlamentar Mista UE-Bulgária @pt
preferred label: Izaslanstvo u Zajedničkom parlamentarnom odboru EU-a i Bugarske @hr
preferred label: Delegation im Gemischten Parlamentarischen Ausschuss EU-Bulgarien @de
preferred label: Delegácia pri Spoločnom parlamentnom výbore EÚ – Bulharsko @sk
preferred label: Az EU-Bulgária Parlamenti Vegyes Bizottságba delegált küldöttség @hu
preferred label: Delegācija ES un Bulgārijas Apvienotajā parlamentārajā komitejā @lv
preferred label: Делегация в Съвместния парламентарен комитет ЕС-България @bg
preferred label: Delegacija pri Skupnem parlamentarnem odboru EU-Bolgarija @sl

Computer Emergency Response Team for the EU institutions, bodies and agencies
type: Concept
created: 2023-10-31
deprecated: false
alternative label: Computer Emergency Response Team
alternative label: Équipe d’intervention en cas d’urgence informatique @fr
broader: EU interinstitutional service
definition: Computer Emergency Response Team for the EU institutions, bodies and agencies.
in scheme: EP taxonomy on entities.
preferred label: L-Iskwadra ta’ Rispons f’Emerġenza relatata mal-Kompjuters għall-istituzzjonijiet, il-korpi u l-aġenziji Ewropej @mt
preferred label: Ομάδα αντιμετώπισης έκτακτων αναγκών στην πληροφορική για τα θεσμικά και λοιπά όργανα και τους οργανισμούς της ΕΕ @el
preferred label: Tím reakcie na núdzové počítačové situácie v európskych inštitúciách, orgánoch a agentúrach @sk
preferred label: Equipo de Respuesta a Emergencias Informáticas de las Instituciones, Órganos y Organismos de la Unión Europea @es
preferred label: Az európai intézmények, szervek és hivatalok számítógépes vészhelyzeteket elhárító csoportja @hu
preferred label: Skupina pro reakci na počítačové hrozby v orgánech, institucích a jiných subjektech EU @cs
preferred label: Squadra di pronto intervento informatico delle istituzioni, degli organi e delle agenzie dell’Unione europea @it
preferred label: Computercrisisresponsteam voor de instellingen, organen en instanties van de Europese Unie @nl
preferred label: ELi institutsioonide ja ametite infoturbeintsidentidega tegelev rühm @et
preferred label: EU:n toimielinten, elinten ja virastojen tietotekniikan kriisiryhmä @fi
preferred label: Équipe d’intervention en cas d’urgence informatique pour les institutions, organes et agences de l’Union européenne @fr
preferred label: Zespół reagowania na incydenty komputerowe w instytucjach, organach i agencjach UE @pl
preferred label: Centrul de răspuns la incidente de securitate cibernetică pentru instituțiile, organele și agențiile UE @ro
preferred label: Екип за незабавно реагиране при компютърни инциденти за институциите, органите и агенциите на ЕС @bg
preferred label: Europos institucijų, įstaigų ir agentūrų Kompiuterinių incidentų tyrimo tarnyba @lt
preferred label: Skupina za odzivanje na računalniške grožnje za evropske institucije, organe in agencije @sl
preferred label: ES iestāžu, struktūru un aģentūru datorapdraudējumu reaģēšanas vienība @lv
preferred label: IT-Beredskabsenheden for EU’s Institutioner, Organer og Agenturer @da
preferred label: Incidenthanteringsorganisationen för EU:s institutioner, organ och byråer @sv
preferred label: An Fhoireann Phráinnfhreagartha Ríomhaire d’Institiúidí, Comhlachtaí agus Gníomhaireachtaí AE @ga
preferred label: Equipa de Resposta a Emergências Informáticas para as instituições, organismos e agências da UE @pt
preferred label: Tim za hitne računalne intervencije za institucije, tijela i agencije Europske unije @hr
preferred label: IT-Notfallteam für die Organe, Einrichtungen und sonstigen Stellen der EU @de

Committee on Regional Development
type: Concept
created: 2023-10-31
deprecated: false
alternative label: Regionaalareng @et
alternative label: Regionális fejlesztés @hu
alternative label: Regional udvikling @da
alternative label: Desarrollo Regional @es
alternative label: Regionální rozvoj @cs
alternative label: Żvilupp Reġjonali @mt
alternative label: Développement régional @fr
alternative label: Rozwój Regionalny @pl
alternative label: Regioninė plėtra @lt
alternative label: Regional Development
alternative label: Desenvolvimento Regional @pt
alternative label: Regionale Entwicklung @de
alternative label: Regionale ontwikkeling @nl
alternative label: Regional utveckling @sv
alternative label: Aluekehitys @fi
alternative label: Регионално развитие @bg
alternative label: Reģionālā attīstība @lv
alternative label: Regionalni razvoj @hr
alternative label: Περιφερειακή Ανάπτυξη @el
alternative label: Dezvoltare regională @ro
alternative label: Regionálny rozvoj @sk
alternative label: Sviluppo regionale @it
alternative label: Forbairt Réigiúnach @ga
broader: Standing parliamentary committee
definition: European parliament committee on regional development.
in scheme: EP taxonomy on entities.
preferred label: An Coiste um Fhorbairt Réigiúnach @ga
preferred label: Odbor za regionalni razvoj @hr
preferred label: Regionaalarengukomisjon @et
preferred label: Výbor pre regionálny rozvoj @sk
preferred label: Comissão do Desenvolvimento Regional @pt
preferred label: Reģionālās attīstības komiteja @lv
preferred label: Aluekehitysvaliokunta @fi
preferred label: Comisión de Desarrollo Regional @es
preferred label: Commissie regionale ontwikkeling @nl
preferred label: Ausschuss für regionale Entwicklung @de
preferred label: Výbor pro regionální rozvoj @cs
preferred label: Komisja Rozwoju Regionalnego @pl
preferred label: Regionaludviklingsudvalget @da
preferred label: Επιτροπή Περιφερειακής Ανάπτυξης @el
preferred label: Commissione per lo sviluppo regionale @it
preferred label: Comisia pentru dezvoltare regională @ro
preferred label: Комисия по регионално развитие @bg
preferred label: Regionális Fejlesztési Bizottság @hu
preferred label: Commission du développement régional @fr
preferred label: Regioninės plėtros komitetas @lt
preferred label: Utskottet för regional utveckling @sv
preferred label: Kumitat għall-Iżvilupp Reġjonali @mt

Temporary committee on foot and mouth disease
type: Concept
created: 2023-10-31
deprecated: true
alternative label: Suu- ja sorkkatautia @fi
alternative label: Fiebre Aftosa @es
alternative label: Mul- och klövsjuka @sv
alternative label: Fièvre aphteuse @fr
alternative label: Αφθώδη πυρετό @el
alternative label: Galar crúibe agus béil @ga
alternative label: Slintavka a kulhavka @cs
alternative label: Mund- og Klovsyge @da
preferred label: Mutes un nagu sērgas apkarošanas pagaidu komiteja @lv
alternative label: Maul- und Klauenseuch @de
alternative label: Afta epizootica @it
alternative label: Suu- ja sõrataudi ajutine komisjon @et
alternative label: Slinavka @hr
alternative label: Marda ta’ l-ilsien u d-dwiefer, @mt
preferred label: Száj- és Körömfájásügyi Ideiglenes Bizottság @hu
alternative label: mond- en klauwzeer @nl
alternative label: Tymczasowa Komisja ds. pryszczycy @pl
alternative label: Шап @bg
alternative label: Febra aftoasă @ro
alternative label: Laikinasis komitetas dėl kovos su snukio ir nagų @lt
preferred label: Začasni odbor za parkljevko in slinavko @sl
alternative label: Febre Aftosa @pt
preferred label: Dočasný výbor pre krívačku a slintačku @sk
alternative label: Foot and mouth disease
broader: Temporary parliamentary committee
definition: European temporary parliamentary committee on foot and mouth disease.
in scheme: EP taxonomy on entities.
preferred label: Coiste sealadach um an ngalar crúibe agus béil @ga
preferred label: Dočasný výbor pro slintavku a kulhavku @cs
preferred label: Tymczasowa Komisja ds. Pryszczycy @pl
preferred label: Comisión Temporal sobre la Fiebre Aftosa @es
preferred label: Det Midlertidige Udvalg om Mund- og Klovsyge @da
preferred label: Kumitat Temporanju dwar il-marda ta’ l-ilsien u d-dwiefer @mt
preferred label: Προσωρινή επιτροπή για τον αφθώδη πυρετό @el
preferred label: Tijdelijke commissie inzake mond- en klauwzeer @nl
preferred label: Comisia temporară privind febra aftoasă @ro
preferred label: Commissione temporanea sull'afta epizootica @it
preferred label: Comissão Temporária para a Febre Aftosa @pt
preferred label: Commission temporaire sur la fièvre aphteuse @fr
preferred label: Временна комисия по шапа @bg
preferred label: Laikinasis komitetas dėl kovos su snukio ir nagų liga @lt
preferred label: Suu- ja sorkkatautia käsittelevä väliaikainen valiokunta @fi
preferred label: Nichtständiger Ausschuss für Maul- und Klauenseuche @de
preferred label: Tillfälligt utskott för mul- och klövsjuka @sv
preferred label: Privremeni odbor za slinavku @hr
preferred label: Ajutine suu- ja sõrataudi komitee @et

Joint committee procedure - INTA and ITRE
type: Concept
created: 2025-01-31
deprecated: false
alternative label: Commissions conjointes INTA - ITRE @fr
alternative label: INTA und ITRE @de
alternative label: Joint INTA - ITRE
broader: Joint parliamentary committees
definition: Joint committee procedure - INTA and ITRE.
in scheme: EP taxonomy on entities.
preferred label: Procédure avec commissions conjointes - INTA et ITRE @fr
preferred label: Gemeinsames Ausschussverfahren - INTA und ITRE @de

Temporary parliamentary committee
type: CorporateBodyClassification
type: Concept
created: 2023-10-31
deprecated: false
broader: Parliamentary committee
definition: European temporary parliamentary committee.
in scheme: EP taxonomy on entities.
preferred label: Nichtständiger parlamentarischer Ausschuss @de
preferred label: Tijdelijke parlementaire commissie @nl
preferred label: Kumitat parlamentari temporanju @mt
preferred label: Pagaidu parlamentārā komiteja @lv
preferred label: Commissione parlamentare temporanea @it
preferred label: Tillfälligt parlamentsutskott @sv
preferred label: Ideiglenes parlamenti bizottság @hu
preferred label: Parlamentin väliaikainen valiokunta @fi
preferred label: Privremeni parlamentarni odbor @hr
preferred label: Comisia parlamentară temporară @ro
preferred label: Začasni parlamentarni odbor @sl
preferred label: Commission parlementaire temporaire @fr
preferred label: Comissão parlamentar temporária @pt
preferred label: Laikinasis Parlamento komitetas @lt
preferred label: Coiste parlaiminteach sealadach @ga
preferred label: Προσωρινή κοινοβουλευτική επιτροπή @el
preferred label: Временна парламентарна комисия @bg
preferred label: Tymczasowa komisja parlamentarna @pl
preferred label: Comisión Parlamentaria Temporal @es
preferred label: Dočasný parlamentní výbor @cs
preferred label: Dočasný parlamentný výbor @sk
preferred label: Ajutine parlamendikomisjon @et

Joint committee procedure - ITRE and CULT
type: Concept
created: 2023-10-31
deprecated: false
alternative label: Commissions conjointes ITRE - CULT @fr
alternative label: ITRE und CULT @de
alternative label: Joint ITRE - CULT
broader: Joint parliamentary committees
definition: Joint committee procedure - ITRE and CULT.
in scheme: EP taxonomy on entities.
preferred label: Procédure avec commissions conjointes - ITRE et CULT @fr
preferred label: Gemeinsames Ausschussverfahren - ITRE und CULT @de

Special Committee on Artificial Intelligence in a Digital Age
type: Concept
created: 2023-10-31
deprecated: true
alternative label: Kunstig Intelligens i en Digital Tidsalder @da
alternative label: An Intleacht Shaorga i Ré Dhigiteach @ga
alternative label: Sztuczna Inteligencja w Epoce Cyfrowej @pl
alternative label: Inteligência Artificial na Era Digital @pt
alternative label: Intelligenza artificiale in un'era digitale @it
alternative label: Künstliche Intelligenz im digitalen Zeitalter @de
alternative label: Mesterséges intelligencia a digitális korban @hu
alternative label: Tekoäly digitaalisella aikakaudella @fi
alternative label: Tehisintellekt digiajastul @et
alternative label: Mākslīgais intelekts digitālajā laikmetā @lv
alternative label: Artificial Intelligence in a Digital Age
alternative label: Inteligența artificială în era digitală @ro
alternative label: Umělá inteligence v digitálním věku @cs
alternative label: Inteligencia Artificial en la Era Digital @es
alternative label: Intelliġenza Artifiċjali f'Era Diġitali @mt
alternative label: Изкуствен интелект в цифровата ера @bg
alternative label: Umetna inteligenca v digitalni dobi @sl
alternative label: Umelá inteligencia v digitálnom veku @sk
alternative label: Artificiële intelligentie in het digitale tijdperk @nl
alternative label: Umjetna inteligencija u digitalnom dobu @hr
alternative label: Artificiell intelligens i den digitala eran @sv
alternative label: Τεχνητή νοημοσύνη στην ψηφιακή εποχή @el
alternative label: L’intelligence artificielle à l’ère du numérique @fr
alternative label: Dirbtinis intelektas skaitmeniniame amžiuje @lt
broader: Special parliamentary committee
definition: With the goal of setting out a long-term EU roadmap on Artificial Intelligence (AI), AIDA will study the impact and challenges of rolling out AI, identify common EU-wide objectives, and propose recommendations on the best ways forward.
in scheme: EP taxonomy on entities.
preferred label: Comissão Especial sobre Inteligência Artificial na Era Digital @pt
preferred label: Tekoälyä digitaalisella aikakaudella käsittelevä erityisvaliokunta @fi
preferred label: Zvláštní výbor pro umělou inteligenci v digitálním věku @cs
preferred label: Posebni odbor za umetno inteligenco v digitalni dobi @sl
preferred label: Kumitat Speċjali għall-Intelliġenza Artifiċjali f'Era Diġitali @mt
preferred label: Särskilda utskottet för artificiell intelligens i den digitala eran @sv
preferred label: Ειδική Επιτροπή για την τεχνητή νοημοσύνη στην ψηφιακή εποχή @el
preferred label: Bijzondere Commissie artificiële intelligentie in het digitale tijdperk @nl
preferred label: Tehisintellekti digiajastul käsitlev erikomisjon @et
preferred label: Comisia specială pentru inteligența artificială în era digitală @ro
preferred label: A digitális korban a mesterséges intelligenciával foglalkozó különbizottság @hu
preferred label: Komisja Specjalna ds. Sztucznej Inteligencji w Epoce Cyfrowej @pl
preferred label: Posebni odbor za umjetnu inteligenciju u digitalnom dobu @hr
preferred label: Commissione speciale sull'intelligenza artificiale in un'era digitale @it
preferred label: Commission spéciale sur l’intelligence artificielle à l’ère du numérique @fr
preferred label: Īpašā komiteja attiecībā uz mākslīgo intelektu digitālajā laikmetā @lv
preferred label: Osobitný výbor pre umelú inteligenciu v digitálnom veku @sk
preferred label: Специална комисия по въпросите на изкуствения интелект в цифровата ера @bg
preferred label: Sonderausschuss zu künstlicher Intelligenz im digitalen Zeitalter @de
preferred label: Det Særlige Udvalg om Kunstig Intelligens i en Digital Tidsalder @da
preferred label: An Coiste Speisialta um an Intleacht Shaorga i Ré Dhigiteach @ga
preferred label: Comisión Especial sobre Inteligencia Artificial en la Era Digital @es
preferred label: Specialusis komitetas dirbtinio intelekto skaitmeniniame amžiuje klausimais @lt

Committee on Petitions
type: Concept
created: 2023-10-31
deprecated: false
alternative label: Achainíocha @ga
alternative label: Petiții @ro
alternative label: Petície @sk
alternative label: Petizzjonijiet @mt
alternative label: Petice @cs
alternative label: Petíciók @hu
alternative label: Peticijos @lt
alternative label: Petizioni @it
alternative label: Verzoekschriften @nl
alternative label: Lūgumraksti @lv
alternative label: Petições @pt
alternative label: Petitionen @de
alternative label: Predstavke @hr
alternative label: Vetoomukset @fi
alternative label: Петиции @bg
alternative label: Pétitions @fr
alternative label: Andragender @da
alternative label: Petitions
alternative label: Peticiones @es
alternative label: Framställningar @sv
alternative label: Peticije @sl
alternative label: Petitsioonid @et
alternative label: Αναφορές @el
alternative label: Petycje @pl
broader: Standing parliamentary committee
definition: European parliamentary committee on petitions.
in scheme: EP taxonomy on entities.
preferred label: Petitionsausschuss @de
preferred label: Komisja Petycji @pl
preferred label: Kumitat għall-Petizzjonijiet @mt
preferred label: Utskottet för framställningar @sv
preferred label: Petitsioonikomisjon @et
preferred label: Commissie verzoekschriften @nl
preferred label: Vetoomusvaliokunta @fi
preferred label: Odbor za peticije @sl
preferred label: Επιτροπή Αναφορών @el
preferred label: Comissão das Petições @pt
preferred label: Comisia pentru petiții @ro
preferred label: Peticijų komitetas @lt
preferred label: An Coiste um Achainíocha @ga
preferred label: Petiční výbor @cs
preferred label: Udvalget for Andragender @da
preferred label: Commissione per le petizioni @it
preferred label: Výbor pre petície @sk
preferred label: Petíciós Bizottság @hu
preferred label: Odbor za predstavke @hr
preferred label: Lūgumrakstu komiteja @lv
preferred label: Comisión de Peticiones @es
preferred label: Комисия по петиции @bg
preferred label: Commission des pétitions @fr

Special committee on the Housing Crisis in the European Union
type: Concept
created: 2025-01-31
deprecated: false
alternative label: An Ghéarchéim Tithíochta san Aontas Eorpach @ga
alternative label: Mājokļu krīze ES @lv
alternative label: Stanovanjska kriza v EU @sl
alternative label: Crisi degli alloggi nell'UE @it
alternative label: Kríza bývania v EÚ @sk
alternative label: Bostadskrisen i EU @sv
alternative label: Kriżi tal-Akkomodazzjoni fl-Unjoni Ewropea @mt
alternative label: Krize v oblasti bydlení v EU @cs
alternative label: Στεγαστική κρίση στην ΕΕ @el
alternative label: Stambena kriza u EU-u @hr
alternative label: Boligkrisen i EU @da
alternative label: Crise de Habitação na UE @pt
alternative label: Kryzys Mieszkaniowy w UE @pl
alternative label: Criza locuințelor în UE @ro
alternative label: Crisis de la Vivienda en la UE @es
alternative label: Crise du logement dans l'Union européenne @fr
alternative label: Asuntokriisi EU:ssa @fi
alternative label: Huisvestingscrisis in de EU @nl
alternative label: Az EU-n belüli lakhatási válság @hu
alternative label: ELi eluasemekriis @et
alternative label: Būsto krizė ES @lt
alternative label: Жилищна криза в ЕС @bg
alternative label: Wohnraumkrise in der EU @de
alternative label: Housing crisis in the EU
broader: Special parliamentary committee
definition: Special committee on the Housing crisis in the European Union.
in scheme: EP taxonomy on entities.
preferred label: Osobitný výbor pre krízu bývania v Európskej únii @sk
preferred label: Comisión Especial sobre la Crisis de la Vivienda en la Unión Europea @es
preferred label: Comissão Especial sobre a Crise de Habitação na União Europeia @pt
preferred label: Asuntokriisiä Euroopan unionissa käsittelevä erityisvaliokunta @fi
preferred label: Az Európai Unióban tapasztalható lakhatási válsággal foglalkozó különbizottság @hu
preferred label: Специална комисия относно жилищната криза в Европейския съюз @bg
preferred label: Comisia specială pentru criza locuințelor în Uniunea Europeană @ro
preferred label: Bijzondere Commissie inzake de huisvestingscrisis in de Europese Unie @nl
preferred label: Euroopa Liidu eluasemekriisi erikomisjon @et
preferred label: Komisja Specjalna ds. Kryzysu Mieszkaniowego w Unii Europejskiej @pl
preferred label: Commission spéciale sur la crise du logement dans l'Union européenne @fr
preferred label: Särskilda utskottet för bostadskrisen i Europeiska unionen @sv
preferred label: Posebni odbor za stanovanjsko krizo v Evropski uniji @sl
preferred label: An Coiste Speisialta um an nGéarchéim Tithíochta san Aontas Eorpach @ga
preferred label: Commissione speciale sulla crisi degli alloggi nell'Unione europea @it
preferred label: Ειδική Επιτροπή για τη στεγαστική κρίση στην Ευρωπαϊκή Ένωση @el
preferred label: Īpašā komiteja mājokļu krīzes risināšanai Eiropas Savienībā @lv
preferred label: Det Særlige Udvalg om Boligkrisen i Den Europæiske Union @da
preferred label: Kumitat Speċjali dwar il-Kriżi tal-Akkomodazzjoni fl-Unjoni Ewropea @mt
preferred label: Zvláštní výbor pro krizi v oblasti bydlení v Evropské unii @cs
preferred label: Posebni odbor za stambenu krizu u Europskoj uniji @hr
preferred label: Sonderausschuss zur Wohnraumkrise in der Europäischen Union @de
preferred label: Specialusis komitetas būsto krizės Europos Sąjungoje klausimais @lt

European Health and Digital Executive Agency
type: Concept
created: 2023-10-31
deprecated: false
broader: Executive agency
definition: European Health and Digital Executive Agency.
in scheme: EP taxonomy on entities.
preferred label: Europos sveikatos ir skaitmeninės ekonomikos vykdomoji įstaiga @lv
preferred label: Evropska izvajalska agencija za zdravje in digitalno tehnologijo @sl
preferred label: Agencia Ejecutiva Europea en los ámbitos de la Salud y Digital @es
preferred label: Euroopan terveys- ja digitaaliasioiden toimeenpanovirasto @fi
preferred label: Evropská výkonná agentura pro zdraví a digitální oblast @cs
preferred label: Ευρωπαϊκός Εκτελεστικός Οργανισμός για την Υγεία και τον Ψηφιακό τομέα @el
preferred label: Agence exécutive européenne pour la santé et le numérique @fr
preferred label: Agenzia esecutiva europea per la salute e il digitale @it
preferred label: Europska izvršna agencija za zdravlje i digitalno gospodarstvo @hr
preferred label: Europeiska genomförandeorganet för hälsofrågor och digitala frågor @sv
preferred label: L-Aġenzija Eżekuttiva Ewropea għas-Saħħa u għall-Qasam Diġitali @mt
preferred label: Europäische Exekutivagentur für Gesundheit und Digitales @de
preferred label: Europees Uitvoerend Agentschap voor gezondheid en digitaal beleid @nl
preferred label: Európska výkonná agentúra pre zdravie a digitalizáciu @sk
preferred label: Euroopa Tervishoiu ja Digitaalvaldkonna Rakendusamet @et
preferred label: Agência de Execução Europeia da Saúde e do Digital @pt
preferred label: Europejska Agencja Wykonawcza ds. Zdrowia i Cyfryzacji @pl
preferred label: Eiropas Veselības un digitālā izpildaģentūra @lt
preferred label: An Ghníomhaireacht Feidhmiúcháin Eorpach um an tSláinte agus an Digitiú @ga
preferred label: Európai Egészségügyi és Digitális Végrehajtó Ügynökség @hu
preferred label: Европейска изпълнителна агенция за здравеопазването и цифровизацията @bg
preferred label: Agenția Executivă Europeană pentru Domeniile Sănătății și Digital @ro
preferred label: Det Europæiske Forvaltningsorgan for Sundhed og Det Digitale Område @da

Joint committee procedure - ECON and IMCO
type: Concept
created: 2023-10-31
deprecated: false
alternative label: Joint ECON - IMCO
alternative label: Commissions conjointes ECON - IMCO @fr
alternative label: ECON und IMCO @de
broader: Joint parliamentary committees
definition: Joint committee procedure - ECON and IMCO.
in scheme: EP taxonomy on entities.
preferred label: Gemeinsames Ausschussverfahren - ECON und IMCO @de
preferred label: Procédure avec commissions conjointes - ECON et IMCO @fr

Delegation for relations with Bulgaria, Romania and Albania
type: Concept
created: 2023-10-31
deprecated: true
alternative label: Bulgaria, Rumunia i Albania @pl
alternative label: An Bhulgáir, an Rómáin agus an Albáin @ga
alternative label: Bulgarija, Romanija u Albanija @mt
alternative label: Bulgaria, Romania and Albania
alternative label: Bulgarija, Rumunija ir Albanija @lt
alternative label: Bulgaria, Romania ja Albania @fi
alternative label: Bulgarien, Rumänien och Albanien @sv
alternative label: Bulgaria, România și Albania @ro
alternative label: Bulgarien, Rumänien und Albanien @de
alternative label: Bulgarien, Rumænien og Albanien @da
alternative label: Bulharsko, Rumunsko a Albánsko @sk
alternative label: Bulgaria, Rumania y Albania @es
alternative label: Bugarska, Rumunjska i Albanija @hr
alternative label: Bulgaaria, Rumeenia ja Albaania @et
alternative label: България, Румъния и Албания @bg
alternative label: Albánie, Bulharsko a Rumunsko @cs
alternative label: Bulgária, Románia és Albánia @hu
alternative label: Bulgarie, Roumanie et Albanie @fr
alternative label: Bulgarija, Rumanija un Albanija @lv
alternative label: Bolgarija, Romunija in Albanija @sl
alternative label: Bulgarije, Roemenië en Albanië @nl
alternative label: Bulgária, Roménia e Albânia @pt
alternative label: Bulgaria, Romania e Albania @it
alternative label: Βουλγαρία, Πουμανία, Αλβανία @el
broader: Parliamentary delegation
definition: Delegation for relations with Bulgaria, Romania and Albania.
in scheme: EP taxonomy on entities.
preferred label: Delegação para as relações com a Bulgária, a Roménia e a Albânia @pt
preferred label: Delegationen för förbindelserna med Bulgarien, Rumänien och Albanien @sv
preferred label: Délégation pour les relations avec la Bulgarie, la Roumanie et l'Albanie @fr
preferred label: Az Bulgáriával, Romániával és Albániával való kapcsolatokért felelos küldöttség @hu
preferred label: Delegationen for Forbindelserne med Bulgarien, Rumænien og Albanien @da
preferred label: Delegace pro vztahy s Albánií, Bulharskem a Rumunskem @cs
preferred label: Izaslanstvo za odnose s Bugarskom, Rumunjskom i Albanijom @hr
preferred label: Delegația pentru relațiile cu Bulgaria, România și Albania @ro
preferred label: Delegacija attiecibam ar Bulgariju, Rumaniju un Albaniju @lv
preferred label: Ühenduse ja Bulgaaria, Rumeenia ning Albaania vaheliste suhetega tegelev delegatsioon @et
preferred label: Delegacja ds. stosunków z Bulgaria, Rumunia i Albania @pl
preferred label: Αντιπροσωπεία για τις σχέσεις με τη Βουλγαρία, τη Ρουμανία και την Αλβανία @el
preferred label: Delegación para la relaciones con Bulgaria, Rumania y Albania @es
preferred label: Suhteista Bulgariaan, Romaniaan ja Albaniaan vastaava valtuuskunta @fi
preferred label: Делегация за връзки с България, Румъния и Албания @bg
preferred label: Delegacija za odnose z Bolgarijo, Romunijo in Albanijo @sl
preferred label: Delegazzjoni ghar-relazzjonijiet mal-Bulgarija, Rumanija u Albanija @mt
preferred label: Delegazione per le relazioni con la Bulgaria, la Romania e l'Albania @it
preferred label: Delegacija ryšiams su Bulgarija, Rumunija ir Albanija @lt
preferred label: Delegation für die Beziehungen zu Bulgarien, Rumänien und Albanien @de
preferred label: Toscaireacht don chaidreamh leis an mBulgáir, leis an Rómáin agus leis an Albáin @ga
preferred label: Delegácia pre vztahy s Bulharskom, Rumunskom a Albánskom @sk
preferred label: Delegatie voor de betrekkingen met Bulgarije, Roemenië en Albanië @nl

Committee on International Trade
type: Concept
created: 2023-10-31
deprecated: false
alternative label: Comércio Internacional @pt
alternative label: Commercio internazionale @it
alternative label: International Trade
alternative label: Kansainvälinen kauppa @fi
alternative label: Международна търговия @bg
alternative label: Trádáil Idirnáisiúnta @ga
alternative label: Internationale handel @nl
alternative label: Mezinárodní obchod @cs
alternative label: Mednarodna trgovina @sl
alternative label: Međunarodna trgovina @hr
alternative label: Starptautiskā tirdzniecība @lv
alternative label: Handel Międzynarodowy @pl
alternative label: Nemzetközi kereskedelem @hu
alternative label: Comercio Internacional @es
alternative label: International Handel @da
alternative label: Kummerċ Internazzjonali @mt
alternative label: Internationell handel @sv
alternative label: Commerce international @fr
alternative label: Tarptautinė prekyba @lt
alternative label: Διεθνές Εμπόριο @el
alternative label: Comerț internațional @ro
alternative label: Rahvusvaheline kaubandus @et
alternative label: Internationaler Handel @de
alternative label: Medzinárodný obchod @sk
broader: Standing parliamentary committee
definition: European parliamentary committee on international trade.
in scheme: EP taxonomy on entities.
preferred label: Ausschuss für internationalen Handel @de
preferred label: Komisja Handlu Międzynarodowego @pl
preferred label: Comissão do Comércio Internacional @pt
preferred label: Výbor pro mezinárodní obchod @cs
preferred label: Nemzetközi Kereskedelmi Bizottság @hu
preferred label: Výbor pre medzinárodný obchod @sk
preferred label: Commissione per il commercio internazionale @it
preferred label: Комисия по международна търговия @bg
preferred label: Commission du commerce international @fr
preferred label: Επιτροπή Διεθνούς Εμπορίου @el
preferred label: Kansainvälisen kaupan valiokunta @fi
preferred label: Comisia pentru comerț internațional @ro
preferred label: Utskottet för internationell handel @sv
preferred label: Odbor za međunarodnu trgovinu @hr
preferred label: An Coiste um Thrádáil Idirnáisiúnta @ga
preferred label: Tarptautinės prekybos komitetas @lt
preferred label: Rahvusvahelise kaubanduse komisjon @et
preferred label: Udvalget om International Handel @da
preferred label: Odbor za mednarodno trgovino @sl
preferred label: Commissie internationale handel @nl
preferred label: Kumitat għall-Kummerċ Internazzjonali @mt
preferred label: Comisión de Comercio Internacional @es
preferred label: Starptautiskās tirdzniecības komiteja @lv

Joint committee procedure - ECON and AFCO
type: Concept
created: 2023-10-31
deprecated: false
alternative label: Commissions conjointes ECON - AFCO @fr
alternative label: ECON und AFCO @de
alternative label: Joint ECON - AFCO
broader: Joint parliamentary committees
definition: Joint committee procedure - ECON and AFCO.
in scheme: EP taxonomy on entities.
preferred label: Gemeinsames Ausschussverfahren - ECON und AFCO @de
preferred label: Procédure avec commissions conjointes - ECON et AFCO @fr

Clean Hydrogen Joint Undertaking
type: Concept
created: 2023-10-31
deprecated: false
broader: EU joint undertaking
definition: Clean Hydrogen Joint Undertaking.
in scheme: EP taxonomy on entities.
preferred label: An Comhghnóthas um Hidrigin Ghlan @ga
preferred label: Съвместно предприятие „Чист водород“ @bg
preferred label: Entreprise commune «Hydrogène propre» @fr
preferred label: Fællesforetagendet for ren brint @da
preferred label: Společný podnik pro čistý vodík @cs
preferred label: Gemeinsames Unternehmen für sauberen Wasserstoff @de
preferred label: Wspólne Przedsięwzięcie na rzecz Czystego Wodoru @pl
preferred label: Zajedničko poduzeće za čisti vodik @hr
preferred label: Skupno podjetje za čisti vodik @sl
preferred label: Gemeenschappelijke Onderneming “Schone waterstof” @nl
preferred label: Κοινή επιχείρηση «Καθαρό υδρογόνο» @el
preferred label: Spoločný podnik pre čistý vodík @sk
preferred label: Det gemensamma företaget för förnybar vätgas @sv
preferred label: Saastevaba vesiniku ühisettevõte @et
preferred label: Impresa comune «Idrogeno pulito» @it
preferred label: Švariojo vandenilio bendroji įmonė @lt
preferred label: Empresa Comum do Hidrogénio Limpo @pt
preferred label: L-Impriża Konġunta Idroġenu Nadif @mt
preferred label: Kopuzņēmums “Tīrs ūdeņradis” @lv
preferred label: Empresa Común para un Hidrógeno Limpio @es
preferred label: Tiszta Hidrogén Közös Vállalkozás @hu
preferred label: Întreprinderea comună pentru un hidrogen curat @ro
preferred label: Puhtaan vedyn yhteisyritys @fi

Delegation for relations with Estonia, Lithuania and Latvia
type: Concept
created: 2023-10-31
deprecated: true
alternative label: Естония, Литва и Латвия @bg
alternative label: Estónsko, Litva a Lotyšsko @sk
alternative label: Estland, Letland og Litauen @da
alternative label: Estonja, Litwanja u Latvja @mt
alternative label: Estonia, Lituania y Letonia @es
alternative label: Delegatie voor de betrekkingen met Estland, Litouw @nl
alternative label: Eesti, Leedu ja Läti @et
alternative label: Igaunija, Lietuva un Latvija @lv
alternative label: Εσθονία, Λιθουανία, Λεττονία @el
alternative label: Estland, Lettland und Litauen @de
alternative label: Estonia, Lituania e Lettonia @it
alternative label: Estonie, Lithuanie et Lettonie @fr
alternative label: Estonija, Latvija in Litva @sl
alternative label: An Eastóin, an Liotuáin agus an Laitvia @ga
alternative label: Estonsko, Lotyšsko a Litva @cs
alternative label: Estónia, Lituânia e Letónia @pt
alternative label: Estija, Lietuva ir Latvija @lt
alternative label: Estonia, Litwa i Lotwa @pl
alternative label: Viro, Liettua ja Latvia @fi
alternative label: Estland, Lettland och Litauen @sv
alternative label: Észtország, Litvánia és Lettország @hu
alternative label: Estonija, Litva i Latvija @hr
alternative label: Estonia, Letonia și Lituania @ro
alternative label: Estonia, Lithuania and Latvia
broader: Parliamentary delegation
definition: Delegation for relations with Estonia, Lithuania and Latvia.
in scheme: EP taxonomy on entities.
preferred label: Toscaireacht don chaidreamh leis an Eastóin, leis an Liotuáin agus leis an Laitvia @ga
preferred label: Delegácia pre vztahy s Estónskom, Litvou a Lotyšskom @sk
preferred label: Delegazione per le relazioni con l'Estonia, la Lituania e la Lettonia @it
preferred label: Delegace pro vztahy s Estonskem, Lotyšskem a Litvou @cs
preferred label: Izaslanstvo za odnose s Estonijom, Litvom i Latvijom @hr
preferred label: Az Észtországgal, Litvániával és Lettországgal való kapcsolatokért felelos küldöttség @hu
preferred label: Délégation pour les relations avec l'Estonie, la Lithuanie et la Lettonie @fr
preferred label: Delegationen för förbindelserna med Estland, Lettland och Litauen @sv
preferred label: Delegația pentru relațiile cu Estonia, Letonia și Lituania @ro
preferred label: Delegatie voor de betrekkingen met Estland, Litouwen en Letland @nl
preferred label: Delegation für die Beziehungen zu Estland, Lettland und Litauen @de
preferred label: Delegacija attiecibam ar Igauniju, Lietuvu un Latviju @lv
preferred label: Delegação para as relações com a Estónia, a Lituânia e a Letónia @pt
preferred label: Delegationen for Forbindelserne med Estland, Letland og Litauen @da
preferred label: Ühenduse ja Eesti, Leedu ning Läti vaheliste suhetega tegelev delegatsioon @et
preferred label: Delegazzjoni ghar-relazzjonijiet ma’ l-Estonja, Litwanja u Latvja @mt
preferred label: Delegación para las Relaciones con Estonia, Lituania y Letonia @es
preferred label: Suhteista Viroon, Liettuaan ja Latviaan vastaava valtuuskunta @fi
preferred label: Delegacija ryšiams su Estija, Lietuva ir Latvija @lt
preferred label: Делегация за връзки с Естония, Литва и Латвия @bg
preferred label: Αντιπροσωπεία για τις σχέσεις με την Εσθονία, τη Λιθουανία και τη Λεττονία @el
preferred label: Delegacja ds. stosunków z Estonia, Litwa i Lotwa @pl
preferred label: Delegacija za odnose z Estonijo, Latvijo in Litvo @sl

Euratom Supply Agency
type: Concept
created: 2023-10-31
deprecated: false
broader: Euratom agency
definition: Euratom Supply Agency.
in scheme: EP taxonomy on entities.
preferred label: Communauté européenne de l’énergie atomique @fr
preferred label: Euroopan atomienergiayhteisö @fi
preferred label: Evropska skupnost za atomsko energijo @sl
preferred label: Comunità europea dell’energia atomica @it
preferred label: Europäische Atomgemeinschaft @de
preferred label: Euroopa Aatomienergiaühendus @et
preferred label: Comunitatea Europeană a Energiei Atomice @ro
preferred label: Comunidade Europeia da Energia Atómica @pt
preferred label: Európske spoločenstvo pre atómovú energiu @sk
preferred label: Europos atominės energijos bendrija @lt
preferred label: Európai Atomenergia-közösség @hu
preferred label: Comunidad Europea de la Energía Atómica @es
preferred label: Evropské společenství pro atomovou energii @cs
preferred label: An Comhphobal Eorpach do Fhuinneamh Adamhach @ga
preferred label: Europska zajednica za atomsku energiju @hr
preferred label: Il-Komunità Ewropea tal-Enerġija Atomika @mt
preferred label: Европейска общност за атомна енергия @bg
preferred label: Ευρωπαϊκή Κοινότητα Ατομικής Ενέργειας @el
preferred label: Europeiska atomenergigemenskapen @sv
preferred label: Det Europæiske Atomenergifællesskab @da
preferred label: Eiropas Atomenerģijas kopiena @lv
preferred label: Europese Gemeenschap voor Atoomenergie @nl
preferred label: Europejska Wspólnota Energii Atomowej @pl

Delegation to the EU-Cyprus Joint Parliamentary Committee
type: Concept
created: 2023-10-31
deprecated: true
alternative label: EU-Ciper @sl
alternative label: ES-Kipras @lt
alternative label: UE-Ciprus @hu
alternative label: EÚ-Cyprus @sk
alternative label: EU-Cypern @da
alternative label: UE-Chipre @es
alternative label: EL-Küpros @et
alternative label: EU-Zypern @de
alternative label: EU-Kypr @cs
alternative label: EU-Cyprus
alternative label: AE-an Chipir @ga
alternative label: UE-Cipru @ro
alternative label: UE-Cypr @pl
alternative label: ΕΕ-Κύπρος @el
alternative label: UE-Chypre @fr
alternative label: UE-Cipro @it
alternative label: EU-Kypros @fi
alternative label: ES-Kipra @lv
alternative label: ЕС-Кипър @bg
alternative label: EU – Cipar @hr
broader: Delegation to Joint Parliamentary Committee
definition: Delegation to the EC-Cyprus Joint Parliamentary Committee.
in scheme: EP taxonomy on entities.
preferred label: Toscaireacht chun an Chomhchoiste Pharlaimintigh den AE-an Chipir @ga
preferred label: Delegazzjoni lejn il-Kumitat Parlamentari Mag]qud UE-Cipru @mt
preferred label: Delegatie in de Gemengde Parlementaire Commissie EU-Cyprus @nl
preferred label: Delegacija ES-Kipro jungtiniame parlamentiniame komitete @lt
preferred label: Delegation im gemischten parlamentarischen Ausschuss EU-Zypern @de
preferred label: Delegazione alla commissione parlamentare mista UE-Cipro @it
preferred label: Delegacja do wspólnej komisji parlamentarnej UE-Cypr @pl
preferred label: Delegationen til Det Blandede Parlamentariske Udvalg EU-Cypern @da
preferred label: Делегация в Съвместния парламентарен комитет ЕС-Кипър @bg
preferred label: Delegácia pri Spoločnom parlamentnom výbore EÚ-Cyprus @sk
preferred label: Délégation à la commission parlementaire mixte UE-Chypre @fr
preferred label: Valtuuskunta EU:n ja Kyproksen välisessä parlamentaarisessa sekavaliokunnassa @fi
preferred label: Αντιπροσωπεία στη Μικτή Κοινοβουλευτική Επιτροπή ΕΕ-Κύπρου @el
preferred label: Delegatsioon parlamendi ELi-Küprose ühiskomisjonis @et
preferred label: Izaslanstvo u Zajedničkom parlamentarnom odboru EU-a i Cipra @hr
preferred label: Az EU-Ciprus Parlamenti Vegyes Bizottságba delegált küldöttség @hu
preferred label: Delegação à Comissão Parlamentar Mista UE-Chipre @pt
preferred label: Delegace při smíšeném parlamentním výboru EU-Kypr @cs
preferred label: Delegația la Comisia parlamentară mixtă UE-Cipru @ro
preferred label: Delegación en la Comisión Parlamentaria Mixta UE-Chipre @es
preferred label: Delegationen till den gemensamma parlamentarikerkommittén EU-Cypern @sv
preferred label: Delegacija pri Skupnem parlamentarnem odboru EU-Ciper @sl
preferred label: ES-Kipras Apvienotās parlamentārās komitejas delegācija @lv

Delegation to the EU-Serbia Stabilisation and Association Parliamentary Committee
type: Concept
created: 2023-10-31
deprecated: false
alternative label: An tSeirbia @ga
alternative label: Szerbia @hu
alternative label: Srbsko @sk
alternative label: Sérvia @pt
alternative label: Σερβία @el
alternative label: Сърбия @bg
alternative label: Serbien @da
alternative label: Serbija @lv
alternative label: Servië @nl
alternative label: Serbja @mt
alternative label: Serbie @fr
alternative label: Serbia
alternative label: Srbija @sl
broader: Delegation to Joint Parliamentary Committee
definition: Delegation to the EU-Serbia Stabilisation and Association Parliamentary Committee.
in scheme: EP taxonomy on entities.
preferred label: Делегация в Парламентарния комитет по стабилизиране и асоцииране ЕС – Сърбия @bg
preferred label: Delegação à Comissão Parlamentar de Estabilização e Associação UE-Sérvia @pt
preferred label: Delegazzjoni għall-Kumitat Parlamentari ta' Stabbilizzazzjoni u Assoċjazzjoni UE-Serbja @mt
preferred label: Αντιπροσωπεία στην Κοινοβουλευτική Επιτροπή Σταθεροποίησης και Σύνδεσης ΕΕ-Σερβίας @el
preferred label: Delegationen till den parlamentariska stabiliserings- och associeringskommittén för EU–Serbien @sv
preferred label: Delegación en la Comisión Parlamentaria de Estabilización y Asociación UE-Serbia @es
preferred label: Delegace v Parlamentním výboru pro stabilizaci a přidružení EU-Srbsko @cs
preferred label: Delegacija pri stabilizacijsko-pridružitvenem parlamentarnem odboru EU-Srbija @sl
preferred label: Delegatie in het Parlementair Stabilisatie- en Associatiecomité EU-Servië @nl
preferred label: ValtuuskuntaEU:n ja Serbian parlamentaarisessa vakautus- ja assosiaatiovaliokunnassa @fi
preferred label: Delegācija ES un Serbijas stabilizācijas un asociācijas parlamentārajā komitejā @lv
preferred label: Delegácia pri Parlamentnom výbore pre stabilizáciu a pridruženie EÚ – Srbsko @sk
preferred label: Delegationen til Det Parlamentariske Stabiliserings- og Associeringsudvalg EU-Serbien @da
preferred label: Az EU–Szerbia Stabilizációs és Társulási Parlamenti Bizottságba delegált küldöttség @hu
preferred label: Delegation im Parlamentarischen Stabilitäts- und Assoziationsausschuss EU-Serbien @de
preferred label: Delegația la Comisia parlamentară de stabilizare și de asociere UE-Serbia @ro
preferred label: Delegatsioon ELi–Serbia parlamentaarses stabiliseerimis- ja assotsieerimiskomitees @et
preferred label: Delegacija ES ir Serbijos stabilizacijos ir asociacijos parlamentiniame komitete @lt
preferred label: Delegazione al comitato parlamentare di stabilizzazione e di associazione UE-Serbia @it
preferred label: Délégation à la commission parlementaire de stabilisation et d'association UE-Serbie @fr
preferred label: Izaslanstvo u Parlamentarnom odboru za stabilizaciju i pridruživanje EU-a i Srbije @hr
preferred label: An Toscaireacht chun an Choiste Pharlaimintigh Cobhsaíochta agus Comhlachais idir AE agus an tSeirbia @ga
preferred label: Delegacja do Parlamentarnego Komitetu Stabilizacji i Stowarzyszenia UE-Serbia @pl

European Council
type: Concept
created: 2023-10-31
deprecated: false
broader: EU institution
definition: European Council.
in scheme: EP taxonomy on entities.
preferred label: Ευρωπαϊκό Συμβούλιο @el
preferred label: Európska rada @sk
preferred label: Rada Europejska @pl
preferred label: An Chomhairle Eorpach @ga
preferred label: Eiropadome @lv
preferred label: Conselho Europeu @pt
preferred label: Evropski svet @sl
preferred label: Consiliul European @ro
preferred label: Europos Vadovų Taryba @lt
preferred label: Kunsill Ewropew @mt
preferred label: Euroopa Ülemkogu @et
preferred label: Consejo Europeo @es
preferred label: Eurooppa-neuvosto @fi
preferred label: Evropská rada @cs
preferred label: Europæiske Råd @da
preferred label: Europäischer Rat @de
preferred label: Europese Raad @nl
preferred label: Europsko vijeće @hr
preferred label: Consiglio europeo @it
preferred label: Európai Tanács @hu
preferred label: Conseil européen @fr
preferred label: Европейски съвет @bg

Committee on Legal Affairs
type: Concept
created: 2023-10-31
deprecated: false
alternative label: Juridiskie jautājumi @lv
alternative label: Jogi ügyek @hu
alternative label: Prawo @pl
alternative label: Assuntos Jurídicos @pt
alternative label: Rättsliga frågor @sv
alternative label: Affaires juridiques @fr
alternative label: Právne veci @sk
alternative label: Afaceri juridice @ro
preferred label: Retsudvalget @da
alternative label: Legal Affairs
alternative label: Asuntos Jurídicos @es
alternative label: Giuridica @it
alternative label: Pravna pitanja @hr
alternative label: Pravne zadeve @sl
alternative label: Õigus @et
alternative label: Teisės reikalai @lt
alternative label: Recht @de
alternative label: Νομικά Θέματα @el
alternative label: Правни въпроси @bg
alternative label: Oikeudelliset asiat @fi
alternative label: Affarijiet Legali @mt
alternative label: Právní záležitosti @cs
alternative label: Juridische zaken @nl
alternative label: Gnóthaí Dlíthiúla @ga
broader: Standing parliamentary committee
definition: European parliamentary committee on legal affairs.
in scheme: EP taxonomy on entities.
preferred label: Utskottet för rättsliga frågor @sv
preferred label: Rechtsausschuss @de
preferred label: Komisja Prawna @pl
preferred label: Commissione giuridica @it
preferred label: Odbor za pravna pitanja @hr
preferred label: Odbor za pravne zadeve @sl
preferred label: Comisia pentru afaceri juridice @ro
preferred label: Kumitat għall-Affarijiet Legali @mt
preferred label: Výbor pre právne veci @sk
preferred label: Commissie juridische zaken @nl
preferred label: Výbor pro právní záležitosti @cs
preferred label: Comisión de Asuntos Jurídicos @es
preferred label: Juridiskā komiteja @lv
preferred label: Commission des affaires juridiques @fr
preferred label: Õiguskomisjon @et
preferred label: An Coiste um Ghnóthaí Dlíthiúla @ga
preferred label: Jogi Bizottság @hu
preferred label: Oikeudellisten asioiden valiokunta @fi
preferred label: Комисия по правни въпроси @bg
preferred label: Teisės reikalų komitetas @lt
preferred label: Comissão dos Assuntos Jurídicos @pt
preferred label: Επιτροπή Νομικών Θεμάτων @el

European Labour Authority
type: Concept
created: 2023-10-31
deprecated: false
broader: Decentralised agency
definition: European Labour Authority.
in scheme: EP taxonomy on entities.
preferred label: Europos darbo institucija @lt
preferred label: Autoridade Europeia do Trabalho @pt
preferred label: Autorité européenne du travail @fr
preferred label: Autoridad Laboral Europea @es
preferred label: Europese Arbeidsautoriteit @nl
preferred label: Autorità europea del lavoro @it
preferred label: Autoritatea Europeană a Muncii @ro
preferred label: Európsky orgán práce @sk
preferred label: Европейски орган по труда @bg
preferred label: Euroopan työviranomainen @fi
preferred label: Den Europæiske Arbejdsmarkedsmyndighed @da
preferred label: Európai Munkaügyi Hatóság @hu
preferred label: L-Awtorità Ewropea tax-Xogħol @mt
preferred label: Evropský orgán pro pracovní záležitosti @cs
preferred label: Evropski organ za delo @sl
preferred label: Eiropas Darba iestāde @lv
preferred label: Euroopa Tööjõuamet @et
preferred label: An tÚdarás Eorpach Saothair @ga
preferred label: Ευρωπαϊκή Αρχή Εργασίας @el
preferred label: Europsko nadzorno tijelo za rad @hr
preferred label: Europejski Urząd ds. Pracy @pl
preferred label: Europäische Arbeitsbehörde @de
preferred label: Europeiska arbetsmyndigheten @sv

Joint committee procedure - ENVI and AGRI
type: Concept
created: 2023-10-31
deprecated: false
alternative label: ENVI und AGRI @de
alternative label: Joint ENVI - AGRI
alternative label: Commissions conjointes ENVI - AGRI @fr
broader: Joint parliamentary committees
definition: Joint committee procedure - ENVI and AGRI.
in scheme: EP taxonomy on entities.
preferred label: Procédure avec commissions conjointes - ENVI et AGRI @fr
preferred label: Gemeinsames Ausschussverfahren - ENVI und AGRI @de

Subcommittee on Monetary Affairs
type: Concept
created: 2023-10-31
deprecated: true
alternative label: Sprawy walutowe @pl
alternative label: Assuntos Monetários @pt
alternative label: Νομισματικά Θέματα @el
alternative label: Affarijiet Monetarji @mt
alternative label: Měnové věci @cs
alternative label: Monetarne zadeve @sl
alternative label: Парични въпроси @bg
alternative label: Währung @de
alternative label: Monetarna politika @hr
alternative label: Subcommissie monetaire zaken @nl
alternative label: Monetaria @it
alternative label: Monétaire @fr
alternative label: Gnóthaí Airgeadaíochta @ga
alternative label: Monetær Politik @da
alternative label: Subcomisia monetară @ro
alternative label: Pénzügyek @hu
alternative label: Raha-asiat @fi
broader: COMMITTEE PARLIAMENTARY ECON
broader: European parliamentary subcommittee
definition: Euroepan parliamentary subcommittee on monetary affairs.
in scheme: EP taxonomy on entities.
preferred label: Subcomissão Assuntos monetários @pt
preferred label: Monetariniu reikalu pakomitetis @lt
preferred label: Pododbor za monetarnu politiku @hr
preferred label: Unterausschuß Währung @de
preferred label: Subcomisa monetară @ro
preferred label: Pododbor za monetarne zadeve @sl
preferred label: Подкомисия по парични въпроси @bg
preferred label: An Fochoiste um Ghnóthaí Airgeadaíochta @ga
preferred label: Sottocommissione monetaria @it
preferred label: Podvýbor pro měnové věci @cs
preferred label: Underudvalget om Monetær Politik @da
preferred label: Subcomisión de Asuntos Monetarios @es
preferred label: Υποεπιτροπή Νομισματικών Θεμάτων @el
preferred label: Podkomisja ds. Walutowych @pl
preferred label: Raha-asiain alivaliokunta @fi
preferred label: Podvýbor pre menové záležitosti @sk
preferred label: Pénzügyi Albizottság @hu
preferred label: Sottokumitat dwar l-Affarijiet Monetarji @mt
preferred label: Underutskottet för monetär politik @sv
preferred label: Sous-commission monétaire @fr

Maltese Parliament
type: Concept
created: 2023-10-31
deprecated: false
broader: National chamber
definition: Maltese Parliament.
in scheme: EP taxonomy on entities.
preferred label: maltesisches Parlament @de
preferred label: Det maltesiska parlamentet @sv
preferred label: maltský parlament @cs
preferred label: Malta Esindajatekoda @et
preferred label: Камара на представителите на Република Малта @bg
preferred label: Parlamento maltese @it
preferred label: Maltas parlaments @lv
preferred label: det maltesiske parlament @da
preferred label: Maltan parlamentti @fi
preferred label: máltai parlament @hu
preferred label: Parlamento maltês @pt
preferred label: Parlamentul Maltei @ro
preferred label: Izba Reprezentantów Malty @pl
preferred label: Parlement maltais @fr
preferred label: Μαλτέζικο Κοινοβούλιο @el
preferred label: Parlaimint Mhálta @ga
preferred label: malteški Zastupnički dom @hr
preferred label: Parlament Malti @mt
preferred label: malteška poslanska zbornica @sl
preferred label: Parlamento maltés @es
preferred label: Maltos Respublikos Atstovų Rūmai @lt
preferred label: Maltees parlement @nl

Fusion for Energy Joint Undertaking
type: Concept
created: 2023-10-31
deprecated: false
broader: Euratom agency
broader: EU joint undertaking
definition: Fusion for Energy Joint Undertaking.
in scheme: EP taxonomy on entities.
preferred label: Impresa comune Fusion for Energy @it
preferred label: Kopuzņēmums “Fusion for Energy” @lv
preferred label: Wspólne Przedsięwzięcie „Fusion for Energy” @pl
preferred label: Zajedničko poduzeće „Fusion for Energy” @hr
preferred label: Съвместно предприятие „Fusion for Energy“ @bg
preferred label: Entreprise commune «Énergie de fusion» @fr
preferred label: Empresa Común para el desarrollo de la energía de fusión @es
preferred label: Fællesforetagendet Fusion for Energy @da
preferred label: Det gemensamma företaget Fusion for Energy @sv
preferred label: Κοινή Επιχείρηση Fusion for Energy @el
preferred label: Společný podnik Fusion for Energy @cs
preferred label: L-Impriża Konġunta “Fusion for Energy” @mt
preferred label: Comhghnóthas “Fusion for Energy” @ga
preferred label: Skupno podjetje „Fuzija za energijo“ @sl
preferred label: Bendroji įmonė „Fusion for Energy“ @lt
preferred label: Gemeenschappelijke Onderneming Fusion for Energy @nl
preferred label: Fusion for Energy -yhteisyritys @fi
preferred label: Gemeinsames Unternehmen Fusion for Energy @de
preferred label: Empresa Comum Fusion for Energy @pt
preferred label: Spoločný podnik Fusion for Energy @sk
preferred label: Fusion for Energy közös vállalkozás @hu
preferred label: Ühisettevõte Fusion for Energy @et
preferred label: Întreprinderea comună Fusion for Energy @ro

European Maritime Safety Agency
type: Concept
created: 2023-10-31
deprecated: false
broader: Decentralised agency
definition: European Maritime Safety Agency.
in scheme: EP taxonomy on entities.
preferred label: Evropská agentura pro námořní bezpečnost @cs
preferred label: Agenția Europeană pentru Siguranța Maritimă @ro
preferred label: Evropska agencija za pomorsko varnost @sl
preferred label: Европейска агенция по морска безопасност @bg
preferred label: Europeiska sjösäkerhetsbyrån @sv
preferred label: Europejska Agencja ds. Bezpieczeństwa na Morzu @pl
preferred label: Agencia Europea de Seguridad Marítima @es
preferred label: Det Europæiske Agentur for Søfartssikkerhed @da
preferred label: L-Aġenzija Ewropea għas-Sigurtà Marittima @mt
preferred label: Európska námorná bezpečnostná agentúra @sk
preferred label: Euroopa Meresõiduohutuse Amet @et
preferred label: Europska agencija za pomorsku sigurnost @hr
preferred label: Europees Agentschap voor maritieme veiligheid @nl
preferred label: Euroopan meriturvallisuusvirasto @fi
preferred label: Europäische Agentur für die Sicherheit des Seeverkehrs @de
preferred label: Agência Europeia da Segurança Marítima @pt
preferred label: Ευρωπαϊκός Οργανισμός για την Ασφάλεια στη Θάλασσα @el
preferred label: Agence européenne pour la sécurité maritime @fr
preferred label: An Ghníomhaireacht Eorpach um Shábháilteacht Mhuirí @ga
preferred label: Europos jūrų saugumo agentūra @lt
preferred label: Agenzia europea per la sicurezza marittima @it
preferred label: Európai Tengerészeti Biztonsági Ügynökség @hu
preferred label: Eiropas Jūras drošības aģentūra @lv

Delegation for relations with the countries of Eastern Europe - Group I
type: Concept
created: 2023-10-31
deprecated: true
alternative label: Östeuropa - grupp 1 @sv
alternative label: Vzhodna Evropa – skupina I @sl
alternative label: Eastern Europe - Group I
alternative label: Východní Evropa – Skupina I @cs
alternative label: Oost-Europa - Groep I @nl
alternative label: Osteuropa - Gruppe I @de
alternative label: Europa dell'Est - Gruppo I @it
alternative label: Istočna Europa – skupina I. @hr
alternative label: Austrumeiropa - I grupa @lv
alternative label: Oirthear na hEorpa - Grúpa I @ga
alternative label: Europe de l'Est - Groupe I @fr
alternative label: Ανατολική Ευρώπη - Ομάδα Ι @el
alternative label: Europa de Leste - Grupo I @pt
alternative label: Europa Oriental - Grupo I @es
alternative label: Europa de Est - Grupa I @ro
alternative label: Ida-Euroopa – I grupp @et
alternative label: Ewropa tal-Lvant - Grupp I @mt
alternative label: Východná Európa - skupina I @sk
alternative label: Itä-Eurooppa - ryhmä I @fi
alternative label: Източна Европа - Група I @bg
alternative label: Europa Wschodnia – Grupa I @pl
alternative label: Østeuropa - Gruppe I @da
alternative label: Kelet-Európa – I. Csoport @hu
alternative label: Rytu Europa – I grupe @lt
broader: Parliamentary delegation
definition: Delegation for relations with the countries of Eastern Europe - Group I.
in scheme: EP taxonomy on entities.
preferred label: Delegacija za odnose z državami vzhodne Evrope – skupina I @sl
preferred label: Delegatie voor de betrekkingen met de Oosteuropese landen - Groep I @nl
preferred label: Delegacja ds. stosunków z panstwami Europy Wschodniej – Grupa I @pl
preferred label: Delegación para las relaciones con los países de Europa Oriental - Grupo I @es
preferred label: Delegacija ryšiams su Rytu Europa – I grupe @lt
preferred label: A kelet-európai I. Csoporttal való kapcsolatokért felelos küldöttség @hu
preferred label: Delegação para as relações com os países da Europa de Leste - Grupo I @pt
preferred label: Delegationen for Forbindelserne med landerne i Østeurope - Gruppe I @da
preferred label: Toscaireacht don chaidreamh le tíortha Oirthear na hEorpa - Grúpa I @ga
preferred label: Delegácia pre vztahy s krajinami Východnej Európy - skupina I @sk
preferred label: Izaslanstvo za odnose sa zemljama Istočne Europe – skupinom I. @hr
preferred label: Delegația pentru relațiile cu țările din Europa de Est - Grupa I @ro
preferred label: Délégation pour les relations avec les pays de l'Europe de l'Est - Groupe I @fr
preferred label: Delegationen för förbindelserna med länderna i Östeuropa - grupp 1 @sv
preferred label: Delegazzjoni ghar-relazzjonijiet mal-pajjizi ta’ l-Ewropa tal-Lvant - Grupp I @mt
preferred label: Delegace pro vztahy se zeměmi východní Evropy – Skupina I @cs
preferred label: Ühenduse ja Ida-Euroopa I grupi riikide vaheliste suhetega tegelev delegatsioon @et
preferred label: Delegazione per le relazioni con i paesi dell'Europa dell'Est - Gruppo I @it
preferred label: Delegacija attiecibam ar Austrumeiropas - I grupas valstim @lv
preferred label: Suhteista Itä-Euroopan maihin - ryhmä I - vastaava valtuuskunta @fi
preferred label: Αντιπροσωπεία για τις σχέσεις με τις χώρες της Ανατολικής Ευρώπης - Ομάδα Ι @el
preferred label: Delegation für die Beziehungen zu den Ländern Osteuropas - Gruppe I @de
preferred label: Делегация за връзки със страните от Източна Европа - Група I @bg

Irish Houses of the Oireachtas
type: Concept
created: 2023-10-31
deprecated: false
broader: National chamber
definition: Irish Houses of the Oireachtas.
in scheme: EP taxonomy on entities.
preferred label: parlament Irlandii @pl
preferred label: Национален парламент на Ирландия @bg
preferred label: irisches Parlament @de
preferred label: Irlannin parlamentti @fi
preferred label: det irske parlament @da
preferred label: Ιρλανδικό Κοινοβούλιο @el
preferred label: irski parlament @sl
preferred label: írsky parlament @sk
preferred label: Iers parlement (Oireachtas) @nl
preferred label: Airijos Irachtas @lt
preferred label: Iirimaa parlament @et
preferred label: Parlamento irlandese @it
preferred label: Det irländska parlamentet @sv
preferred label: ír parlament @hu
preferred label: Tithe an Oireachtais @ga
preferred label: Parlamentul Național al Irlandei @ro
preferred label: Parlement irlandais @fr
preferred label: Īrijas parlaments @lv
preferred label: Câmaras do Parlamento Nacional irlandês @pt
preferred label: Parlament Irlandiż @mt
preferred label: irský parlament @cs
preferred label: Parlamento irlandés @es
preferred label: irski Oireachtas @hr

Delegation for relations with Finland
type: Concept
created: 2023-10-31
deprecated: true
alternative label: Finska @hr
alternative label: Finland
alternative label: Finlanda @ro
alternative label: Suomi @fi
alternative label: Finlandia @it
alternative label: Финландия @bg
alternative label: An Fhionlainn @ga
alternative label: Somija @lv
alternative label: Soome @et
alternative label: Finnland @de
alternative label: Finlandja @mt
alternative label: Finlândia @pt
alternative label: Finsko @cs
alternative label: Finnország @hu
alternative label: Fínsko @sk
alternative label: Finlande @fr
alternative label: Φινλανδία @el
alternative label: Suomija @lt
broader: Parliamentary delegation
definition: Delegation for relations with Finland.
in scheme: EP taxonomy on entities.
preferred label: Delegacija za odnose s Finsko @sl
preferred label: Делегация за връзки с Финландия @bg
preferred label: Délégation pour les relations avec la Finlande @fr
preferred label: Delegazione per le relazioni con la Finlandia @it
preferred label: Delegation für die Beziehungen zu Finnland @de
preferred label: Delegationen för förbindelserna med Finland @sv
preferred label: Delegacija attiecibam ar Somiju @lv
preferred label: Αντιπροσωπεία για τις σχέσεις με τη Φινλανδία @el
preferred label: Delegación para las relaciones con Finlandia @es
preferred label: Delegace pro vztahy s Finskem @cs
preferred label: Delegationen for Forbindelserne med Finland @da
preferred label: Izaslanstvo za odnose s Finskom @hr
preferred label: Delegația pentru relațiile cu Finlanda @ro
preferred label: Delegacija ryšiams su Suomija @lt
preferred label: Suhteista Suomeen vastaava valtuuskunta @fi
preferred label: Ühenduse ja Soome vaheliste suhetega tegelev delegatsioon @et
preferred label: Delegácia pre vztahy s Fínskom @sk
preferred label: Delegazzjoni ghar-relazzjonijiet mal-Finlandja @mt
preferred label: Delegatie voor de betrekkingen met Finland @nl
preferred label: Toscaireacht don chaidreamh leis an bhFionlainn @ga
preferred label: Delegação para as relações com a Finlândia @pt
preferred label: A Finnországgal való kapcsolatokért felelos küldöttség @hu
preferred label: Delegacja ds. stosunków z Finlandia @pl

European Personnel Selection Office
type: Concept
created: 2023-10-31
deprecated: false
broader: EU interinstitutional service
definition: European Personnel Selection Office.
in scheme: EP taxonomy on entities.
preferred label: Европейска служба за подбор на персонал @bg
preferred label: Det Europæiske Personaleudvælgelseskontor @da
preferred label: Eiropas Personāla atlases birojs @lv
preferred label: Office européen de sélection du personnel @fr
preferred label: Europos personalo atrankos tarnyba @lt
preferred label: Europees Bureau voor personeelsselectie @nl
preferred label: Ευρωπαϊκή Υπηρεσία Επιλογής Προσωπικού @el
preferred label: Evropský úřad pro výběr personálu @cs
preferred label: Europski ured za odabir osoblja @hr
preferred label: Serviço Europeu de Seleção do Pessoal @pt
preferred label: Oficiul European pentru Selecţia Personalului @ro
preferred label: Ufficio europeo di selezione del personale @it
preferred label: Európsky úrad pre výber pracovníkov @sk
preferred label: Europejski Urząd Doboru Kadr @pl
preferred label: Oficina Europea de Selección de Personal @es
preferred label: An Oifig Eorpach um Roghnú Foirne @ga
preferred label: Euroopa Personalivaliku Amet @et
preferred label: L-Uffiċċju Ewropew għas-Selezzjoni tal-Persunal @mt
preferred label: Europäisches Amt für Personalauswahl @de
preferred label: Europeiska rekryteringsbyrån @sv
preferred label: Evropski urad za izbor osebja @sl
preferred label: Euroopan unionin henkilöstövalintatoimisto @fi
preferred label: Európai Személyzeti Felvételi Hivatal @hu

Belgian Chamber of Representatives
type: Concept
created: 2023-10-31
deprecated: false
broader: National chamber
definition: Belgian Chamber of Representatives.
in scheme: EP taxonomy on entities.
preferred label: Belgische Kamer van Volksvertegenwoordigers @nl
preferred label: Камара на представителите на Кралство Белгия @bg
preferred label: Teach Ionadaithe na Beilge @ga
preferred label: Cámara de Representantes belga @es
preferred label: Izba Reprezentantów Belgii @pl
preferred label: Den belgiska deputeradekammaren @sv
preferred label: belgische Abgeordnetenkammer @de
preferred label: belgická Dolní komora @cs
preferred label: Camera dei rappresentanti belga @it
preferred label: Câmara dos Representantes belga @pt
preferred label: belgijska poslanska zbornica @sl
preferred label: Beļģijas parlamenta Pārstāvju palāta @lv
preferred label: Belgijos Karalystės Atstovų Rūmai @lt
preferred label: belgijski Zastupnički dom @hr
preferred label: det belgiske Repræsentantkammer @da
preferred label: Kamra tar-Rappreżentanti Belġjana @mt
preferred label: belgická Poslanecká snemovňa @sk
preferred label: Βελγική Βουλή των Αντιπροσώπων @el
preferred label: Camera Reprezentanților din Belgia @ro
preferred label: Chambre des représentants belge @fr
preferred label: Belgia Esindajatekoda @et
preferred label: belga képviselőház @hu
preferred label: Belgian edustajainhuone @fi

Joint committee procedure - AFET and ITRE
type: Concept
created: 2023-10-31
deprecated: false
alternative label: Commissions conjointes AFET - ITRE @fr
alternative label: Joint AFET - ITRE
alternative label: AFET und ITRE @de
broader: Joint parliamentary committees
definition: Joint committee procedure - AFET and ITRE.
in scheme: EP taxonomy on entities.
preferred label: Gemeinsames Ausschussverfahren - AFET und ITRE @de
preferred label: Procédure avec commissions conjointes - AFET et ITRE @fr

Delegation for relations with Iceland
type: Concept
created: 2023-10-31
deprecated: true
alternative label: Iceland
alternative label: Islandia @pl
preferred label: Delegatie voor de betrekkingen met IJsland @nl
alternative label: Islanda @it
alternative label: Izlanda @mt
alternative label: Islanti @fi
alternative label: Islandija @lt
alternative label: An Íoslainn @ga
alternative label: Islande @lv
alternative label: Исландия @bg
alternative label: Ισλανδία @el
alternative label: Izland @hu
alternative label: Islândia @pt
alternative label: Island @hr
broader: Parliamentary delegation
definition: Delegation for relations with Iceland.
in scheme: EP taxonomy on entities.
preferred label: Az Izlanddal való kapcsolatokért felelos küldöttség @hu
preferred label: Delegace pro vztahy s Islandem @cs
preferred label: Αντιπροσωπεία για τις σχέσεις με την Ισλανδία @el
preferred label: Delegation für die Beziehungen zu Island @de
preferred label: Delegacija ryšiams su Islandija @lt
preferred label: Делегация за връзки с Исландия @bg
preferred label: Delegácia pre vztahy s Islandom @sk
preferred label: Délégation pour les relations avec l'Islande @fr
preferred label: Delegacija za odnose z Islandijo @sl
preferred label: Toscaireacht don chaidreamh leis an Íoslainn @ga
preferred label: Delegația pentru relațiile cu Islanda @ro
preferred label: Delegação para as relações com a Islândia @pt
preferred label: Delegationen för förbindelserna med Island @sv
preferred label: Delegazzjoni ghar-relazzjonijiet ma’ l-Izlanda @mt
preferred label: Suhteista Islantiin vastaava valtuuskunta @fi
preferred label: Delegación para las relaciones con Islandia @es
preferred label: Delegacja ds. stosunków z Islandia @pl
preferred label: Delegacija attiecibam ar Islandi @lv
preferred label: Izaslanstvo za odnose s Islandom @hr
preferred label: Ühenduse ja Islandi vaheliste suhetega tegelev delegatsioon @et
preferred label: Delegationen for Forbindelserne med Island @da
preferred label: Delegazione per le relazioni con l'Islanda @it

Joint committee procedure - EMPL and ENVI
type: Concept
created: 2023-10-31
deprecated: false
alternative label: EMPL und ENVI @de
alternative label: Commissions conjointes EMPL - ENVI @fr
alternative label: Joint EMPL - ENVI
broader: Joint parliamentary committees
definition: Joint committee procedure - EMPL and ENVI.
in scheme: EP taxonomy on entities.
preferred label: Gemeinsames Ausschussverfahren – EMPL und ENVI @de
preferred label: Procédure avec commissions conjointes - EMPL et ENVI @fr

Croatian Parliament
type: Concept
created: 2023-10-31
deprecated: false
broader: National chamber
definition: Croatian Parliament.
in scheme: EP taxonomy on entities.
preferred label: chorvátsky parlament @sk
preferred label: Parlamento croata @es
preferred label: Horvaatia parlament @et
preferred label: Kroatijos Respublikos Saboras @lt
preferred label: Kroatian parlamentti @fi
preferred label: det kroatiske parlament @da
preferred label: Det kroatiska parlamentet @sv
preferred label: chorvatský parlament @cs
preferred label: Parlaimint na Cróite @ga
preferred label: Parlament Kroat @mt
preferred label: Parlamentul Croației @ro
preferred label: hrvaški parlament @sl
preferred label: horvát parlament @hu
preferred label: Κροατικό Κοινοβούλιο @el
preferred label: Kroatisch parlement @nl
preferred label: Parlement croate @fr
preferred label: Parlamento croato @it
preferred label: Сабор на Република Хърватия @bg
preferred label: parlament Chorwacji @pl
preferred label: Horvātijas parlaments @lv
preferred label: Hrvatski sabor @hr
preferred label: kroatisches Parlament @de

Netherlands Senate
type: Concept
created: 2023-10-31
deprecated: false
broader: National chamber
definition: Netherlands Senate.
in scheme: EP taxonomy on entities.
preferred label: Seanad na hÍsiltíre @ga
preferred label: Alankomaiden parlamentin ylähuone @fi
preferred label: L-Ewwel Kamra tan-Netherlands @mt
preferred label: Câmara Alta dos Estados Gerais @pt
preferred label: Nīderlandes parlamenta Pirmā palāta @lv
preferred label: holland felsőház @hu
preferred label: det nederlandske Førstekammer @da
preferred label: Първа камара на Кралство Нидерландия @bg
preferred label: Den nederländska första kammaren @sv
preferred label: nizozemski Senat @hr
preferred label: nizozemská První komora @cs
preferred label: Senado neerlandés @es
preferred label: Pierwsza Izba parlamentu Niderlandów @pl
preferred label: holandská Prvá komora @sk
preferred label: Prima camera dei Paesi Bassi @it
preferred label: nizozemski senat @sl
preferred label: niederländische Erste Kammer @de
preferred label: Madalmaade Parlamendi Esimene Koda @et
preferred label: Nyderlandų Karalystės Pirmieji Rūmai @lt
preferred label: Ολλανδική Άνω Βουλή @el
preferred label: Camera Superioară a Parlamentului Țărilor de Jos @ro
preferred label: Première Chambre néerlandaise @fr
preferred label: Nederlandse Eerste Kamer @nl

Delegation to the EU-Mexico Joint Parliamentary Committee
type: Concept
created: 2023-10-31
deprecated: false
alternative label: Messiku @mt
alternative label: Μεξικό @el
alternative label: Mehika @sl
alternative label: Meicsiceo @ga
alternative label: Meksiko @fi
alternative label: Mexic @ro
alternative label: Mexique @fr
alternative label: Mexikó @hu
alternative label: Meksika @lv
alternative label: Mehhiko @et
alternative label: México @pt
alternative label: Mexico
alternative label: Mexiko @cs
alternative label: Messico @it
alternative label: Мексико @bg
alternative label: Meksyk @pl
broader: Delegation to Joint Parliamentary Committee
definition: Delegation to the EU-Lithuania Joint Parliamentary Committee.
in scheme: EP taxonomy on entities.
preferred label: Delegatie in de Gemengde Parlementaire Commissie EU-Mexico @nl
preferred label: Delegācija ES un Meksikas apvienotajā parlamentārajā komitejā @lv
preferred label: Delegationen til Det Blandede Parlamentariske Udvalg EU-Mexico @da
preferred label: Izaslanstvo u Zajedničkom parlamentarnom odboru EU-a i Meksika @hr
preferred label: Delegazzjoni għall-Kumitat Parlamentari Konġunt UE-Messiku @mt
preferred label: Delegacija ES ir Meksikos jungtiniame parlamentiniame komitete @lt
preferred label: Délégation à la commission parlementaire mixte UE-Mexique @fr
preferred label: Delegácia pri Spoločnom parlamentnom výbore EÚ – Mexiko @sk
preferred label: Delegacija pri skupnem parlamentarnem odboru EU-Mehika @sl
preferred label: Delegation im Gemischten Parlamentarischen Ausschuss EU-Mexiko @de
preferred label: Delegación en la Comisión Parlamentaria Mixta UE-México @es
preferred label: Αντιπροσωπεία στη Μικτή Κοινοβουλευτική Επιτροπή ΕΕ-Μεξικού @el
preferred label: Delegatsioon ELi–Mehhiko parlamentaarses ühiskomisjonis @et
preferred label: Делегация в Съвместния парламентарен комитет ЕС – Мексико @bg
preferred label: Delegacja do wspólnej komisji parlamentarnej UE-Meksyk @pl
preferred label: Delegace ve Smíšeném parlamentním výboru EU-Mexiko @cs
preferred label: Delegazione alla commissione parlamentare mista UE-Messico @it
preferred label: Valtuuskunta EU:n ja Meksikon parlamentaarisessa sekavaliokunnassa @fi
preferred label: Delegação à Comissão Parlamentar Mista UE-México @pt
preferred label: Delegația la Comisia parlamentară mixtă UE-Mexic @ro
preferred label: Delegationen till den gemensamma parlamentarikerkommittén EU-Mexiko @sv
preferred label: An Toscaireacht chun an Chomhchoiste Pharlaimintigh idir AE agus Meicsiceo @ga
preferred label: Az EU–Mexikó Parlamenti Vegyes Bizottságba delegált küldöttség @hu

European Union Agency for the Cooperation of Energy Regulators
type: Concept
created: 2023-10-31
deprecated: false
broader: Decentralised agency
definition: Agency for the Cooperation of Energy Regulators.
in scheme: EP taxonomy on entities.
preferred label: Eiropas Savienības Energoregulatoru sadarbības aģentūra @lv
preferred label: Agencija Evropske unije za sodelovanje energetskih regulatorjev @sl
preferred label: Gníomhaireacht an Aontais Eorpaigh um Chomhar idir Rialálaithe Fuinnimh @ga
preferred label: Agenzia dell’Unione europea per la cooperazione fra i regolatori nazionali dell’energia @it
preferred label: Agentúra Európskej únie pre spoluprácu regulačných orgánov v oblasti energetiky @sk
preferred label: Europeiska unionens byrå för samarbete mellan energitillsynsmyndigheter @sv
preferred label: Агенция на Европейския съюз за сътрудничество между регулаторите на енергия @bg
preferred label: Οργανισμός της Ευρωπαϊκής Ένωσης για τη Συνεργασία των Ρυθμιστικών Αρχών Ενέργειας @el
preferred label: Agence de l’Union européenne pour la coopération des régulateurs de l’énergie @fr
preferred label: Agentschap van de Europese Unie voor de samenwerking tussen energieregulators @nl
preferred label: Agencia de la Unión Europea para la Cooperación de los Reguladores de la Energía @es
preferred label: Agentur der Europäischen Union für die Zusammenarbeit der Energieregulierungsbehörden @de
preferred label: Euroopan unionin energia-alan sääntelyviranomaisten yhteistyövirasto @fi
preferred label: Euroopa Liidu Energeetikasektorit Reguleerivate Asutuste Koostööamet @et
preferred label: L-Aġenzija tal-Unjoni Ewropea għall-Kooperazzjoni tar-Regolaturi tal-Enerġija @mt
preferred label: Agencja Unii Europejskiej ds. Współpracy Organów Regulacji Energetyki @pl
preferred label: Agenția Uniunii Europene pentru Cooperarea Autorităților de Reglementare din Domeniul Energiei @ro
preferred label: Energiaszabályozók Európai Uniós Együttműködési Ügynöksége @hu
preferred label: Den Europæiske Unions Agentur for Samarbejde mellem Energireguleringsmyndigheder @da
preferred label: Agencija Europske unije za suradnju energetskih regulatora @hr
preferred label: Europos Sąjungos energetikos reguliavimo institucijų bendradarbiavimo agentūra @lt
preferred label: Agentura Evropské unie pro spolupráci energetických regulačních orgánů @cs
preferred label: Agência da União Europeia de Cooperação dos Reguladores da Energia @pt

Delegation for relations with Bulgaria and Romania
type: Concept
created: 2023-10-31
deprecated: true
alternative label: Bulgaria e Romania @it
alternative label: Bulgarija u Romanija @mt
alternative label: Bulgarien og Rumænien @da
alternative label: Bulgarien och Rumänien @sv
alternative label: Bulgarien und Rumänien @de
alternative label: Bolgarija in Romunija @sl
alternative label: Bulharsko a Rumunsko @sk
alternative label: Bulgarija and Rumanija @lv
alternative label: An Bhulgáir agus an Rómáin @ga
alternative label: България и Румъния @bg
alternative label: Bulgarie et Roumanie @fr
alternative label: Bugarska i Rumunjska @hr
alternative label: Bulgaria i Rumunia @pl
alternative label: Bulgarije en Roemenië @nl
alternative label: Bulgaria și România @ro
alternative label: Bulgaria ja Romania @fi
alternative label: Bulgaaria ja Rumeenia @et
alternative label: Bulgaria y Rumania @es
alternative label: Bulgária e Roménia @pt
alternative label: Βουλγαρία και Ρουμανία @el
alternative label: Bulgarija ir Rumunija @lt
alternative label: Bulgária és Románia @hu
alternative label: Bulgaria and Romania
broader: Parliamentary delegation
definition: Delegation for relations with Bulgaria and Romania.
in scheme: EP taxonomy on entities.
preferred label: Izaslanstvo za odnose s Bugarskom i Rumunjskom @hr
preferred label: Delegatie voor de betrekkingen met Bulgarije en Roemenië @nl
preferred label: Αντιπροσωπεία για τις σχέσεις με τη Βουλγαρία και τη Ρουμανία @el
preferred label: Delegacja ds. stosunków z Bulgaria i Rumunia @pl
preferred label: A Bulgáriával és Romániával való kapcsolatokért felelos küldöttség @hu
preferred label: Delegazzjoni ghar-relazzjonijiet mal-Bulgarija u r-Rumanija @mt
preferred label: Delegazione per le relazioni con la Bulgaria e la Romania @it
preferred label: Délégation pour les relations avec la Bulgarie et la Roumanie @fr
preferred label: Ühenduse ja Bulgaaria ning Rumeenia vaheliste suhetega tegelev delegatsioon @et
preferred label: Delegación para las relaciones con Bulgaria y Rumania @es
preferred label: Delegacija attiecibam ar Bulgariju un Rumaniju @lv
preferred label: Делегация за връзки с България и Румъния @bg
preferred label: Delegação para as relações com a Bulgária e a Roménia @pt
preferred label: Suhteista Bulgariaan ja Romaniaan vastaava valtuuskunta @fi
preferred label: Delegace pro vztahy s Bulharskem a Rumunskem @cs
preferred label: Delegacija za odnose z Bolgarijo in Romunijo @sl
preferred label: Delegation für die Beziehungen zu Bulgarien und Rumänien @de
preferred label: Delegationen för förbindelserna med Bulgarien och Rumänien @sv
preferred label: Delegácia pre vztahy s Bulharskom a Rumunskom @sk
preferred label: Toscaireacht don chaidreamh leis an mBulgáir agus leis an Rómáin @ga
preferred label: Delegacija ryšiams su Bulgarija ir Rumunija @lt
preferred label: Delegationen for Forbindelserne med Bulgarien og Rumænien @da
preferred label: Delegația pentru relațiile cu Bulgaria și România @ro

Quaestors
type: Concept
created: 2025-04-30
deprecated: false
broader: Governing entities
definition: European Parliament Quaestors.
in scheme: EP taxonomy on entities.
preferred label: Questores @pt
preferred label: Kvestorit @fi
preferred label: Kvestorid @et
preferred label: Κοσμήτορες @el
preferred label: Kvæstorer @da
preferred label: Quaestoren @nl
preferred label: Chestori @ro
preferred label: Questeurs @fr
preferred label: Kvestorji @sl
preferred label: Questori @it
preferred label: Kvestorer @sv
preferred label: Kvestori @sk
preferred label: Kwesturi @mt
preferred label: Kvestoři @cs
preferred label: Na Caestóirí @ga
preferred label: Quästoren @de
preferred label: Cuestores @es
preferred label: Quaestorok @hu
preferred label: Квестори @bg
preferred label: Kvestoriai @lt
preferred label: Kwestorzy @pl

Special committee on the policy challenges and budgetary resources for a sustainable European Union after 2013
type: Concept
created: 2023-10-31
deprecated: true
alternative label: Commissione sulle sfide politiche @it
alternative label: Utskottet för politiska utmaningar @sv
alternative label: Επιτροπή για τις πολιτικές προκλήσεις @el
alternative label: Výbor pro politické výzvy @cs
alternative label: Poliitiliste väljakutsete komisjon @et
alternative label: Commissie beleidsuitdagingen @nl
alternative label: Ausschuss zu den politischen Herausforderungen @de
alternative label: Udvalget om Politikudfordringer @da
alternative label: Politikas uzdevumu komiteja @lv
alternative label: Comisión sobre retos políticos @es
alternative label: Politikai kihívások bizottsága @hu
alternative label: Poliittisia haasteita käsittelevä valiokunta @fi
alternative label: Odbor za politične izzive @sl
alternative label: Výbor pre politické výzvy @sk
alternative label: Politinių išbandymų komitetas @lt
alternative label: Kumitat għall-isfidi tal-politika @mt
alternative label: Odbor za političke izazove @hr
alternative label: Komisja ds. wyzwań politycznych @pl
alternative label: Commission sur les défis politiques @fr
alternative label: Comissão sobre os Desafios Políticos @pt
alternative label: Comisia privind provocările politice @ro
alternative label: Policy Challenges Committee
alternative label: An Coiste um na Dúshláin Bheartais @ga
alternative label: Комисия по политическите предизвикателства @bg
broader: Special parliamentary committee
definition: SURE Defines the European Parliament's political priorities for the new post-2013 multiannual financial framework, both in legislative and budgetary terms and to submit guidelines for the resources necessary for the Union to implement these priorities.
in scheme: EP taxonomy on entities.
preferred label: A 2013 utáni fenntartható Európai Unióval kapcsolatos politikai kihívásokkal és költségvetési forrásokkal foglalkozó különbizottság @hu
preferred label: Commission spéciale sur les défis politiques et les ressources budgétaires pour une Union européenne durable après 2013 @fr
preferred label: Kumitat speċjali dwar l-isfidi tal-politika u r-riżorsi baġitarji għal Unjoni Ewropea sostenibbli wara l-2013 @mt
preferred label: Specialusis politinių išbandymų ir biudžeto išteklių siekiant tvarios Europos Sąjungos po 2013 m. komitetas @lt
preferred label: Särskilda utskottet för de politiska utmaningarna och budgetmedlen för en hållbar Europeisk union efter 2013 @sv
preferred label: Comisia specială privind provocările politice și resursele bugetare pentru o Uniune Europeană sustenabilă după 2013 @ro
preferred label: Īpašā komiteja politikas uzdevumiem un budžeta līdzekļiem ilgtspējīgai Eiropas Savienībai pēc 2013. gada @lv
preferred label: An coiste speisialta um na dúshláin bheartais agus um na hacmhainní buiséadacha d'Aontas Eorpach inbhuanaithe i ndiaidh 2013. @ga
preferred label: Zvláštní výbor pro politické výzvy a rozpočtové prostředky pro udržitelnou Evropskou unii po roce 2013 @cs
preferred label: Comissão Especial sobre os Desafios Políticos e os Recursos Orçamentais para uma União Europeia Sustentável Após 2013 @pt
preferred label: Sonderausschuss zu den politischen Herausforderungen und den Haushaltsmitteln für eine nachhaltige Europäische Union nach 2013 @de
preferred label: Comisión especial sobre retos políticos y recursos presupuestarios para una Unión Europea sostenible después de 2013 @es
preferred label: Det Særlige Udvalg om Politikudfordringer og Budgetmidler i en Bæredygtig Europæisk Union efter 2013 @da
preferred label: Poseban odbor za političke izazove i proračunska sredstva za održivu Europsku uniju nakon 2013. @hr
preferred label: Специална комисия по политическите предизвикателства и бюджетните средства за устойчив Европейски съюз след 2013 г. @bg
preferred label: Bijzondere commissie beleidsuitdagingen en begrotingsmiddelen voor een duurzame Europese Unie na 2013 @nl
preferred label: Posebni odbor za politične izzive in proračunska sredstva za trajnostno Evropsko unijo po letu 2013 @sl
preferred label: Specjalna komisja ds. wyzwań politycznych i zasobów budżetowych na rzecz zrównoważonej Unii Europejskiej po 2013 r. @pl
preferred label: Kestävän uroopan unionin poliittisia haasteita ja rahoitusta vuoden 2013 jälkeen käsittelevä erityisvaliokunta @fi
preferred label: Ειδική επιτροπή σχετικά με τις προκλήσεις πολιτικής και τους δημοσιονομικούς πόρους για μία βιώσιμη Ευρωπαϊκή Ένωση μετά το 2013 @el
preferred label: 2013. aasta järgse jätkusuutliku Euroopa Liidu poliitiliste väljakutsete ja eelarvevahendite erikomisjon @et
preferred label: Commissione speciale sulle sfide politiche e le risorse di bilancio per un'Unione europea sostenibile dopo il 2013 @it
preferred label: Osobitný výbor pre politické výzvy a rozpočtové prostriedky trvalo udržateľnej Európskej únie po roku 2013 @sk

European Union Intellectual Property Office
type: Concept
created: 2023-10-31
deprecated: false
broader: Decentralised agency
definition: European Union Intellectual Property Office.
in scheme: EP taxonomy on entities.
preferred label: Ured Europske unije za intelektualno vlasništvo @hr
preferred label: Instituto da Propriedade Intelectual da União Europeia @pt
preferred label: Urząd Unii Europejskiej ds. Własności Intelektualnej @pl
preferred label: Europeiska unionens immaterialrättsmyndighet @sv
preferred label: Γραφείο Διανοητικής Ιδιοκτησίας της Ευρωπαϊκής Ένωσης @el
preferred label: Europos Sąjungos intelektinės nuosavybės tarnyba @lt
preferred label: Ufficio dell’Unione europea per la proprietà intellettuale @it
preferred label: Eiropas Savienības Intelektuālā īpašuma birojs @lv
preferred label: Urad Evropske unije za intelektualno lastnino @sl
preferred label: Bureau voor intellectuele eigendom van de Europese Unie @nl
preferred label: Den Europæiske Unions Kontor for Intellektuel Ejendomsret @da
preferred label: Az Európai Unió Szellemi Tulajdonjogi Hivatala @hu
preferred label: Euroopa Liidu Intellektuaalomandi Amet @et
preferred label: Euroopan unionin teollisoikeuksien virasto @fi
preferred label: Úrad Európskej únie pre duševné vlastníctvo @sk
preferred label: Oficiul Uniunii Europene pentru Proprietate Intelectuală @ro
preferred label: Oifig Maoine Intleachtúla an Aontais Eorpaigh @ga
preferred label: Office de l’Union européenne pour la propriété intellectuelle @fr
preferred label: Oficina de Propiedad Intelectual de la Unión Europea @es
preferred label: Amt der Europäischen Union für geistiges Eigentum @de
preferred label: Служба на Европейския съюз за интелектуална собственост @bg
preferred label: Uffiċċju tal-Proprjetà Intellettwali tal-Unjoni Ewropea @mt
preferred label: Úřad Evropské unie pro duševní vlastnictví @cs

Delegation to the EU-Austria Joint Parliamentary Committee
type: Concept
created: 2023-10-31
deprecated: true
alternative label: EU-Österrike @sv
alternative label: EU-Oostenrijk @nl
alternative label: EU-Ausztria @hu
alternative label: ES-Austrija @lt
alternative label: AE-an Ostair @ga
alternative label: ЕС-Австрия @bg
alternative label: EU-Avstrija @sl
alternative label: EU-Itävalta @fi
alternative label: EU-Østrig @da
alternative label: EÚ-Rakúsko @sk
alternative label: UE-Áustria @pt
alternative label: UE-Austria @pl
alternative label: UE-Awstrija @mt
alternative label: ΕΕ-Αυστρία @el
alternative label: EU-Rakousko @cs
alternative label: EU – Austrija @hr
alternative label: EL-Austria @et
alternative label: EU-Austria
alternative label: UE-Autriche @fr
alternative label: EU-Österreich @de
broader: Delegation to Joint Parliamentary Committee
definition: Delegation to the EU-Austria Joint Parliamentary Committee.
in scheme: EP taxonomy on entities.
preferred label: Delegacija skupnega parlamentarnega odbora EU in Avstrije @sl
preferred label: Delegazzjoni lejn il-Kumitat Parlamentari Maghqud UE-Awstrija @mt
preferred label: Delegace při smíšeném parlamentním výboru EU-Rakousko @cs
preferred label: Delegazione alla Commissione parlamentare mista UE-Austria @it
preferred label: Delegația la Comisia parlamentară mixtă UE-Austria @ro
preferred label: Αντιπροσωπεία στη Μικτή Κοινοβουλευτική Επιτροπή ΕΕ-Αυστρία @el
preferred label: Toscaireacht chun an Chomhchoiste Pharlaimintigh den AE-an Ostair @ga
preferred label: Delegation til Det Blandede Parlamentariske Udvalg EU-Østrig @da
preferred label: Valtuuskunta EU:n ja Itävallan välisessä parlamentaarisessa @fi
preferred label: Delegatie in de Gemengde Parlamentaire Commissie EU-Oostenrijk @nl
preferred label: Delegação à Comissão Parlamentar Mista UE-Áustria @pt
preferred label: Délégation à la Commission parlementaire mixte UE-Autriche @fr
preferred label: Delegation im Gemischten Parlamentarischen Ausschuß EU-Österreich @de
preferred label: Delegationen till det blandade parlamentariska utskottet EU-Österrike @sv
preferred label: Delegacija ES-Austrijas apvienotai parlamentarajai komisijai @lv
preferred label: Delegácia pre Spolocný parlamentný výbor EÚ-Rakúsko @sk
preferred label: Делегация в Съвместния парламентарен комитет ЕС-Австрия @bg
preferred label: Az EU-Ausztria Interparlamentáris Bizottság küldöttsége @hu
preferred label: Delegatsioon EL-Austria parlamentaarses ühiskomitees @et
preferred label: Delegacija i ES-Austrijos Jungtini parlamentini komiteta @lt
preferred label: Izaslanstvo u Zajedničkom parlamentarnom odboru EU-a i Austrije @hr
preferred label: Delegación en la Comisión parlamentaria mixta UE-Austria @es
preferred label: Delegacja do Wspólnej Komisji Parlamentarnej UE-Austria @pl

Special Committee on Terrorism
type: Concept
created: 2023-10-31
deprecated: true
alternative label: Terroriżmu @mt
alternative label: Terorismus @cs
alternative label: Terorizmus @sk
alternative label: Terorism @ro
alternative label: Terorizam @hr
alternative label: Terrorismo @it
alternative label: Sceimhlitheoireacht @ga
alternative label: Terrorismus @de
alternative label: Terorizmo klausimai @lt
alternative label: Terorisms @lv
alternative label: Terrorism
alternative label: Terorizem @sl
alternative label: Тероризъм @bg
alternative label: Terrorismfrågor @sv
alternative label: Terrorisme @fr
alternative label: Terroryzm @pl
alternative label: Terrorismi @fi
alternative label: Τρομοκρατία @el
alternative label: Terrorizmus @hu
broader: Special parliamentary committee
definition: The TERR Special Committee aims to make a significant contribution to improving the efficiency of Europe's capacity to respond to and combat terrorism.
in scheme: EP taxonomy on entities.
preferred label: Zvláštní výbor pro terorismus @cs
preferred label: An Coiste Speisialta um Sceimhlitheoireacht @ga
preferred label: Commission spéciale sur le terrorisme @fr
preferred label: Det Særlige Udvalg om Terrorisme @da
preferred label: Specialusis komitetas terorizmo klausimais @lt
preferred label: Terrorismi käsitlev erikomisjon @et
preferred label: Comisia specială pentru combaterea terorismului @ro
preferred label: Comissão Especial sobre o Terrorismo @pt
preferred label: Terrorismia käsittelevä erityisvaliokunta @fi
preferred label: Sonderausschuss Terrorismus @de
preferred label: Terrorizmussal foglalkozó különbizottság @hu
preferred label: Ειδική επιτροπή για την τρομοκρατία @el
preferred label: Komisja Specjalna ds. Terroryzmu @pl
preferred label: Posebni odbor o terorizmu @sl
preferred label: Särskilda utskottet för terrorismfrågor @sv
preferred label: Cпециална комисия относно тероризма @bg
preferred label: Kumitat Speċjali dwar it-Terroriżmu @mt
preferred label: Osobitný výbor pre terorizmus @sk
preferred label: Bijzondere Commissie terrorisme @nl
preferred label: Commissione speciale sul terrorismo @it
preferred label: Comisión Especial sobre Terrorismo @es
preferred label: Posebni odbor za terorizam @hr
preferred label: Īpašā komiteja terorisma jautājumos @lv

German Bundestag
type: Concept
created: 2023-10-31
deprecated: false
broader: National chamber
definition: German Bundestag.
in scheme: EP taxonomy on entities.
preferred label: Saksamaa Liidupäev @et
preferred label: Vācijas Bundestāgs @lv
preferred label: německý Spolkový sněm @cs
preferred label: német Bundestag @hu
preferred label: Γερμανική Ομοσπονδιακή Βουλή @el
preferred label: Bundestag na Gearmáine @ga
preferred label: Bundestagul Germaniei @ro
preferred label: Bundestag alemán @es
preferred label: nemški zvezni parlament @sl
preferred label: Бундестаг на Федерална република Германия @bg
preferred label: Parlamento Federal alemão @pt
preferred label: Duitse Bondsdag @nl
preferred label: nemecký Spolkový snem @sk
preferred label: njemački Savezni parlament ‒ Bundestag @hr
preferred label: Bundestag @pl
preferred label: Deutscher Bundestag @de
preferred label: Bundestag allemand @fr
preferred label: Den tyska förbundsdagen @sv
preferred label: Vokietijos Federacinės Respublikos Bundestagas @lt
preferred label: Bundestag Ġermaniż @mt
preferred label: Saksan liittopäivät @fi
preferred label: Bundestag tedesco @it
preferred label: den tyske Forbundsdag @da

Committee on Budgetary Control
type: Concept
created: 2023-10-31
deprecated: false
alternative label: Begrotingscontrole @nl
alternative label: Budgetkontroll @sv
alternative label: Kontrola rozpočtu @sk
alternative label: Kontroll tal-Baġit @mt
alternative label: Rozpočtová kontrola @cs
alternative label: Control Presupuestario @es
alternative label: Biudžeto kontrolė @lt
alternative label: Budgetary Control
alternative label: Бюджетен контрол @bg
alternative label: Controlo Orçamental @pt
alternative label: Eelarve kontroll @et
alternative label: Contrôle budgétaire @fr
alternative label: Haushaltskontrolle @de
alternative label: Controllo dei bilanci @it
alternative label: Rialú Buiséadach @ga
alternative label: Talousarvion valvonta @fi
alternative label: Budgetkontrol @da
alternative label: Proračunski nadzor @hr
alternative label: Kontrola Budżetowa @pl
alternative label: Έλεγχος του Προϋπολογισμού @el
alternative label: Budžeta kontrole @lv
alternative label: Control bugetar @ro
alternative label: Költségvetés-ellenőrzés @hu
broader: Standing parliamentary committee
definition: European parliamentary committee on budgetary control.
in scheme: EP taxonomy on entities.
preferred label: Comisia pentru control bugetar @ro
preferred label: Budgetkontroludvalget @da
preferred label: Επιτροπή Ελέγχου του Προϋπολογισμού @el
preferred label: Výbor pre kontrolu rozpočtu @sk
preferred label: Budžeta kontroles komiteja @lv
preferred label: Biudžeto kontrolės komitetas @lt
preferred label: Komisja Kontroli Budżetowej @pl
preferred label: Talousarvion valvontavaliokunta @fi
preferred label: Výbor pro rozpočtovou kontrolu @cs
preferred label: Commission du contrôle budgétaire @fr
preferred label: Kumitat għall-Kontroll tal-Baġit @mt
preferred label: Комисия по бюджетен контрол @bg
preferred label: Commissie begrotingscontrole @nl
preferred label: Odbor za proračunski nadzor @hr
preferred label: Haushaltskontrollausschuss @de
preferred label: Budgetkontrollutskottet @sv
preferred label: Comisión de Control Presupuestario @es
preferred label: Eelarvekontrollikomisjon @et
preferred label: Költségvetési Ellenőrző Bizottság @hu
preferred label: Comissão do Controlo Orçamental @pt
preferred label: Commissione per il controllo dei bilanci @it
preferred label: An Coiste um Rialú Buiséadach @ga

Joint committee procedure - AFET and AFCO
type: Concept
created: 2023-10-31
deprecated: false
alternative label: Joint AFET - AFCO
alternative label: AFET und AFCO @de
alternative label: Commissions conjointes AFET - AFCO @fr
broader: Joint parliamentary committees
definition: Joint committee procedure - AFET and AFCO.
in scheme: EP taxonomy on entities.
preferred label: Procédure avec commissions conjointes - AFET et AFCO @fr
preferred label: Gemeinsames Ausschussverfahren - AFET und AFCO @de

Joint committee procedure - PECH and FEMM
type: Concept
created: 2023-10-31
deprecated: false
alternative label: Commissions conjointes PECH - FEMM @fr
alternative label: PECH und FEMM @de
alternative label: Joint PECH - FEMM
broader: Joint parliamentary committees
definition: Joint committee procedure - PECH and FEMM.
in scheme: EP taxonomy on entities.
preferred label: Gemeinsames Ausschussverfahren - PECH und FEMM @de
preferred label: Procédure avec commissions conjointes - PECH et FEMM @fr

Joint committee procedure - ENVI, ITRE and SEDE
type: Concept
created: 2025-06-30
deprecated: false
alternative label: ENVI, ITRE und SEDE @de
alternative label: Joint ENVI - ITRE - SEDE
alternative label: Commissions conjointes ENVI - ITRE - SEDE @fr
broader: Joint parliamentary committees
definition: Joint committee procedure - ENVI ITRE and SEDE.
in scheme: EP taxonomy on entities.
preferred label: Gemeinsames Ausschussverfahren - ENVI, ITRE und SEDE @de
preferred label: Procédure avec commissions conjointes - ENVI, ITRE et SEDE @fr

Joint committee procedure - AFCO and SEDE
type: CorporateBodyClassification
type: Concept
created: 2025-10-31
deprecated: false
alternative label: Commissions conjointes AFCO - SEDE @fr
alternative label: AFCO und SEDE @de
alternative label: Joint AFCO - SEDE
broader: Joint parliamentary committees
definition: Joint committee procedure - AFCO and SEDE.
in scheme: EP taxonomy on entities.
preferred label: Gemeinsames Ausschussverfahren - AFCO und SEDE @de
preferred label: Procédure avec commissions conjointes - AFCO et SEDE @fr

European parliamentary subcommittee
type: CorporateBodyClassification
type: Concept
created: 2023-10-31
deprecated: false
broader: Parliamentary committee
definition: Parliamentary subcommittee of the European Parliament.
in scheme: EP taxonomy on entities.
preferred label: Sous-commission parlementaire européenne @fr
preferred label: Subcomisia parlamentară europeană @ro
preferred label: Subcomissão parlamentar europeia @pt
preferred label: Podvýbor Európskeho parlamentu @sk
preferred label: Euroopan parlamentin alivaliokunta @fi
preferred label: Subcommissie Europees Parlement @nl
preferred label: Europos Parlamento pakomitetis @lt
preferred label: Подкомисия на Европейския парламент @bg
preferred label: Europaparlamentets underutskott @sv
preferred label: Fochoiste parlaiminteach Eorpach @ga
preferred label: Podvýbor Evropského parlamentu @cs
preferred label: Europa-Parlamentets underudvalg @da
preferred label: Podkomisja Parlamentu Europejskiego @pl
preferred label: Unterausschuss des Europäischen Parlaments @de
preferred label: Euroopa Parlamendi allkomisjon @et
preferred label: Subcomisión parlamentaria europea @es
preferred label: Υποεπιτροπή του Ευρωπαϊκού Κοινοβουλίου @el
preferred label: Sottocommissione parlamentare europea @it
preferred label: Európai parlamenti albizottság @hu
preferred label: Sottokumitat Parlamentari Ewropew @mt
preferred label: Pododbor Evropskega parlamenta @sl
preferred label: Europski parlamentarni pododbor @hr
preferred label: Eiropas Parlamenta apakškomiteja @lv

Portuguese Parliament
type: Concept
created: 2023-10-31
deprecated: false
broader: National chamber
definition: Portuguese Parliament.
in scheme: EP taxonomy on entities.
preferred label: Parlamento português @pt
preferred label: Portugāles parlaments @lv
preferred label: Zgromadzenie Republiki Portugalii @pl
preferred label: Portugalin parlamentti @fi
preferred label: Πορτογαλικό Κοινοβούλιο @el
preferred label: Parlaimint na Portaingéile @ga
preferred label: Det portugisiska parlamentet @sv
preferred label: portugalska Skupština @hr
preferred label: portugalska republiška skupščina @sl
preferred label: portugiesisches Parlament @de
preferred label: Portugees parlement @nl
preferred label: Portugali Vabariigi Kogu @et
preferred label: portugalské Republikové zhromaždenie @sk
preferred label: Parlament Portugiż @mt
preferred label: Събрание на Португалската република @bg
preferred label: Parlamento portoghese @it
preferred label: portugál nemzetgyűlés @hu
preferred label: portugalský parlament @cs
preferred label: Parlamentul Portugaliei @ro
preferred label: det portugisiske parlament @da
preferred label: Asamblea de la República portuguesa @es
preferred label: Parlement portugais @fr
preferred label: Portugalijos Respublikos Asamblėja @lt

Joint committee procedure - IMCO and LIBE
type: Concept
created: 2023-10-31
deprecated: false
alternative label: IMCO und LIBE @de
alternative label: Joint IMCO - LIBE
alternative label: Commissions conjointes IMCO - LIBE @fr
broader: Joint parliamentary committees
definition: Joint committee procedure - IMCO and LIBE.
in scheme: EP taxonomy on entities.
preferred label: Procédure avec commissions conjointes - IMCO et LIBE @fr
preferred label: Gemeinsames Ausschussverfahren - IMCO und LIBE @de

Delegation to the EU-Estonia Joint Parliamentary Committee
type: Concept
created: 2023-10-31
deprecated: true
alternative label: EU-Estonija @sl
alternative label: EU-Észtország @hu
alternative label: ES-Estija @lt
alternative label: UE-Estónia @pt
alternative label: EL-Eesti @et
alternative label: EÚ-Estónsko @sk
alternative label: UE-Estonja @mt
alternative label: ES-Igaunija @lv
alternative label: EU-Viro @fi
alternative label: EU-Estonia
alternative label: ΕE-Εσθονία @el
alternative label: UE-Estonie @fr
alternative label: AE-an Eastóin @ga
alternative label: EU-Estonsko @cs
alternative label: EU-Estland @nl
alternative label: EU – Estonija @hr
alternative label: UE-Estonia @it
alternative label: ЕС-Естония @bg
broader: Delegation to Joint Parliamentary Committee
definition: Delegation to the EU-Estonia Joint Parliamentary Committee.
in scheme: EP taxonomy on entities.
preferred label: Delegationen till den gemensamma parlamentarikerkommittén EU-Estland @sv
preferred label: Delegația la Comisia parlamentară mixtă UE-Estonia @ro
preferred label: Izaslanstvo u Zajedničkom parlamentarnom odboru EU-a i Estonije @hr
preferred label: Delegação à Comissão Parlamentar Mista UE-Estónia @pt
preferred label: Αντιπροσωπεία στη Μικτή Κοινοβουλευτική Επιτροπή ΕΕ-Εσθονίας @el
preferred label: Delegación en la Comisión Parlamentaria Mixta UE-Estonia @es
preferred label: Délégation à la commission parlementaire mixte UE-Estonie @fr
preferred label: ES-Igaunijas Apvienotās parlamentārās komitejas delegācija @lv
preferred label: Delegazione alla commissione parlamentare mista UE-Estonia @it
preferred label: Az EU-Észtország Parlamenti Vegyes Bizottságba delegált küldöttség @hu
preferred label: Valtuuskunta EU:n ja Viron välisessä parlamentaarisessa sekavaliokunnassa @fi
preferred label: Toscaireacht chun an Chomhchoiste Pharlaimintigh den AE-an Eastóin @ga
preferred label: Delegacija pri Skupnem parlamentarnem odboru EU-Estonija @sl
preferred label: Delegacja do wspólnej komisji parlamentarnej UE-Estonia @pl
preferred label: Delegácia pri Spoločnom parlamentnom výbore EÚ-Estónsko @sk
preferred label: Delegacija ES-Estijos jungtiniame parlamentiniame komitete @lt
preferred label: Delegationen til Det Blandede Parlamentariske Udvalg EU-Estland @da
preferred label: Delegace při smíšeném parlamentním výboru EU-Estonsko @cs
preferred label: Delegation im gemischten parlamentarischen Ausschuss EU-Estland @de
preferred label: Delegatie in de Gemengde Parlementaire Commissie EU-Estland @nl
preferred label: Delegatsioon parlamendi ELi-Eesti ühiskomisjonis @et
preferred label: Делегация в Съвместния парламентарен комитет ЕС-Естония @bg
preferred label: Delegazzjoni lejn il-Kumitat Parlamentari Maghqud UE-Estonja @mt

Committee on Constitutional Affairs
type: Concept
created: 2023-10-31
deprecated: false
alternative label: Asuntos Constitucionales @es
alternative label: Põhiseadus @et
alternative label: Afaceri constituționale @ro
alternative label: Perussopimus-, työjärjestys- ja toimielinasiat @fi
alternative label: Constitutional Affairs
alternative label: Konstitutionelle Anliggender @da
alternative label: Конституционни въпроси @bg
alternative label: Gnóthaí Bunreachtúla @ga
alternative label: Konstitutionelle Fragen @de
alternative label: Ústavné veci @sk
alternative label: Affari costituzionali @it
alternative label: Constitutionele zaken @nl
alternative label: Affaires constitutionnelles @fr
alternative label: Ústavní záležitosti @cs
alternative label: Συνταγματικές Υποθέσεις @el
alternative label: Sprawy Konstytucyjne @pl
alternative label: Affarijiet Kostituzzjonali @mt
alternative label: Alkotmányos ügyek @hu
alternative label: Konstitucionālie jautājumi @lv
alternative label: Ustavne zadeve @sl
alternative label: Ustavna pitanja @hr
alternative label: Konstitutionella frågor @sv
alternative label: Konstituciniai reikalai @lt
alternative label: Assuntos Constitucionais @pt
broader: Standing parliamentary committee
definition: European parliamentary committee on constitutional affairs.
in scheme: EP taxonomy on entities.
preferred label: Udvalget om Konstitutionelle Anliggender @da
preferred label: Utskottet för konstitutionella frågor @sv
preferred label: Comisión de Asuntos Constitucionales @es
preferred label: Kumitat għall-Affarijiet Kostituzzjonali @mt
preferred label: Konstitucionālo jautājumu komiteja @lv
preferred label: Perussopimus-, työjärjestys- ja toimielinasioiden valiokunta @fi
preferred label: Odbor za ustavne zadeve @sl
preferred label: Commissie constitutionele zaken @nl
preferred label: Odbor za ustavna pitanja @hr
preferred label: Alkotmányügyi Bizottság @hu
preferred label: An Coiste um Ghnóthaí Bunreachtúla @ga
preferred label: Komisja Spraw Konstytucyjnych @pl
preferred label: Ausschuss für konstitutionelle Fragen @de
preferred label: Commissione per gli affari costituzionali @it
preferred label: Επιτροπή Συνταγματικών Υποθέσεων @el
preferred label: Konstitucinių reikalų komitetas @lt
preferred label: Комисия по конституционни въпроси @bg
preferred label: Výbor pre ústavné veci @sk
preferred label: Põhiseaduskomisjon @et
preferred label: Commission des affaires constitutionnelles @fr
preferred label: Výbor pro ústavní záležitosti @cs
preferred label: Comisia pentru afaceri constituționale @ro
preferred label: Comissão dos Assuntos Constitucionais @pt

Smart Networks and Services Joint Undertaking
type: Concept
created: 2023-10-31
deprecated: false
broader: EU joint undertaking
definition: Smart Networks and Services Joint Undertaking.
in scheme: EP taxonomy on entities.
preferred label: Gemeinsames Unternehmen für intelligente Netze und Dienste @de
preferred label: Intelligens Hálózatok és Szolgáltatások Közös Vállalkozás @hu
preferred label: An Comhghnóthas um Líonraí agus Seirbhísí Cliste @ga
preferred label: Älykkäät verkot ja palvelut -yhteisyritys @fi
preferred label: Întreprinderea comună „Rețele și servicii inteligente” @ro
preferred label: Wspólne Przedsięwzięcie na rzecz Inteligentnych Sieci i Usług @pl
preferred label: Empresa Común para las Redes y los Servicios Inteligentes @es
preferred label: Entreprise commune «Réseaux et services intelligents» @fr
preferred label: Κοινή επιχείρηση «Έξυπνα δίκτυα και υπηρεσίες» @el
preferred label: Pažangiųjų tinklų ir paslaugų bendroji įmonė @lt
preferred label: Zajedničko poduzeće za pametne mreže i usluge @hr
preferred label: Spoločný podnik pre inteligentné siete a služby @sk
preferred label: Skupno podjetje za pametna omrežja in storitve @sl
preferred label: Det gemensamma företaget för smarta nät och tjänster @sv
preferred label: Nutivõrkude ja -teenuste ühisettevõte @et
preferred label: Empresa Comum de Redes e Serviços Inteligentes @pt
preferred label: Společný podnik pro inteligentní sítě a služby @cs
preferred label: L-Impriża Konġunta Networks u Servizzi Intelliġenti @mt
preferred label: Fællesforetagendet for intelligente net og tjenester @da
preferred label: Gemeenschappelijke Onderneming “Slimme netwerken en diensten” @nl
preferred label: Съвместно предприятие „Интелигентни мрежи и услуги“ @bg
preferred label: Impresa comune «Reti e servizi intelligenti» @it
preferred label: Kopuzņēmums “Viedie tīkli un pakalpojumi” @lv

Joint committee procedure - AFET and DEVE
type: Concept
created: 2023-10-31
deprecated: false
alternative label: Commissions conjointes AFET - DEVE @fr
alternative label: AFET und DEVE @de
alternative label: Joint AFET - DEVE
broader: Joint parliamentary committees
definition: Joint committee procedure - AFET and DEVE.
in scheme: EP taxonomy on entities.
preferred label: Gemeinsames Ausschussverfahren - AFET und DEVE @de
preferred label: Procédure avec commissions conjointes - AFET et DEVE @fr

Special Committee on Beating Cancer
type: Concept
created: 2023-10-31
deprecated: true
alternative label: Lotta contro il cancro @it
alternative label: Lutte contre le cancer @fr
alternative label: Krebsbekämpfung @de
alternative label: Ġlieda kontra l-Kanċer @mt
alternative label: Borba protiv raka @hr
alternative label: Kankerbestrijding @nl
alternative label: Rák elleni küzdelem @hu
alternative label: Boj proti rakovině @cs
alternative label: Boj proti rakovine @sk
alternative label: Lucha contra el Cáncer @es
alternative label: Kova su vėžiu @lt
alternative label: Sárú na hAilse @ga
alternative label: Beating Cancer
alternative label: Vähktõvevastane võitlus @et
alternative label: Lupta împotriva cancerului @ro
alternative label: Luta contra o Cancro @pt
alternative label: Beating Cancer parliamentary committee
alternative label: Boj proti raku @sl
alternative label: Walka z Rakiem @pl
alternative label: Борба с рака @bg
alternative label: Vēža uzveikšana @lv
alternative label: Cancerbekämpning @sv
alternative label: Καταπολέμηση του καρκίνου @el
alternative label: Syöväntorjunta @fi
alternative label: Kræftbekæmpelse @da
broader: Special parliamentary committee
definition: BECA aims to establish a set of concrete recommendations for the member states and the EU institutions in order to strengthen our resilience against cancer.
in scheme: EP taxonomy on entities.
preferred label: Syöväntorjuntaa käsittelevä erityisvaliokunta @fi
preferred label: Bijzondere Commissie kankerbestrijding @nl
preferred label: Īpašā komiteja attiecībā uz vēža uzveikšanu @lv
preferred label: Ειδική επιτροπή για την καταπολέμηση του καρκίνου @el
preferred label: Zvláštní výbor pro boj proti rakovině @cs
preferred label: Commission spéciale sur la lutte contre le cancer @fr
preferred label: Det Særlige Udvalg om Kræftbekæmpelse @da
preferred label: Comissão Especial sobre a Luta contra o Cancro @pt
preferred label: Специална комисия за борба с рака @bg
preferred label: A rák elleni küzdelemmel foglalkozó különbizottság @hu
preferred label: Comisia specială pentru lupta împotriva cancerului @ro
preferred label: Specialusis kovos su vėžiu komitetas @lt
preferred label: Osobitný výbor pre boj proti rakovine @sk
preferred label: Särskilda utskottet för cancerbekämpning @sv
preferred label: Commissione speciale sulla lotta contro il cancro @it
preferred label: Vähktõvevastase võitluse erikomisjon @et
preferred label: Posebni odbor za boj proti raku @sl
preferred label: Kumitat Speċjali għall-Ġlieda kontra l-Kanċer @mt
preferred label: An Coiste Speisialta um Shárú na hAilse @ga
preferred label: Komisja Specjalna ds. Walki z Rakiem @pl
preferred label: Sonderausschuss zu Krebsbekämpfung @de
preferred label: Posebni odbor za borbu protiv raka @hr
preferred label: Comisión Especial sobre Lucha contra el Cáncer @es

Special parliamentary committee
type: Concept
type: CorporateBodyClassification
created: 2023-10-31
deprecated: false
broader: Parliamentary committee
definition: Special Parliamentary Committee of the European Parliament.
in scheme: EP taxonomy on entities.
preferred label: Specialusis parlamentinis komitetas @lt
preferred label: Bijzondere parlementaire commissie @nl
preferred label: Parlamentin erityisvaliokunta @fi
preferred label: Īpašā parlamentārā komiteja @lv
preferred label: Commission parlementaire spéciale @fr
preferred label: parlamenti különbizottság @hu
preferred label: Specjalna komisja parlamentarna @pl
preferred label: Sonderausschuss des Parlaments @de
preferred label: Comissão parlamentar especial @pt
preferred label: Osobitný parlamentný výbor @sk
preferred label: Commissione parlamentare speciale @it
preferred label: Специална парламентарна комисия @bg
preferred label: Comisión parlamentaria especial @es
preferred label: Särskilt parlamentsutskott @sv
preferred label: Zvláštní parlamentní výbor @cs
preferred label: Særligt parlamentsudvalg @da
preferred label: Comisia parlamentară specială @ro
preferred label: Kumitat parlamentari speċjali @mt
preferred label: Parlamendi erikomisjon @et
preferred label: Coiste parlaiminteach speisialta @ga
preferred label: Posebni parlamentarni odbor @hr
preferred label: Ειδική κοινοβουλευτική επιτροπή @el

Joint committee procedure - ENVI and INTA
type: Concept
created: 2025-08-31
deprecated: false
alternative label: Commissions conjointes ENVI - INTA @fr
alternative label: ENVI und INTA @de
alternative label: Joint ENVI - INTA
broader: Joint parliamentary committees
definition: Joint committee procedure - ENVI and INTA.
in scheme: EP taxonomy on entities.
preferred label: Procédure avec commissions conjointes - ENVI et INTA @fr
preferred label: Gemeinsames Ausschussverfahren - ENVI und INTA @de

Joint committee procedure - EMPL and SANT
type: Concept
created: 2025-03-31
deprecated: false
alternative label: Commissions conjointes EMPL - SANT @fr
alternative label: EMPL und SANT @de
alternative label: Joint EMPL - SANT
broader: Joint parliamentary committees
definition: Joint committee procedure - EMPL and SANT.
in scheme: EP taxonomy on entities.
preferred label: Gemeinsames Ausschussverfahren - EMPL und SANT @de
preferred label: Procédure avec commissions conjointes - EMPL et SANT @fr

Joint committee procedure - AFET and BUDG
type: Concept
created: 2023-10-31
deprecated: false
alternative label: Joint AFET - BUDG
alternative label: Commissions conjointes AFET - BUDG @fr
alternative label: AFET und BUDG @de
broader: Joint parliamentary committees
definition: Joint committee procedure - AFET and BUDG.
in scheme: EP taxonomy on entities.
preferred label: Gemeinsames Ausschussverfahren - AFET und BUDG @de
preferred label: Procédure avec commissions conjointes - AFET et BUDG @fr

Delegation for relations with Czechoslovakia
type: Concept
created: 2023-10-31
deprecated: true
alternative label: Tšehhoslovakkia @et
alternative label: Tschechoslowakei @de
alternative label: Checoslovaquia @es
alternative label: Tjekkoslovakiet @da
alternative label: Československo @cs
alternative label: Τσεχοσλοβακία @el
alternative label: Checoslováquia @pt
alternative label: Tjeckoslovakien @sv
alternative label: Csehoszlovákia @hu
alternative label: Tsjechoslowakij @nl
alternative label: Cekoslovakija @lt
alternative label: Czechoslowacja @pl
alternative label: Tchécoslovaquie @fr
alternative label: Cekoslovakkja @mt
alternative label: T?ekkoslovakia @fi
alternative label: An tSeicslóvaic @ga
alternative label: Чехословакия @bg
alternative label: Cecoslovacchia @it
alternative label: Cehoslovakija @lv
alternative label: Ceskoslovensko @sk
alternative label: Češkoslovaška @sl
alternative label: Cehoslovacia @ro
alternative label: Čehoslovačka @hr
alternative label: Czechoslovakia
broader: Parliamentary delegation
definition: Delegation for relations with Czechoslovakia.
in scheme: EP taxonomy on entities.
preferred label: Делегация за връзки с Чехословакия @bg
preferred label: Delegația pentru relațiile cu Cehoslovacia @ro
preferred label: Delegace pro vztahy s Československem @cs
preferred label: Izaslanstvo za odnose s Čehoslovačkom @hr
preferred label: Delegazione per le relazioni con la Cecoslovacchia @it
preferred label: Ühenduse ja Tšehhoslovakkia vaheliste suhetega tegelev delegatsioon @et
preferred label: Suhteista Tsekkoslovakiaan vastaava valtuuskunta @fi
preferred label: Delegação para as relações com a Checoslováquia @pt
preferred label: Delegacija ryšiams su Cekoslovakija @lt
preferred label: Delegazzjoni ghar-relazzjonijiet mac-Cekoslovakkja @mt
preferred label: Delegacija attiecibam ar Cehoslovakiju @lv
preferred label: Αντιπροσωπεία για τις σχέσεις με την Τσεχοσλοβακία @el
preferred label: Toscaireacht don chaidreamh leis an tSeicslóvaic @ga
preferred label: Delegatie voor de betrekkingen met Tsjechoslowakije @nl
preferred label: Délégation pour les relations avec la Tchécoslovaquie @fr
preferred label: Delegation für die Beziehungen zur Tschechoslowakei @de
preferred label: Delegación para las relaciones con Checoslovaquia @es
preferred label: Delegationen för förbindelserna med Tjeckoslovakien @sv
preferred label: Delegationen for Forbindelserne med Tjekkoslovakiet @da
preferred label: Delegácia pre vztahy s Ceskoslovenskom @sk
preferred label: Delegacja ds. stosunków z Czechoslowacja @pl
preferred label: A Csehszlovákiával való kapcsolatokért felelos küldöttség @hu
preferred label: Delegacija za odnose s Češkoslovaško @sl

Committee on Industry, Research and Energy
type: Concept
created: 2023-10-31
deprecated: false
alternative label: Industrie, recherche et énergie @fr
alternative label: Industria, Investigación y Energía @es
alternative label: Tionsclaíocht, Taighde agus Fuinneamh @ga
alternative label: Βιομηχανία, Έρευνα και Ενέργεια @el
alternative label: Tööstus, teadusuuringud ja energeetika @et
alternative label: Industrija, raziskave in energetika @sl
alternative label: Pramonė, moksliniai tyrimai ir energetika @lt
alternative label: Industrija, Riċerka u Enerġija @mt
alternative label: Průmysl, výzkum a energetika @cs
alternative label: Industri, Forskning og Energi @da
alternative label: Industrie, Forschung und Energie @de
alternative label: Indústria, Investigação e Energia @pt
alternative label: Priemysel, výskum a energetika @sk
alternative label: Industry, Research and Energy
alternative label: Industrija, istraživanje i energetika @hr
alternative label: Ipar, kutatás és energiaügy @hu
alternative label: Industrie, cercetare și energie @ro
alternative label: Teollisuus, tutkimus ja energia @fi
alternative label: Rūpniecība, pētniecība un enerģētika @lv
alternative label: Промишленост, изследвания и енергетика @bg
alternative label: Industria, ricerca e energia @it
alternative label: Industrifrågor, forskning och energi @sv
alternative label: Przemysł, Badania Naukowe i Energia @pl
alternative label: Industrie, onderzoek en energie @nl
broader: Standing parliamentary committee
definition: European parliamentary committee on industry, research and energy.
in scheme: EP taxonomy on entities.
preferred label: Comissão da Indústria, da Investigação e da Energia @pt
preferred label: Commissie industrie, onderzoek en energie @nl
preferred label: Комисия по промишленост, изследвания и енергетика @bg
preferred label: Comisión de Industria, Investigación y Energía @es
preferred label: Επιτροπή Βιομηχανίας, Έρευνας και Ενέργειας @el
preferred label: Odbor za industriju, istraživanje i energetiku @hr
preferred label: Odbor za industrijo, raziskave in energetiko @sl
preferred label: Commission de l'industrie, de la recherche et de l'énergie @fr
preferred label: Commissione per l'industria, la ricerca e l'energia @it
preferred label: Ipari, Kutatási és Energiaügyi Bizottság @hu
preferred label: Rūpniecības, pētniecības un enerģētikas komiteja @lv
preferred label: Ausschuss für Industrie, Forschung und Energie @de
preferred label: Komisja Przemysłu, Badań Naukowych i Energii @pl
preferred label: Tööstuse, teadusuuringute ja energeetikakomisjon @et
preferred label: Kumitat għall-Industrija, ir-Riċerka u l-Enerġija @mt
preferred label: Pramonės, mokslinių tyrimų ir energetikos komitetas @lt
preferred label: An Coiste um Thionsclaíocht, um Thaighde agus um Fhuinneamh @ga
preferred label: Teollisuus-, tutkimus- ja energiavaliokunta @fi
preferred label: Utskottet för industrifrågor, forskning och energi @sv
preferred label: Udvalget om Industri, Forskning og Energi @da
preferred label: Výbor pre priemysel, výskum a energetiku @sk
preferred label: Comisia pentru industrie, cercetare și energie @ro
preferred label: Výbor pro průmysl, výzkum a energetiku @cs

Delegation to the EU-Sweden Joint Parliamentary Committee
type: Concept
created: 2023-10-31
deprecated: true
alternative label: UE-Svezia @it
alternative label: AE-an tSualainn @ga
alternative label: EU – Švedska @hr
alternative label: EL-Rootsi @et
alternative label: ЕС-Швеция @bg
alternative label: UE-Suedia @ro
alternative label: EU-Sverige @da
alternative label: ΕΕ-Σουηδία @el
alternative label: ES-Zviedrija @lv
alternative label: EU-Svédország @hu
alternative label: EÚ-Švédsko @sk
alternative label: UE-Suecia @es
alternative label: UE-Szwecja @pl
alternative label: EU-Sweden
alternative label: UE – Svezja @mt
alternative label: EU-Zweden @nl
alternative label: UE-Suède @fr
alternative label: UE-Suécia @pt
alternative label: EU-Švédsko @cs
alternative label: EU-Ruotsi @fi
alternative label: EU-Schweden @de
alternative label: EU-Švedska @sl
alternative label: ES-Švedija @lt
broader: Delegation to Joint Parliamentary Committee
definition: Delegation to the EU-Sweden Joint Parliamentary Committee.
in scheme: EP taxonomy on entities.
preferred label: Delegationen till det blandade parlamentariska utskottet EU-Sverige @sv
preferred label: Delegácia pre Spolocný parlamentný výbor EÚ-Švédsko @sk
preferred label: Delegacija ES-Zviedrijas kopigai parlamentarajai komisijai @lv
preferred label: Valtuuskunta EU:n ja Ruotsin välisessä parlamentaarisessa @fi
preferred label: Delegace při smíšeném parlamentním výboru EU-Švédsko @cs
preferred label: Délégation à la Commission parlementaire mixte UE-Suède @fr
preferred label: Toscaireacht chun an Chomhchoiste Pharlaimintigh den AE-an tSualainn @ga
preferred label: Delegatsioon EL-Rootsi parlamentaarses ühiskomitees @et
preferred label: Αντιπροσωπεία στη Μικτή Κοινοβουλευτική Επιτροπή ΕΕ-Σουηδίας @el
preferred label: Delegation im Gemischten Parlamentarischen Ausschuß EU-Schweden @de
preferred label: Delegacja do Wspólnej Komisji Parlamentarnej UE-Szwecja @pl
preferred label: Az EU-Svédország Interparlamentáris Bizottsághoz delegáltak @hu
preferred label: Delegacija skupnega parlamentarnega odbora EU in Švedske @sl
preferred label: Delegation til Det Blandede Parlamentariske Udvalg EU-Sverige @da
preferred label: Delegación en la Comisión parlamentaria mixta UE-Suecia @es
preferred label: Delegatie in de Gemengde Parlamentaire Commissie EU-Zweden @nl
preferred label: Делегация в Съвместния парламентарен комитет ЕС-Швеция @bg
preferred label: Delegația la Comisia parlamentară mixtă UE-Suedia @ro
preferred label: Izaslanstvo u Zajedničkom parlamentarnom odboru EU-a i Švedske @hr
preferred label: Delegazzjoni lejn il-Kumitat Parlamentari Maghqud KE-Svezja @mt
preferred label: Delegação à Comissão Parlamentar Mista UE-Suécia @pt
preferred label: Delegacija i ES-Švedijos Jungtini parlamentini komiteta @lt
preferred label: Delegazione alla Commissione parlamentare mista UE-Svezia @it

Delegation to the EU-Hungary Joint Parliamentary Committee
type: Concept
created: 2023-10-31
deprecated: true
alternative label: UE-Ungaria @ro
alternative label: EU-Hungary
alternative label: EU-Madžarska @sl
alternative label: AE-an Ungáir @ga
alternative label: EL-Ungari @et
alternative label: ES-Vengrija @lt
alternative label: UE-Hongrie @fr
alternative label: EU – Mađarska @hr
alternative label: UE-Ungerija @mt
alternative label: ΕΕ-Ουγγαρία @el
alternative label: EU-Magyarország @hu
alternative label: ES-Ungarija @lv
alternative label: EU-Ungern @sv
alternative label: UE-Hungría @es
alternative label: ЕС-Унгария @bg
alternative label: EU-Ungarn @de
alternative label: UE-Ungheria @it
alternative label: UE-Wegry @pl
alternative label: EU-Unkari @fi
alternative label: UE-Hungria @pt
alternative label: EÚ-Madarsko @sk
alternative label: EU-Maďarsko @cs
alternative label: EU-Hongarije @nl
broader: Delegation to Joint Parliamentary Committee
definition: Delegation to the EU-Hungary Joint Parliamentary Committee.
in scheme: EP taxonomy on entities.
preferred label: Αντιπροσωπεία στη Μικτή Κοινοβουλευτική Επιτροπή ΕΕ-Ουγγαρίας @el
preferred label: Az EU-Magyarország Parlamenti Vegyes Bizottságba delegált küldöttség @hu
preferred label: Delegazzjoni lejn il-Kumitat Parlamentari Mag]qud UE-Ungerija @mt
preferred label: Delegationen till den gemensamma parlamentarikerkommittén EU-Ungern @sv
preferred label: Délégation à la commission parlementaire mixte UE-Hongrie @fr
preferred label: Delegationen til Det Blandede Parlamentariske Udvalg EU-Ungarn @da
preferred label: Delegacija pri Skupnem parlamentarnem odboru EU-Madžarska @sl
preferred label: ES-Ungārijas Apvienotās parlamentārās komitejas delegācija @lv
preferred label: Delegación en la Comisión Parlamentaria Mixta UE-Hungría @es
preferred label: Delegace při smíšeném parlamentním výboru EU-Maďarsko @cs
preferred label: Izaslanstvo u Zajedničkom parlamentarnom odboru EU-a i Mađarske @hr
preferred label: Delegatie in de Gemengde Parlementaire Commissie EU-Hongarije @nl
preferred label: Delegacja do wspólnej komisji parlamentarnej UE-Węgry @pl
preferred label: Delegation im gemischten parlamentarischen Ausschuss EU-Ungarn @de
preferred label: Delegazione alla commissione parlamentare mista UE-Ungheria @it
preferred label: Delegația la Comisia parlamentară mixtă UE-Ungaria @ro
preferred label: Delegação à Comissão Parlamentar Mista UE-Hungria @pt
preferred label: Делегация в Съвместния парламентарен комитет ЕС-Унгария @bg
preferred label: Delegatsioon parlamendi ELi-Ungari ühiskomisjonis @et
preferred label: Delegácia pri Spoločnom parlamentnom výbore EÚ-Maďarsko @sk
preferred label: Valtuuskunta EU:n ja Unkarin välisessä parlamentaarisessa sekavaliokunnassa @fi
preferred label: Delegacija ES-Vengrijos jungtiniame parlamentiniame komitete @lt
preferred label: Toscaireacht chun an Chomhchoiste Pharlaimintigh den AE-an Ungáir @ga

European Union corporate body
type: Concept
created: 2023-10-31
deprecated: false
definition: European Union corporate body.
in scheme: EP taxonomy on entities.
preferred label: Юридическо лице на Европейския съюз @bg
preferred label: Pravna oseba Evropske unije @sl
preferred label: Euroopan unionin oikeushenkilö @fi
preferred label: Comhlacht corparáideach de chuid an Aontais Eorpaigh @ga
preferred label: Νομικό πρόσωπο της Ευρωπαϊκής Ένωσης @el
preferred label: Persona giuridica dell’Unione europea @it
preferred label: Organismo da União Europeia @pt
preferred label: Körperschaft der Europäischen Union @de
preferred label: Osoba prawna należąca do Unii Europejskiej @pl
preferred label: Juridisk person inom Europeiska unionen @sv
preferred label: Europos Sąjungos juridinis asmuo @lt
preferred label: Pravna osoba Europske unije @hr
preferred label: Právnická osoba Európskej únie @sk
preferred label: Rechtspersoon van de Europese Unie @nl
preferred label: Persona jurídica de la Unión Europea @es
preferred label: Juridisk person under EU @da
preferred label: Juridiska persona Eiropas Savienībā @lv
preferred label: Entitate juridică a Uniunii Europene @ro
preferred label: Korp korporattiv tal-Unjoni Ewropea @mt
preferred label: Euroopa Liidu juriidiline isik @et
preferred label: Európai uniós jogi személy @hu
preferred label: Právnická osoba Evropské unie @cs
preferred label: Entité légale de l’Union européenne @fr
top concept of: EP taxonomy on entities.

Delegation to the EU-Malta Joint Parliamentary Committee
type: Concept
created: 2023-10-31
deprecated: true
alternative label: AE-Málta @ga
alternative label: EÚ-Malta @sk
alternative label: ЕС-Малта @bg
alternative label: EU-Málta @hu
alternative label: UE-Malta @ro
alternative label: EL-Malta @et
alternative label: UE-Malte @fr
alternative label: ΕΕ-Μάλτα @el
alternative label: EU-Malta
alternative label: ES-Malta @lv
alternative label: EU – Malta @hr
broader: Delegation to Joint Parliamentary Committee
definition: Delegation to the EU-Malta Joint Parliamentary Committee.
in scheme: EP taxonomy on entities.
preferred label: Делегация в Съвместния парламентарен комитет ЕС-Малта @bg
preferred label: Delegacija ES-Maltos jungtiniame parlamentiniame komitete @lt
preferred label: Delegatsioon parlamendi ELi-Malta ühiskomisjonis @et
preferred label: Delegacija pri Skupnem parlamentarnem odboru EU-Malta @sl
preferred label: Delegazione alla commissione parlamentare mista UE-Malta @it
preferred label: Delegazzjoni lejn il-Kumitat Parlamentari Maghqud UE-Malta @mt
preferred label: Delegácia pri Spoločnom parlamentnom výbore EÚ-Malta @sk
preferred label: ES-Maltas Apvienotās parlamentārās komitejas delegācija @lv
preferred label: Delegación en la Comisión Parlamentaria Mixta UE-Malta @es
preferred label: Delegace při smíšeném parlamentním výboru EU-Malta @cs
preferred label: Delegacja do wspólnej komisji parlamentarnej UE-Malta @pl
preferred label: Toscaireacht chun an Chomhchoiste Pharlaimintigh den AE-Málta @ga
preferred label: Αντιπροσωπεία στη Μικτή Κοινοβουλευτική Επιτροπή ΕΕ-Μάλτας @el
preferred label: Valtuuskunta EU:n ja Maltan välisessä parlamentaarisessa sekavaliokunnassa @fi
preferred label: Az EU-Málta Parlamenti Vegyes Bizottságba delegált küldöttség @hu
preferred label: Delegation im gemischten parlamentarischen Ausschuss EU-Malta @de
preferred label: Delegationen till den gemensamma parlamentarikerkommittén EU-Malta @sv
preferred label: Delegationen til Det Blandede Parlamentariske Udvalg EU-Malta @da
preferred label: Delegatie in de Gemengde Parlementaire Commissie EU-Malta @nl
preferred label: Delegația la Comisia parlamentară mixtă UE-Malta @ro
preferred label: Delegação à Comissão Parlamentar Mista UE-Malta @pt
preferred label: Izaslanstvo u Zajedničkom parlamentarnom odboru EU-a i Malte @hr
preferred label: Délégation à la commission parlementaire mixte UE-Malte @fr

Delegation to the EU-Slovenia Joint Parliamentary Committee
type: Concept
created: 2023-10-31
deprecated: true
alternative label: EU-Slovenië @nl
alternative label: EU-Slovinsko @cs
alternative label: UE-Eslovénia @pt
alternative label: EL-Sloveenia @et
alternative label: EU-Szlovénia @hu
alternative label: EU-Slowenien @de
alternative label: AE-an tSlóvéin @ga
alternative label: EU-Slovenija @sl
alternative label: ЕС-Словения @bg
alternative label: EÚ-Slovinsko @sk
alternative label: ΕΕ-Σλοβενία @el
alternative label: UE-Slovénie @fr
alternative label: EU – Slovenija @hr
alternative label: UE-Slovenia @ro
alternative label: UE-Eslovenia @es
alternative label: EU-Slovenien @da
alternative label: EU-Slovenia
alternative label: UE-Slowenia @pl
alternative label: UE-Slovenja @mt
alternative label: ES-Slovenija @lv
broader: Delegation to Joint Parliamentary Committee
definition: Delegation to the EU-Slovenia Joint Parliamentary Committee.
in scheme: EP taxonomy on entities.
preferred label: Delegation im gemischten parlamentarischen Ausschuss EU-Slowenien @de
preferred label: Izaslanstvo u Zajedničkom parlamentarnom odboru EU-a i Slovenije @hr
preferred label: Delegação à Comissão Parlamentar Mista UE-Eslovénia @pt
preferred label: Delegazione alla commissione parlamentare mista UE-Slovenia @it
preferred label: Delegación en la Comisión Parlamentaria Mixta UE-Eslovenia @es
preferred label: Delegatsioon parlamendi ELi-Sloveenia ühiskomisjonis @et
preferred label: Delegationen til Det Blandede Parlamentariske Udvalg EU-Slovenien @da
preferred label: Valtuuskunta EU:n ja Slovenian välisessä parlamentaarisessa sekavaliokunnassa @fi
preferred label: Delegacja do wspólnej komisji parlamentarnej UE-Słowenia @pl
preferred label: ES-Slovēnijas Apvienotās parlamentārās komitejas delegācija @lv
preferred label: Delegazzjoni lejn il-Kumitat Parlamentari Maghqud UE-Slovenja @mt
preferred label: Delegația la Comisia parlamentară mixtă UE-Slovenia @ro
preferred label: Delegatie in de Gemengde Parlementaire Commissie EU-Slovenië @nl
preferred label: Delegácia pri Spoločnom parlamentnom výbore EÚ-Slovinsko @sk
preferred label: Az EU-Szlovénia Parlamenti Vegyes Bizottságba delegált küldöttség @hu
preferred label: Αντιπροσωπεία στη Μικτή Κοινοβουλευτική Επιτροπή ΕΕ-Σλοβενίας @el
preferred label: Delegace při smíšeném parlamentním výboru EU-Slovinsko @cs
preferred label: Делегация в Съвместния парламентарен комитет ЕС-Словения @bg
preferred label: Delegationen till den gemensamma parlamentarikerkommittén EU-Slovenien @sv
preferred label: Delegacija pri Skupnem parlamentarnem odboru EU-Slovenija @sl
preferred label: Delegacija ES-Slovėnijos jungtiniame parlamentiniame komitete @lt
preferred label: Délégation à la commission parlementaire mixte UE-Slovénie @fr
preferred label: Toscaireacht chun an Chomhchoiste Pharlaimintigh den AE-an tSlóivéin @ga

European Chemicals Agency
type: Concept
created: 2023-10-31
deprecated: false
broader: Decentralised agency
definition: European Chemicals Agency.
in scheme: EP taxonomy on entities.
preferred label: Eiropas Ķimikāliju aģentūra @lv
preferred label: An Ghníomhaireacht Eorpach Ceimiceán @ga
preferred label: Euroopa Kemikaaliamet @et
preferred label: L-Aġenzija Ewropea għas-Sustanzi Kimiċi @mt
preferred label: Európska chemická agentúra @sk
preferred label: Agenzia europea per le sostanze chimiche @it
preferred label: Agenția Europeană pentru Produse Chimice @ro
preferred label: Euroopan kemikaalivirasto @fi
preferred label: Europeiska kemikaliemyndigheten @sv
preferred label: Evropska agencija za kemikalije @sl
preferred label: Europska agencija za kemikalije @hr
preferred label: Ευρωπαϊκός Οργανισμός Χημικών Προϊόντων @el
preferred label: Agence européenne des produits chimiques @fr
preferred label: Európai Vegyianyag-ügynökség @hu
preferred label: Европейска агенция по химикали @bg
preferred label: Det Europæiske Kemikalieagentur @da
preferred label: Europos cheminių medžiagų agentūra @lt
preferred label: Europees Agentschap voor chemische stoffen @nl
preferred label: Europejska Agencja Chemikaliów @pl
preferred label: Europäische Chemikalienagentur @de
preferred label: Agência Europeia dos Produtos Químicos @pt
preferred label: Agencia Europea de Sustancias y Mezclas Químicas @es
preferred label: Evropská agentura pro chemické látky @cs

Joint committee procedure - ECON and ENVI
type: Concept
created: 2023-10-31
deprecated: false
alternative label: Commissions conjointes ECON - ENVI @fr
alternative label: ECON und ENVI @de
alternative label: Joint ECON - ENVI
broader: Joint parliamentary committees
definition: Joint committee procedure - ECON and ENVI.
in scheme: EP taxonomy on entities.
preferred label: Procédure avec commissions conjointes - ECON et ENVI @fr
preferred label: Gemeinsames Ausschussverfahren - ECON und ENVI @de

Delegation to the EU-Kazakhstan, EU-Kyrgyzstan, EU-Uzbekistan and EU-Tajikistan Parliamentary Cooperation Committees and for relations with Turkmenistan and Mongolia
type: Concept
created: 2023-10-31
deprecated: false
alternative label: Asia Centrală, Mongolia @ro
alternative label: Asie centrale, Mongolie @fr
alternative label: Vidusāzija, Mongolija @lv
alternative label: Central Asia, Mongolia
alternative label: Asia Central, Mongolia @es
alternative label: Stredná Ázia, Mongolsko @sk
alternative label: Centraal-Azië, Mongolië @nl
alternative label: Asja Ċentrali, Mongolja @mt
alternative label: Κεντρική Ασία, Μογγολία @el
alternative label: Kesk-Aasia, Mongoolia @et
alternative label: Централна Азия, Монголия @bg
alternative label: Ásia Central, Mongólia @pt
alternative label: Centralasien, Mongoliet @da
alternative label: Keski-Aasia, Mongolia @fi
alternative label: Srednja Azija i Mongolija @hr
alternative label: An Áise Láir, An Mhongóil @ga
alternative label: Střední Asie, Mongolsko @cs
alternative label: Azja Środkowa, Mongolia @pl
alternative label: Vidurinė Azija, Mongolija @lt
alternative label: Asia centrale, Mongolia @it
alternative label: Srednja Azija, Mongolija @sl
alternative label: Közép-Ázsia, Mongólia @hu
alternative label: Zentralasien, Mongolei @de
broader: Parliamentary delegation
definition: Delegation to the EU-Kazakhstan, EU-Kyrgyzstan, EU-Uzbekistan and EU-Tajikistan Parliamentary Cooperation Committees and for relations with Turkmenistan and Mongolia.
in scheme: EP taxonomy on entities.
preferred label: EU:n ja Kazakstanin, EU:n ja Kirgisian, EU:n ja Uzbekistanin ja EU:n ja Tadžikistanin parlamentaarisissa yhteistyövaliokunnissa toimiva ja suhteista Turkmenistaniin ja Mongoliaan vastaava valtuuskunta @fi
preferred label: Delegacija pri odborih za parlamentarno sodelovanje EU-Kazahstan, EU-Kirgizistan, EU-Uzbekistan ter EU-Tadžikistan in za odnose s Turkmenistanom in Mongolijo @sl
preferred label: Delegatie in de parlementaire samenwerkingscommissies EU-Kazachstan, EU-Kirgizië, EU-Oezbekistan en EU-Tadzjikistan, en voor de betrekkingen met Turkmenistan en Mongolië @nl
preferred label: Delegazzjoni għall-Kumitati ta' Kooperazzjoni Parlamentari UE-Kazakistan, UE-Kirgiżistan, UE-Uzbekistan u UE-Taġikistan, u għar-relazzjonijiet mat-Turkmenistan u l-Mongolja @mt
preferred label: Delegationen til De Parlamentariske Samarbejdsudvalg EU-Kasakhstan, EU-Kirgisistan, EU-Usbekistan og EU-Tadsjikistan og for Forbindelserne med Turkmenistan og Mongoliet @da
preferred label: Az EU-Kazahsztán, EU-Kirgizisztán, EU-Üzbegisztán és EU-Tádzsikisztán Parlamenti Együttműködési Bizottságokba delegált küldöttség és a Türkmenisztánnal és Mongóliával fenntartott kapcsolatokért felelős küldöttség @hu
preferred label: Делегация в комитетите за парламентарно сътрудничество ЕС-Казахстан, ЕС-Киргизстан, ЕС-Узбекистан и ЕС Таджикистан и за връзки с Туркменистан и Монголия @bg
preferred label: Delegazione alle commissioni parlamentari di cooperazione UE-Kazakistan, UE-Kirghizistan, UE-Uzbekistan e UE-Tagikistan, e per le relazioni con il Turkmenistan e la Mongolia @it
preferred label: Délégation aux commissions de coopération parlementaire UE-Kazakhstan, UE-Kirghizstan, UE-Ouzbékistan et UE-Tadjikistan, et pour les relations avec le Turkménistan et la Mongolie @fr
preferred label: Delegação às Comissões Parlamentares de Cooperação UE-Cazaquistão, UE-Quirguistão, UE-Usbequistão e UE-Tajiquistão e para as Relações com o Turquemenistão e a Mongólia @pt
preferred label: Delegacija ES ir Kazachstano, ES ir Kirgizijos, ES ir Uzbekistano ir ES ir Tadžikistano parlamentinio bendradarbiavimo komitetuose ir ryšiams su Turkmėnistanu ir Mongolija @lt
preferred label: Delegacja do Komisji Współpracy Parlamentarnej UE-Kazachstan, UE-Kirgistan, UE-Uzbekistan i UE-Tadżykistan oraz do spraw Stosunków z Turkmenistanem i Mongolią @pl
preferred label: Delegācija ES un Kazahstānas, ES un Kirgizstānas, ES un Uzbekistānas, ES un Tadžikistānas parlamentārās sadarbības komitejās, kā arī attiecībām ar Turkmenistānu un Mongoliju @lv
preferred label: Delegation in den Ausschüssen für parlamentarische Kooperation EU-Kasachstan,EU-Kirgisistan, EU-Usbekistan und EU-Tadschikistan sowie für die Beziehungen zuTurkmenistan und der Mongolei @de
preferred label: Delegația la comisiile de cooperare parlamentară UE-Kazahstan, UE-Kârgâzstan, UE-Uzbekistan și UE-Tadjikistan și pentru relațiile cu Turkmenistanul și Mongolia @ro
preferred label: Delegácia pri Parlamentných výboroch pre spoluprácu EÚ – Kazachstan, EÚ – Kirgizsko, EÚ –Uzbekistan a EÚ – Tadžikistan a pre vzťahy s Turkménskom a Mongolskom @sk
preferred label: Delegación en las Comisiones Parlamentarias de Cooperación UE-Kazajistán, UE-Kirguistán, UE-Uzbekistán y UE-Tayikistán, y para las Relaciones con Turkmenistán y Mongolia @es
preferred label: Delegace ve Výborech pro parlamentní spolupráci EU-Kazachstán, EU-Kyrgyzstán, EU-Uzbekistán a EU-Tádžikistán a pro vztahy s Turkmenistánem a Mongolskem @cs
preferred label: Delegationen till de parlamentariska samarbetskommittéerna EU–Kazakstan, EU–Kirgizistan, EU–Uzbekistan och EU–Tadzjikistan samt förbindelserna med Turkmenistan och Mongoliet @sv
preferred label: Αντιπροσωπεία στις Επιτροπές Κοινοβουλευτικής Συνεργασίας ΕΕ-Καζακστάν, ΕΕ-Κιργιζιστάν, ΕΕ-Ουζμπεκιστάν και ΕΕ-Τατζικιστάν και για τις σχέσεις με το Τουρκμενιστάν και τη Μογγολία @el
preferred label: Delegatsioon ELi-Kasahstani, ELi-Kõrgõzstani, ELi-Usbekistani ja ELi-Tadžikistani parlamentaarsetes koostöökomisjonides ning Türkmenistani ja Mongooliaga suhtlemiseks @et
preferred label: Izaslanstvo u odborima za parlamentarnu suradnju između EU-a i Kazahstana, EU-a i Kirgistana, EU-a i Uzbekistana, EU-a i Tadžikistana te za odnose s Turkmenistanom i Mongolijom @hr
preferred label: An Toscaireacht chun na gCoistí um Chomhar Parlaiminteach idir AE agus an Chasacstáin, idir AE agus an Chirgeastáin, idir AE agus an Úisbéiceastáin agus idir AE agus an Táidsíceastáin, agus don chaidreamh leis an Tuircméanastáin agus leis an Mongóil @ga

European Medicines Agency
type: Concept
created: 2023-10-31
deprecated: false
broader: Decentralised agency
definition: European Medicines Agency.
in scheme: EP taxonomy on entities.
preferred label: L-Aġenzija Ewropea għall-Mediċini @mt
preferred label: Európska agentúra pre lieky @sk
preferred label: Agencia Europea de Medicamentos @es
preferred label: Evropska agencija za zdravila @sl
preferred label: Eiropas Zāļu aģentūra @lv
preferred label: Európai Gyógyszerügynökség @hu
preferred label: Euroopan lääkevirasto @fi
preferred label: Europäische Arzneimittel-Agentur @de
preferred label: Evropská agentura pro léčivé přípravky @cs
preferred label: Agenția Europeană pentru Medicamente @ro
preferred label: Agence européenne des médicaments @fr
preferred label: Agenzia europea per i medicinali @it
preferred label: Europees Geneesmiddelenbureau @nl
preferred label: Ευρωπαϊκός Οργανισμός Φαρμάκων @el
preferred label: Europos vaistų agentūra @lt
preferred label: Europska agencija za lijekove @hr
preferred label: Europeiska läkemedelsmyndigheten @sv
preferred label: Euroopa Ravimiamet @et
preferred label: Европейска агенция по лекарствата @bg
preferred label: Europejska Agencja Leków @pl
preferred label: Det Europæiske Lægemiddelagentur @da
preferred label: An Ghníomhaireacht Leigheasra Eorpach @ga
preferred label: Agência Europeia de Medicamentos @pt

Hungarian Parliament
type: Concept
created: 2023-10-31
deprecated: false
broader: National chamber
definition: Hungarian Parliament.
in scheme: EP taxonomy on entities.
preferred label: Държавно събрание на Република Унгария @bg
preferred label: Parlamento húngaro @pt
preferred label: madžarska državna skupščina @sl
preferred label: parlament Węgier @pl
preferred label: mađarska Nacionalna skupština @hr
preferred label: Det ungerska parlamentet @sv
preferred label: Parlament Ungeriż @mt
preferred label: ungarisches Parlament @de
preferred label: Vengrijos Nacionalinė Asamblėja @lt
preferred label: Parlaimint na hUngáire @ga
preferred label: Parlamentul Ungariei @ro
preferred label: magyar Országgyűlés @hu
preferred label: Asamblea Nacional húngara @es
preferred label: Ουγγρικό Κοινοβούλιο @el
preferred label: maďarský parlament @cs
preferred label: Ungari Rahvuskogu @et
preferred label: Ungārijas parlaments @lv
preferred label: Hongaars parlement @nl
preferred label: Unkarin parlamentti @fi
preferred label: Parlamento ungherese @it
preferred label: Parlement hongrois @fr
preferred label: det ungarske parlament @da

Joint committee procedure - BUDG and ITRE
type: Concept
created: 2023-10-31
deprecated: false
alternative label: Joint BUDG - ITRE
alternative label: BUDG und ITRE @de
alternative label: Commissions conjointes BUDG - ITRE @fr
broader: Joint parliamentary committees
definition: Joint committee procedure - BUDG and ITRE.
in scheme: EP taxonomy on entities.
preferred label: Gemeinsames Ausschussverfahren - BUDG und ITRE @de
preferred label: Procédure avec commissions conjointes - BUDG et ITRE @fr

European Environment Agency
type: Concept
created: 2023-10-31
deprecated: false
broader: Decentralised agency
definition: European Environment Agency.
in scheme: EP taxonomy on entities.
preferred label: Euroopa Keskkonnaamet @et
preferred label: Europejska Agencja Środowiska @pl
preferred label: Ευρωπαϊκός Οργανισμός Περιβάλλοντος @el
preferred label: Europäische Umweltagentur @de
preferred label: Agence européenne pour l’environnement @fr
preferred label: An Ghníomhaireacht Chomhsaoil Eorpach @ga
preferred label: Europos aplinkos agentūra @lt
preferred label: Europeiska miljöbyrån @sv
preferred label: Agencia Europea de Medio Ambiente @es
preferred label: Eiropas Vides aģentūra @lv
preferred label: Agência Europeia do Ambiente @pt
preferred label: Evropska agencija za okolje @sl
preferred label: Evropská agentura pro životní prostředí @cs
preferred label: Agenzia europea dell’ambiente @it
preferred label: Euroopan ympäristökeskus @fi
preferred label: Agenția Europeană de Mediu @ro
preferred label: Europees Milieuagentschap @nl
preferred label: Европейска агенция за околна среда @bg
preferred label: Európai Környezetvédelmi Ügynökség @hu
preferred label: Európska environmentálna agentúra @sk
preferred label: L-Aġenzija Ewropea għall-Ambjent @mt
preferred label: Det Europæiske Miljøagentur @da
preferred label: Europska agencija za okoliš @hr

Joint committee procedure - AFCO and PETI
type: Concept
created: 2023-10-31
deprecated: false
alternative label: Joint AFCO - PETI
alternative label: Commissions conjointes AFCO - PETI @fr
alternative label: AFCO und PETI @de
broader: Joint parliamentary committees
definition: Joint committee procedure - AFCO and PETI.
in scheme: EP taxonomy on entities.
preferred label: Procédure avec commissions conjointes - AFCO et PETI @fr
preferred label: Gemeinsames Ausschussverfahren - AFCO und PETI @de

European Agency for Safety and Health at Work
type: Concept
created: 2023-10-31
deprecated: false
broader: Decentralised agency
definition: European Agency for Safety and Health at Work.
in scheme: EP taxonomy on entities.
preferred label: Европейска агенция за безопасност и здраве при работа @bg
preferred label: Europees Agentschap voor de veiligheid en de gezondheid op het werk @nl
preferred label: Europäische Agentur für Sicherheit und Gesundheitsschutz am Arbeitsplatz @de
preferred label: Agenzia europea per la sicurezza e la salute sul lavoro @it
preferred label: Europejska Agencja Bezpieczeństwa i Zdrowia w Pracy @pl
preferred label: Ευρωπαϊκός Οργανισμός για την Ασφάλεια και την Υγεία στην Εργασία @el
preferred label: Agência Europeia para a Segurança e a Saúde no Trabalho @pt
preferred label: Europos darbuotojų saugos ir sveikatos agentūra @lt
preferred label: Európai Munkahelyi Biztonsági és Egészségvédelmi Ügynökség @hu
preferred label: Európska agentúra pre bezpečnosť a ochranu zdravia pri práci @sk
preferred label: Evropska agencija za varnost in zdravje pri delu @sl
preferred label: Europeiska arbetsmiljöbyrån @sv
preferred label: Euroopan työterveys- ja työturvallisuusvirasto @fi
preferred label: Evropská agentura pro bezpečnost a ochranu zdraví při práci @cs
preferred label: Agence européenne pour la sécurité et la santé au travail @fr
preferred label: L-Aġenzija Ewropea għas-Sigurtà u s-Saħħa fuq il-Post tax-Xogħol @mt
preferred label: Euroopa Tööohutuse ja Töötervishoiu Agentuur @et
preferred label: Eiropas Darba drošības un veselības aizsardzības aģentūra @lv
preferred label: Agenția Europeană pentru Securitate și Sănătate în Muncă @ro
preferred label: Agencia Europea para la Seguridad y la Salud en el Trabajo @es
preferred label: Det Europæiske Arbejdsmiljøagentur @da
preferred label: An Ghníomhaireacht Eorpach um Shábháilteacht agus Sláinte ag an Obair @ga
preferred label: Europska agencija za sigurnost i zdravlje na radu @hr

Committee of Inquiry into the crisis of the Equitable Life Assurance Society
type: Concept
created: 2023-10-31
deprecated: true
alternative label: Криза в осигурителната компания „Equitable Life” @bg
alternative label: Krize společnosti Equitable Life Assurance Society @cs
alternative label: Kríza spoločnosti Equitable Life Assurance Society @sk
alternative label: Οικονομική κρίση της εταιρείας Equitable Life Assurance Society @el
alternative label: Krise der „Equitable Life Assurance Society“ @de
alternative label: Krisen i bolaget Equitable Life Assurance Society @sv
alternative label: Crisi finanziaria della Equitable Life Assurance Society @it
preferred label: Equitable Life Assurance Society kriisi uurimiskomisjon @et
alternative label: Az Equitable Life Assurance Society biztosítótársaság válsága @hu
alternative label: Bendrovės „Equitable Life Assurance Society“ krizė @lt
alternative label: Kryzys w spółce Equitable Life Assurance Society @pl
alternative label: Crise da Equitable Life Assurance Society @pt
alternative label: Kriżi finanzjarja 'Equitable Life Assurance Society' @mt
alternative label: Géarchéim an chumainn árachais 'Equitable Life' @ga
alternative label: Crisis de Equitable Life Assurance Society @es
alternative label: Crisis of the Equitable Life Assurance Society
alternative label: Sabiedrības "Equitable Life Assurance Society" krīze @lv
alternative label: Kriza družbe "Equitable Life Assurance Society" @sl
alternative label: Criza societății de asigurări „Equitable Life” @ro
alternative label: Crisis bij de Equitable Life Assurance Society @nl
alternative label: Krisen i Equitable Life Assurance Society @da
alternative label: Equitable Life Assurance Society -yhtiön kriisi @fi
alternative label: Kriza osiguravajućeg društva „Eqitable Life” @hr
alternative label: Crise de la compagnie d'assurances 'Equitable Life' @fr
broader: Temporary parliamentary committee
definition: Committee of Inquiry into the crisis of the Equitable Life Assurance Society.
in scheme: EP taxonomy on entities.
preferred label: Coiste Fiosrúcháin ar ghéarchéim an chumainn árachais 'Equitable Life' @ga
preferred label: Undersøgelsesudvalget om Krisen i Equitable Life Assurance Society @da
preferred label: Vyšetrovací výbor vo veci krízy spoločnosti Equitable Life Assurance Society @sk
preferred label: Bendrovės „Equitable Life Assurance Society“ krizės tyrimo komitetas @lt
preferred label: Izmeklēšanas komiteja saistībā ar sabiedrības "Equitable Life Assurance Society" krīzi @lv
preferred label: Анкетна комисия по кризата в осигурителната компания "Equitable Life" @bg
preferred label: Az Equitable Life Assurance Society biztosítótársaság válságával foglalkozó vizsgálóbizottság @hu
preferred label: Undersökningskommitté beträffande krisen i bolaget Equitable Life Assurance Society @sv
preferred label: Istražni odbor za krizu osiguravajućeg društva „Eqitable Life” @hr
preferred label: Vyšetřovací výbor ke krizi společnosti Equitable Life Assurance Society @cs
preferred label: Equitable Life Assurance Society -yhtiön kriisiä käsittelevä tutkintavaliokunta @fi
preferred label: Komisja śledcza do zbadania sprawy kryzysu w spółce Equitable Life Assurance Society @pl
preferred label: Commissione d'inchiesta sulla crisi finanziaria della Equitable Life Assurance Society @it
preferred label: Εξεταστική επιτροπή για την οικονομική κρίση της εταιρείας Equitable Life Assurance Society @el
preferred label: Enquêtecommissie crisis bij de Equitable Life Assurance Society @nl
preferred label: Comissão de Inquérito sobre a Crise da Equitable Life Assurance Society @pt
preferred label: Preiskovalni odbor o krizi družbe "Equitable Life Assurance Society" @sl
preferred label: Comisia de anchetă privind criza societății de asigurări „Equitable Life” @ro
preferred label: Kumitat ta' Inkjesta dwar il-kriżi finanzjarja "Equitable Life Assurance Society" @mt
preferred label: Comisión de Investigación sobre la Crisis de Equitable Life Assurance Society @es
preferred label: Commission d'enquête sur la crise de la compagnie d'assurances "Equitable Life" @fr
preferred label: Untersuchungsausschuss zur Krise der „Equitable Life Assurance Society“ @de

European Court of Auditors
type: Concept
created: 2023-10-31
deprecated: false
broader: EU institution
definition: European Court of Auditors.
in scheme: EP taxonomy on entities.
preferred label: Cúirt Iniúchóirí na hEorpa @ga
preferred label: Európsky súd audítorov @sk
preferred label: Evropský účetní dvůr @cs
preferred label: Europski revizorski sud @hr
preferred label: Európai Számvevőszék @hu
preferred label: Tribunal de Contas @pt
preferred label: Το Ελεγκτικό Ευνέόριο @el
preferred label: Cour des comptes Européenne @fr
preferred label: Revisionsrätten @sv
preferred label: Europos Audito Rūmai @lt
preferred label: De Rekenkamer @nl
preferred label: Tilintarkastustuomioistuin @fi
preferred label: Corte dei conti Europea @it
preferred label: Revisionsretten @da
preferred label: Qorti Ewropea ta’ l-Awdituri @mt
preferred label: Europäischer Rechnungshof @de
preferred label: Curtea europeană de conturi @ro
preferred label: Euroopa Kontrollikoda @et
preferred label: Европейска сметна палата @bg
preferred label: Evropsko računsko sodišče @sl
preferred label: Eiropas Auditoru Tiesa @lv
preferred label: Europejski Trybunał Obrachunkowy @pl
preferred label: Tribunal de Cuentas Europeo @es

Temporary parliamentary legislative committee
type: CorporateBodyClassification
type: Concept
created: 2024-06-01
deprecated: false
broader: Parliamentary committee
definition: Temporary parliamentary legislative committee of the European Parliament.
in scheme: EP taxonomy on entities.
preferred label: Προσωρινή κοινοβουλευτική νομοθετική επιτροπή @el
preferred label: Midlertidigt parlamentsudvalg @da
preferred label: Laikinasis Parlamento teisėkūros komitetas @lt
preferred label: Ideiglenes parlamenti jogalkotási bizottság @hu
preferred label: Comisión legislativa parlamentaria temporal @es
preferred label: Dočasný parlamentný legislatívny výbor @sk
preferred label: Začasni parlamentarni zakonodajni odbor @sl
preferred label: Kumitat leġiżlattiv parlamentari temporanju @mt
preferred label: Commissione legislativa parlamentare temporanea @it
preferred label: Comisia legislativă parlamentară temporară @ro
preferred label: Commission législative parlementaire temporaire @fr
preferred label: Temporärer gesetzgebender parlamentarischer Ausschuss @de
preferred label: Ajutine parlamendi seadusandlik komisjon @et
preferred label: Comissão legislativa parlamentar temporária @pt
preferred label: Dočasný parlamentní legislativní výbor @cs
preferred label: Pagaidu parlamentārā likumdošanas komiteja @lv
preferred label: Tymczasowa parlamentarna komisja ustawodawcza @pl
preferred label: Parlamentin väliaikainen lainsäädäntövaliokunta @fi
preferred label: Privremeni parlamentarni zakonodavni odbor @hr
preferred label: Coiste reachtach parlaiminteach sealadach @ga
preferred label: Tijdelijke parlementaire wetgevingscommissie @nl
preferred label: Tillfälligt parlamentsutskott @sv
preferred label: Временна парламентарна законодателна комисия @bg

Joint committee procedure - EMPL and LIBE
type: Concept
created: 2024-01-10
deprecated: false
alternative label: Joint EMPL - LIBE
alternative label: Commissions conjointes EMPL - LIBE @fr
alternative label: EMPL und LIBE @de
broader: Joint parliamentary committees
definition: Joint committee procedure - EMPL and LIBE.
in scheme: EP taxonomy on entities.
preferred label: Gemeinsames Ausschussverfahren - EMPL und LIBE @de
preferred label: Procédure avec commissions conjointes - EMPL et LIBE @fr

Joint committee procedure - AFET - INTA - AFCO
type: Concept
created: 2023-10-31
deprecated: false
alternative label: Joint AFET - INTA - AFCO
alternative label: AFET - INTA - AFCO @de
alternative label: Commissions conjointes AFET - INTA - AFCO @fr
broader: Joint parliamentary committees
definition: Joint committee procedure - AFET - INTA - AFCO.
in scheme: EP taxonomy on entities.
preferred label: Gemeinsames Ausschussverfahren - AFET - INTA - AFCO @de
preferred label: Procédure avec commissions conjointes - AFET - INTA - AFCO @fr

Community Plant Variety Office
type: Concept
created: 2023-10-31
deprecated: false
broader: Decentralised agency
definition: Community Plant Variety Office.
in scheme: EP taxonomy on entities.
preferred label: Oficiul Comunitar pentru Soiuri de Plante @ro
preferred label: Kopienas Augu šķirņu birojs @lv
preferred label: Служба на Общността за сортовете растения @bg
preferred label: Odrůdový úřad Společenství @cs
preferred label: Ühenduse Sordiamet @et
preferred label: Instituto Comunitário das Variedades Vegetais @pt
preferred label: Office communautaire des variétés végétales @fr
preferred label: Κοινοτικό Γραφείο Φυτικών Ποικιλιών @el
preferred label: Ufficio comunitario delle varietà vegetali @it
preferred label: An Oifig Chomhphobail um Chineálacha Plandaí @ga
preferred label: Oficina Comunitaria de Variedades Vegetales @es
preferred label: Közösségi Növényfajta-hivatal @hu
preferred label: Úrad Spoločenstva pre odrody rastlín @sk
preferred label: EF-Sortsmyndigheden @da
preferred label: Urad Skupnosti za rastlinske sorte @sl
preferred label: Gemenskapens växtsortsmyndighet @sv
preferred label: Wspólnotowy Urząd Ochrony Odmian Roślin @pl
preferred label: Ured Zajednice za biljnu raznolikost @hr
preferred label: L-Uffiċċju Komunitarju tal-Varjetajiet tal-Pjanti @mt
preferred label: Bendrijos augalų veislių tarnyba @lt
preferred label: Gemeinschaftliches Sortenamt @de
preferred label: Yhteisön kasvilajikevirasto @fi
preferred label: Communautair Bureau voor plantenrassen @nl

European Institute for Gender Equality
type: Concept
created: 2023-10-31
deprecated: false
broader: Decentralised agency
definition: European Institute for Gender Equality.
in scheme: EP taxonomy on entities.
preferred label: Ευρωπαϊκο Ινστιτούτο για την Ισότητα των Φύλων @el
preferred label: Evropský institut pro rovnost žen a mužů @cs
preferred label: Institutul European pentru Egalitatea de Șanse între Femei și Bărbați @ro
preferred label: Istituto europeo per l’uguaglianza di genere @it
preferred label: A Nemek Közötti Egyenlőség Európai Intézete @hu
preferred label: Europäisches Institut für Gleichstellungsfragen @de
preferred label: Europees Instituut voor gendergelijkheid @nl
preferred label: Instituto Europeu para a Igualdade de Género @pt
preferred label: Europos lyčių lygybės institutas @lt
preferred label: Det Europæiske Institut for Ligestilling mellem Mænd og Kvinder @da
preferred label: An Institiúid Eorpach um Chomhionannas Inscne @ga
preferred label: Eiropas Dzimumu līdztiesības institūts @lv
preferred label: Evropski inštitut za enakost spolov @sl
preferred label: L-Istitut Ewropew għall-Ugwaljanza bejn Is-Sessi @mt
preferred label: Európsky inštitút pre rodovú rovnosť @sk
preferred label: Euroopa Soolise Võrdõiguslikkuse Instituut @et
preferred label: Instituto Europeo de la Igualdad de Género @es
preferred label: Institut européen pour l’égalité entre les hommes et les femmes @fr
preferred label: Europeiska jämställdhetsinstitutet @sv
preferred label: Европейски институт за равенство между половете @bg
preferred label: Europski institut za ravnopravnost spolova @hr
preferred label: Euroopan tasa-arvoinstituutti @fi
preferred label: Europejski Instytut ds. Równości Kobiet i Mężczyzn @pl

Delegation for relations with the Czech Republic, the Slovak Republic and Slovenia
type: Concept
created: 2023-10-31
deprecated: true
alternative label: T?ekin tasavalta, Slovakian tasavalta ja Slovenia @fi
alternative label: Repubblika Ceka, Repubblika Slovakka u Slovenja @mt
alternative label: Cekijos Resp., Slovakijos Resp. ir Slovenija @lt
alternative label: République tchèque, République slovaque, Slovénie @fr
alternative label: Τσεχία, Σλοβακία, Σλοβενία @el
alternative label: Češka Republika, Slovačka Republika i Slovenija @hr
alternative label: Tjeckien, Slovakien och Slovenien @sv
alternative label: Češka republika, Slovaška republika in Slovenija @sl
alternative label: Ceská republika, Slovenská republika a Slovinsko @sk
alternative label: Tschechische Republik, Slowakei und Slowenien @de
alternative label: República Checa, República Eslovaca y Eslovenia @es
alternative label: Cehija, Slovakija un Slovenija @lv
alternative label: Tšehhi Vabariik, Slovaki Vabariik ja Sloveenia @et
alternative label: Tjekkiet, Slovakiet og Slovenien @da
alternative label: Česká republika a Slovenská republika @cs
alternative label: Czech Republic, Slovak Republic and Slovenia
alternative label: Repubblica ceca, Repubblica slovacca e Slovenia @it
alternative label: Csehország, Szlovákia és Szlovénia @hu
alternative label: República Checa, República Eslovaca e Eslovénia @pt
alternative label: Poblacht na Seice, Poblacht na Slóvaice agus an tSlóivéin @ga
alternative label: Republica Cehă și Republica Slovacă @ro
alternative label: Delegatie voor de betrekkingen met de Tsjechische @nl
alternative label: Чешка република, Словашка република, Словения @bg
alternative label: Czechy, Slowacja i Slowenia @pl
broader: Parliamentary delegation
definition: Delegation for relations with the Czech Republic, the Slovak Republic and Slovenia.
in scheme: EP taxonomy on entities.
preferred label: Delegacija ryšiams su Cekijos Respublika, Slovakijos Respublika ir Slovenija @lt
preferred label: Toscaireacht don chaidreamh le Poblacht na Seice, le Poblacht na Slóvaice agus leis an tSlóivéin @ga
preferred label: Delegace pro vztahy s Českou republikou, Slovenskou republikou a Slovinskem @cs
preferred label: Delegazione per le relazioni con la repubblica Ceca, la repubblica Slovacca e la Slovenia @it
preferred label: Delegacija attiecibam ar Cehiju, Slovakiju un Sloveniju @lv
preferred label: Delegacja ds. stosunków z Czechami, Slowacja i Slowenia @pl
preferred label: Delegação para as relações com a República Checa, a República Eslovaca e a Eslovénia @pt
preferred label: Delegación para las relaciones con la República Checa, la República Eslovaca y Eslovenia @es
preferred label: Delegationen för förbindelser med Tjeckien, Slovakien och Slovenien @sv
preferred label: Délégation pour les relations avec la République tchèque, la République slovaque et la Slovénie @fr
preferred label: Delegazzjoni ghar-relazzjonijiet mar-Repubblika Ceka, r-Repubblika Slovakka u s-Slovenja @mt
preferred label: Делегация за връзки с Чешката република, Словашката република и Словения @bg
preferred label: Izaslanstvo za odnose s Češkom Republikom, Slovačkom Republikom i Slovenijom @hr
preferred label: Delegatie voor de betrekkingen met de Tsjechische Republiek, de Republiek Slowakije en Slovenië @nl
preferred label: Ühenduse ja Tšehhi Vabariigi, Slovaki Vabariigi ning Sloveenia vaheliste suhetega tegelev delegatsioon @et
preferred label: A Cseh Köztársasággal, a Szlovák Köztársasággal és Szlovéniával való kapcsolatokért felelos küldöttség @hu
preferred label: Delegácia pre vztahy s Ceskou republikou, Slovenskou republikou a Slovinskom @sk
preferred label: Delegacija za odnose s Češko republiko, Slovaško republiko in Slovenijo @sl
preferred label: Suhteista Tsekin tasavaltaan, Slovakian tasavaltaan ja Sloveniaan vastaava valtuuskunta @fi
preferred label: Αντιπροσωπεία για τις σχέσεις με τη Δημοκρατία της Τσεχίας, τη Σλοβακία και τη Σλοβενία @el
preferred label: Delegation für die Beziehungen zu der Tschechischen Republik, der slowakischen Republik und Slowenien @de
preferred label: Delegationen for Forbindelserne med Tjekkiet, Slovakiet og Slovenien @da
preferred label: Delegația pentru relațiile cu Republica Cehă și cu Republica Slovacă @ro

Joint committee procedure - ENVI, ITRE and JURI
type: Concept
type: CorporateBodyClassification
created: 2026-01-31
deprecated: false
alternative label: Joint ENVI - ITRE - JURI
alternative label: Commissions conjointes ENVI - ITRE - JURI @fr
alternative label: ENVI, ITRE und JURI @de
broader: Joint parliamentary committees
definition: Joint committee procedure - ENVI ITRE and JURI.
in scheme: EP taxonomy on entities.
preferred label: Procédure avec commissions conjointes - ENVI, ITRE et JURI @fr
preferred label: Gemeinsames Ausschussverfahren - ENVI, ITRE und JURI @de

Joint committee procedure - JURI and AFCO
type: Concept
created: 2023-10-31
deprecated: false
alternative label: Joint JURI - AFCO
alternative label: JURI und AFCO @de
alternative label: Commissions conjointes JURI - AFCO @fr
broader: Joint parliamentary committees
definition: Joint committee procedure - JURI and AFCO.
in scheme: EP taxonomy on entities.
preferred label: Gemeinsames Ausschussverfahren - JURI und AFCO @de
preferred label: Procédure avec commissions conjointes - JURI et AFCO @fr

European Monitoring Centre for Drugs and Drug Addiction
type: Concept
created: 2023-10-31
deprecated: false
broader: Decentralised agency
definition: European Monitoring Centre for Drugs and Drug Addiction.
in scheme: EP taxonomy on entities.
preferred label: Европейски център за мониторинг на наркотици и наркомании @bg
preferred label: An Lárionad Faireacháin Eorpach um Dhrugaí agus Andúil i nDrugaí @ga
preferred label: A Kábítószer és a Kábítószerfüggőség Európai Megfigyelőközpontja @hu
preferred label: Europäische Beobachtungsstelle für Drogen und Drogensucht @de
preferred label: Iċ-Ċentru Ewropew għall-Monitoraġġ tad-Droga u d-Dipendenza fuq id-Droga @mt
preferred label: Evropski center za spremljanje drog in zasvojenosti z drogami @sl
preferred label: Ευρωπαϊκό Κέντρο Παρακολούθησης Ναρκωτικών και Τοξικομανίας @el
preferred label: Euroopan huumausaineiden ja niiden väärinkäytön seurantakeskus @fi
preferred label: Osservatorio europeo delle droghe e delle tossicodipendenze @it
preferred label: Det Europæiske Overvågningscenter for Narkotika og Narkotikamisbrug @da
preferred label: Euroopa Narkootikumide ja Narkomaania Seirekeskus @et
preferred label: Európske monitorovacie centrum pre drogy a drogovú závislosť @sk
preferred label: Observatorio Europeo de las Drogas y las Toxicomanías @es
preferred label: Europees Waarnemingscentrum voor drugs en drugsverslaving @nl
preferred label: Observatorul European pentru Droguri și Toxicomanie @ro
preferred label: Observatoire européen des drogues et des toxicomanies @fr
preferred label: Europski centar za praćenje droga i ovisnosti o drogama @hr
preferred label: Europejskie Centrum Monitorowania Narkotyków i Narkomanii @pl
preferred label: Europeiska centrumet för kontroll av narkotika och narkotikamissbruk @sv
preferred label: Europos narkotikų ir narkomanijos stebėsenos centras @lt
preferred label: Evropské monitorovací centrum pro drogy a drogovou závislost @cs
preferred label: Eiropas Narkotiku un narkomānijas uzraudzības centrs @lv
preferred label: Observatório Europeu da Droga e da Toxicodependência @pt

Joint committee procedure - ITRE and LIBE
type: Concept
type: CorporateBodyClassification
created: 2025-11-30
deprecated: false
alternative label: Joint ITRE - LIBE
alternative label: Commissions conjointes ITRE - LIBE @fr
alternative label: ITRE und LIBE @de
broader: Joint parliamentary committees
definition: Joint committee procedure - ITRE and LIBE.
in scheme: EP taxonomy on entities.
preferred label: Gemeinsames Ausschussverfahren - ITRE und LIBE @de
preferred label: Procédure avec commissions conjointes - ITRE et LIBE @fr

Delegation to the EU-Lithuania Joint Parliamentary Committee
type: Concept
created: 2023-10-31
deprecated: true
alternative label: ЕС-Литва @bg
alternative label: UE-Lituania @ro
alternative label: EU – Litva @hr
alternative label: EÚ-Litva @sk
alternative label: UE-Litwa @pl
alternative label: UE-Lituânia @pt
alternative label: ES-Lietuva @lt
alternative label: EU-Lithuania
alternative label: EL-Leedu @et
alternative label: EU-Liettua @fi
alternative label: UE-Litwanja @mt
alternative label: EU-Litouwen @nl
alternative label: EU-Litvánia @hu
alternative label: EU-Litauen @da
alternative label: AE-an Liotuáin @ga
alternative label: ΕΕ-Λιθουανία @el
alternative label: EU-Litva @cs
alternative label: UE-Lituanie @fr
broader: Delegation to Joint Parliamentary Committee
definition: Delegation to the EU-Lithuania Joint Parliamentary Committee.
in scheme: EP taxonomy on entities.
preferred label: Valtuuskunta EU:n ja Liettuan välisessä parlamentaarisessa sekavaliokunnassa @fi
preferred label: Delegacija priSkupnem parlamentarnem odboru EU-Litva @sl
preferred label: ES-Lietuvas Apvienotās parlamentārās komitejas delegācija @lv
preferred label: Delegacija ES-Lietuvos jungtiniame parlamentiniame komitete @lt
preferred label: Delegationen till den gemensamma parlamentarikerkommittén EU-Litauen @sv
preferred label: Delegatsioon parlamendi ELi-Leedu ühiskomisjonis @et
preferred label: Izaslanstvo u Zajedničkom parlamentarnom odboru EU-a i Litve @hr
preferred label: Delegace při smíšeném parlamentním výboru EU-Litva @cs
preferred label: Делегация в Съвместния парламентарен комитет ЕС-Литва @bg
preferred label: Αντιπροσωπεία στη Μικτή Κοινοβουλευτική Επιτροπή ΕΕ-Λιθουανίας @el
preferred label: Az EU-Litvánia Parlamenti Vegyes Bizottságba delegált küldöttség @hu
preferred label: Delegationen til Det Blandede Parlamentariske Udvalg EU-Litauen @da
preferred label: Delegazzjoni lejn il-Kumitat Parlamentari Maghqud UE-Litwanja @mt
preferred label: Delegation im gemischten parlamentarischen Ausschuss EU-Litauen @de
preferred label: Toscaireacht chun an Chomhchoiste Pharlaimintigh den AE-an Liotuáin @ga
preferred label: Delegácia pri Spoločnom parlamentnom výbore EÚ-Litva @sk
preferred label: Délégation à la commission parlementaire mixte UE-Lituanie @fr
preferred label: Delegatie in de Gemengde Parlementaire Commissie EU-Litouwen @nl
preferred label: Delegația la Comisia parlamentară mixtă UE-Lituania @ro
preferred label: Delegacja do wspólnej komisji parlamentarnej UE-Litwa @pl
preferred label: Delegazione alla commissione parlamentare mista UE-Lituania @it
preferred label: Delegación en la Comisión Parlamentaria Mixta UE-Lituania @es
preferred label: Delegação à Comissão Parlamentar Mista UE-Lituânia @pt

Delegation to the Africa-EU Parliamentary Assembly
type: Concept
created: 2023-12-31
deprecated: false
alternative label: Afrikos ir ES @lt
alternative label: Afrika–EU @hu
alternative label: Africa-EU
alternative label: Aafrika ja ELi @et
alternative label: África-UE @pt
alternative label: Африка – ЕС @bg
alternative label: Afrika-UE @mt
alternative label: Africa-UE @it
alternative label: Afrika-EU @da
alternative label: AE-an Afraic @ga
alternative label: Αφρική-ΕΕ @el
alternative label: Afrique-UE @fr
alternative label: Afrika – EÚ @sk
alternative label: Āfrikas un ES @lv
alternative label: Afrikan ja EU @fi
alternative label: Afryka–UE @pl
broader: Temporary parliamentary legislative committee
definition: Delegation to the Africa-EU Parliamentary Assembly.
in scheme: EP taxonomy on entities.
preferred label: Delegation in der Parlamentarischen Versammlung Afrika-EU @de
preferred label: Delegazzjoni għall-Assemblea Parlamentari Afrika-UE @mt
preferred label: Delegacija pri Parlamentarni skupščini Afrika-EU @sl
preferred label: Delegatie in de Parlementaire Vergadering Afrika-EU @nl
preferred label: Delegația la Adunarea Parlamentară Africa-UE @ro
preferred label: az Afrika–EU Parlamenti Közgyűlésbe delegált küldöttség @hu
preferred label: Delegacja do Zgromadzenia Parlamentarnego Afryka–UE @pl
preferred label: Izaslanstvo u Parlamentarnoj skupštini Afrika-EU @hr
preferred label: Délégation à l'Assemblée parlementaire Afrique-UE @fr
preferred label: Toscaireacht chuig Tionól Parlaiminteach AE-an Afraic @ga
preferred label: Valtuuskunta Afrikan ja EU:n parlamentaarisessa edustajakokouksessa @fi
preferred label: Delegacija Afrikos ir ES parlamentinėje asamblėjoje @lt
preferred label: Delegationen till den parlamentariska församlingen Afrika–EU @sv
preferred label: Delegação à Assembleia Parlamentar África-UE @pt
preferred label: Delegación en la Asamblea Parlamentaria África-UE @es
preferred label: Delegācija Āfrikas un ES Parlamentārajā asamblejā @lv
preferred label: Делегация в Парламентарната асамблея Африка – ЕС @bg
preferred label: Delegácia pri Parlamentnom zhromaždení Afrika – EÚ @sk
preferred label: Αντιπροσωπεία στην Κοινοβουλευτική Συνέλευση Αφρικής-ΕΕ @el
preferred label: Delegace v Parlamentním shromáždění Afrika–EU @cs
preferred label: Delegazione all'Assemblea parlamentare Africa-UE @it
preferred label: Delegatsioon Aafrika ja ELi parlamentaarses assamblees @et
preferred label: Delegationen til Den Parlamentariske Forsamling Afrika-EU @da

Subcommittee on Tax Matters
type: Concept
created: 2023-10-31
deprecated: false
alternative label: Asuntos fiscales @es
alternative label: Daňové záležitosti @cs
alternative label: Veroasiat @fi
alternative label: Nodokļu jautājumi @lv
alternative label: Porezna pitanja @hr
alternative label: Assuntos Fiscais @pt
alternative label: Данъчни въпроси @bg
alternative label: Affaires fiscales @fr
alternative label: Tax Matters
alternative label: Φορολογικά θέματα @el
alternative label: Skatteanliggender @da
alternative label: Maksuküsimused @et
alternative label: Davčne zadeve @sl
alternative label: Questioni fiscali @it
alternative label: Mokesčiai @lt
alternative label: Kwistjonijiet Fiskali @mt
alternative label: Daňové otázky @sk
alternative label: Adóügyek @hu
alternative label: Belastingaangelegenheden @nl
alternative label: Chestiuni fiscale @ro
alternative label: Cúrsaí Cánach @ga
alternative label: Steuerfragen @de
alternative label: Skattefrågor @sv
alternative label: Sprawy Podatkowe @pl
broader: COMMITTEE PARLIAMENTARY ECON
broader: European parliamentary subcommittee
definition: European parliamentary subcommittee on tax matters.
in scheme: EP taxonomy on entities.
preferred label: Podvýbor pre daňové otázky @sk
preferred label: Sottokumitat għall-Kwistjonijiet Fiskali @mt
preferred label: Podkomisja do Spraw Podatkowych @pl
preferred label: Podvýbor pro daňové záležitosti @cs
preferred label: Veroasioita käsittelevä alivaliokunta @fi
preferred label: Subcomisia pentru chestiuni fiscale @ro
preferred label: Underudvalget om Skatteanliggender @da
preferred label: Maksuküsimuste allkomisjon @et
preferred label: Sous-commission des affaires fiscales @fr
preferred label: Pododbor za davčne zadeve @sl
preferred label: An Fochoiste um Chúrsaí Cánach @ga
preferred label: Sottocommissione per le questioni fiscali @it
preferred label: Adóügyi Albizottság @hu
preferred label: Unterausschuss für Steuerfragen @de
preferred label: Υποεπιτροπή Φορολογικών Θεμάτων @el
preferred label: Subcomissão dos Assuntos Fiscais @pt
preferred label: Subcomisión de Asuntos Fiscales @es
preferred label: Подкомисия по данъчните въпроси @bg
preferred label: Underutskottet för skattefrågor @sv
preferred label: Nodokļu jautājumu apakškomiteja @lv
preferred label: Mokesčių pakomitetis @lt
preferred label: Pododbor za porezna pitanja @hr
preferred label: Subcommissie belastingaangelegenheden @nl

Joint committee procedure - ECON, ENVI and JURI
type: Concept
created: 2025-09-30
deprecated: false
alternative label: Commissions conjointes ECON - ENVI - JURI @fr
alternative label: ECON, ENVI und JURI @de
alternative label: Joint ECON - ENVI - JURI
broader: Joint parliamentary committees
definition: Joint committee procedure - ECON, ENVI and JURI.
in scheme: EP taxonomy on entities.
preferred label: Gemeinsames Ausschussverfahren - ECON, ENVI und JURI @de
preferred label: Procédure avec commissions conjointes - ECON, ENVI et JURI @fr

European Data Protection Supervisor
type: Concept
created: 2023-10-31
deprecated: false
broader: EU body
definition: EU service ensuring that EU institutions and bodies protect personal information when processing data.
in scheme: EP taxonomy on entities.
preferred label: Euroopa andmekaitseinspektor @et
preferred label: Europese Toezichthouder voor gegevensbescherming @nl
preferred label: El Supervisor Europeo de Protección de Datos @es
preferred label: Europejski inspektor ochrony danych @pl
preferred label: Autoridade Europeia para a protecção de dados @pt
preferred label: Európsky dozorný úradník pre ochranu udajov @sk
preferred label: An Maoirseoir Eorpach ar Chosaint Sonraí @ga
preferred label: Eυρωπαίος Επόπτης Προστασίας Δεδομένων @el
preferred label: Euroopan tietosuojavaltuutettu @fi
preferred label: Der Europäische Datenschutzbeauftragte @de
preferred label: Contrôleur européen de la protection des données @fr
preferred label: Az Európai Adatvédelmi Biztos @hu
preferred label: Garante europeo della protezione dei dati @it
preferred label: Eiropas datu aizsardzibas uzraudzitajs @lv
preferred label: Kontrollur Ewropew ghall-Protezzjoni tad-Data @mt
preferred label: Evropský inspektor ochrany údaj u @cs
preferred label: Europæisk tilsynsførende for databeskyttelse @da
preferred label: Evropski nadzornik za varstvo podatkov @sl
preferred label: Europeiska datatillsynsmannen @sv
preferred label: Europski nadzornik zaštite podataka @hr
preferred label: Europos duomen u apsaugos prieži u ros pareig u nas @lt

Delegation to the EU-Finland Joint Parliamentary Committee
type: Concept
created: 2023-10-31
deprecated: true
alternative label: UE-Finlanda @ro
alternative label: EU-Finland
alternative label: ΕΕ-Φινλανδία @el
alternative label: EU-Finnország @hu
alternative label: EU-Finsko @cs
alternative label: EU-Finnland @de
alternative label: EU – Finska @hr
alternative label: ЕС-Финландия @bg
alternative label: EU-Finska @sl
alternative label: UE – Finlandja @mt
alternative label: EÚ-Fínsko @sk
alternative label: EU-Suomi @fi
alternative label: ES-Somija @lv
alternative label: AE-an Fhionlainn @ga
alternative label: UE-Finlandia @it
alternative label: UE-Finlande @fr
alternative label: EL-Soome @et
alternative label: ES-Suomija @lt
alternative label: UE-Finlândia @pt
broader: Delegation to Joint Parliamentary Committee
definition: Delegation to the EU-Finland Joint Parliamentary Committee.
in scheme: EP taxonomy on entities.
preferred label: Делегация в Съвместния парламентарен комитет ЕС-Финландия @bg
preferred label: Valtuuskunta EU:n ja Suomen välisessä parlamentaarisessa @fi
preferred label: Izaslanstvo u Zajedničkom parlamentarnom odboru EU-a i Finske @hr
preferred label: Toscaireacht chun an Chomhchoiste Pharlaimintigh den AE-an Fhionlainn @ga
preferred label: Delegația la Comisia parlamentară mixtă UE-Finlanda @ro
preferred label: Delegação à Comissão Parlamentar Mista UE-Finlândia @pt
preferred label: Delegacija ES-Somijas kopigai parlamentarajai komisijai @lv
preferred label: Delegation im Gemischten Parlamentarischen Ausschuß EU-Finnland @de
preferred label: Delegazzjoni lejn il-Kumitat Parlamentari Maghqud KE-Finlandja @mt
preferred label: Delegatsioon EL-Soome parlamentaarses ühiskomitees @et
preferred label: Delegace při smíšeném parlamentním výboru EU-Finsko @cs
preferred label: Az EU-Finnország Interparlamentáris Bizottsághoz delegáltak @hu
preferred label: Delegacija i ES-Suomijos Jungtini parlamentini komiteta @lt
preferred label: Delegationen till det blandade parlamentariska utskottet EU-Finland @sv
preferred label: Delegacja do Wspólnej Komisji Parlamentarnej UE-Finlandia @pl
preferred label: Αντιπροσωπεία στη Μικτή Κοινοβουλευτική Επιτροπή ΕΕ-Φινλανδίας @el
preferred label: Delegación en la Comisión parlamentaria mixta UE-Finlandia @es
preferred label: Delegatie in de Gemengde Parlamentaire Commissie EU-Finland @nl
preferred label: Delegacija skupnega parlamentarnega odbora EU in Finske @sl
preferred label: Delegazione alla Commissione parlamentare mista UE-Finlandia @it
preferred label: Delegation til Det Blandede Parlamentariske Udvalg EU-Finland @da
preferred label: Delegácia pre Spolocný parlamentný výbor EÚ-Fínsko @sk
preferred label: Délégation à la Commission parlementaire mixte UE-Finlande @fr

Special committee on the European Democracy Shield
type: Concept
created: 2025-01-31
deprecated: false
alternative label: Ευρωπαϊκή Ασπίδα Δημοκρατίας @el
alternative label: Euroopa demokraatia kaitse @et
alternative label: Eurooppalainen demokratian kilpi @fi
alternative label: Europäischer Schutzschild für die Demokratie @de
alternative label: Scudo europeo per la democrazia @it
alternative label: Европейски щит за демокрацията @bg
alternative label: Europski štit za zaštitu demokracije @hr
alternative label: Europeiska demokratiförsvaret @sv
alternative label: Evropski ščit za demokracijo @sl
alternative label: An Sciath Eorpach don Daonlathas @ga
alternative label: European Democracy Shield
alternative label: Bouclier européen de la démocratie @fr
alternative label: Tarka Ewropea għad-Demokrazija @mt
alternative label: Europos demokratijos skydas @lt
alternative label: Scutul democrației europene @ro
alternative label: Det Europæiske Demokratiskjold @da
alternative label: Europejska Tarcza Demokracji @pl
alternative label: Európai demokráciapajzs @hu
alternative label: Escudo Europeo de la Democracia @es
alternative label: Eiropas demokrātijas vairogs @lv
alternative label: Europees schild voor de democratie @nl
alternative label: Evropský štít pro demokracii @cs
alternative label: Európsky štít na obranu demokracie @sk
alternative label: Escudo Europeu da Democracia @pt
broader: Special parliamentary committee
definition: Special committee on the European Democracy Shield.
in scheme: EP taxonomy on entities.
preferred label: Sonderausschuss für den Europäischen Schutzschild für die Demokratie @de
preferred label: Comissão Especial sobre o Escudo Europeu da Democracia @pt
preferred label: Komisja Specjalna ds. Europejskiej Tarczy Demokracji @pl
preferred label: Posebni odbor za evropski ščit za demokracijo @sl
preferred label: Ειδική Επιτροπή για την Ευρωπαϊκή Ασπίδα Δημοκρατίας @el
preferred label: Az európai demokráciapajzzsal foglalkozó különbizottság @hu
preferred label: Comisión Especial sobre el Escudo Europeo de la Democracia @es
preferred label: Специална комисия относно европейския щит за демокрацията @bg
preferred label: Eurooppalaista demokratian kilpeä käsittelevä erityisvaliokunta @fi
preferred label: Commissione speciale sullo scudo europeo per la democrazia @it
preferred label: Zvláštní výbor pro Evropský štít pro demokracii @cs
preferred label: Euroopa demokraatia kaitse erikomisjon @et
preferred label: Det Særlige Udvalg om Det Europæiske Demokratiskjold @da
preferred label: Specialusis komitetas Europos demokratijos skydo klausimais @lt
preferred label: Commission spéciale sur le bouclier européen de la démocratie @fr
preferred label: An Coiste Speisialta um an Sciath Eorpach don Daonlathas @ga
preferred label: Bijzondere Commissie inzake het Europees schild voor de democratie @nl
preferred label: Īpašā komiteja attiecībā uz Eiropas demokrātijas vairogu @lv
preferred label: Särskilda utskottet för det europeiska demokratiförsvaret @sv
preferred label: Osobitný výbor pre európsky štít na obranu demokracie @sk
preferred label: Comisia specială pentru Scutul democrației europene @ro
preferred label: Kumitat Speċjali dwar it-Tarka Ewropea għad-Demokrazija @mt
preferred label: Posebni odbor za europski štit za zaštitu demokracije @hr

Polish Senate
type: Concept
created: 2023-10-31
deprecated: false
broader: National chamber
definition: Polish Senate.
in scheme: EP taxonomy on entities.
preferred label: Polijas Senāts @lv
preferred label: det polske Senat @da
preferred label: Poola Senat @et
preferred label: Puolan senaatti @fi
preferred label: Senato polacco @it
preferred label: polnischer Senat @de
preferred label: Den polska senaten @sv
preferred label: Сенат на Република Полша @bg
preferred label: polský Senát @cs
preferred label: Sénat polonais @fr
preferred label: Senat Pollakk @mt
preferred label: Senat RP @pl
preferred label: Poolse Senaat @nl
preferred label: poľský Senát @sk
preferred label: Seanad na Polainne @ga
preferred label: Lenkijos Respublikos Senatas @lt
preferred label: lengyel szenátus @hu
preferred label: Senado polaco @es
preferred label: poljski Senat @hr
preferred label: Πολωνική Γερουσία @el
preferred label: Senatul Poloniei @ro
preferred label: poljski senat @sl

European political group
type: Concept
type: CorporateBodyClassification
created: 2023-10-31
deprecated: false
definition: European political group.
in scheme: EP taxonomy on entities.
preferred label: Eiropas politiskā grupa @lv
preferred label: Grupo político europeo @es
preferred label: Grúpa polaitiúil Eorpach @ga
preferred label: Gruppo politico europeo @it
preferred label: Euroopa fraktsioon @et
preferred label: Europæisk politisk gruppe @da
preferred label: Groupe politique européen @fr
preferred label: Evropska politična skupina @sl
preferred label: Európai képviselőcsoport @hu
preferred label: Grupo político europeu @pt
preferred label: Ευρωπαϊκή πολιτική ομάδα @el
preferred label: Europäische Fraktion @de
preferred label: Europejska grupa polityczna @pl
preferred label: Europese fractie @nl
preferred label: Grupp politiku Ewropew @mt
preferred label: Grupul politic european @ro
preferred label: Európska politická skupina @sk
preferred label: Europski klub zastupnika @hr
preferred label: Euroopan tason poliittinen ryhmä @fi
preferred label: Europeiska politiska gruppen @sv
preferred label: Europos politinė frakcija @lt
preferred label: Европейска политическа група @bg
preferred label: Evropská politická skupina @cs
top concept of: EP taxonomy on entities.

Authority for European Political Parties and European Political Foundations
type: Concept
created: 2023-10-31
deprecated: false
broader: European Union corporate body
definition: Authority for European Political Parties and European Political Foundations.
in scheme: EP taxonomy on entities.
preferred label: Tijelo za europske političke stranke i europske političke zaklade @hr
preferred label: Autorité pour les partis politiques européens et les fondations politiques européennes @fr
preferred label: Autorità per i partiti politici europei e le fondazioni politiche europee @it
preferred label: Eiropas politisko partiju un Eiropas politisko fondu iestāde @lv
preferred label: Behörde für europäische politische Parteien und europäische politische Stiftungen @de
preferred label: Euroopa Tasandi Erakondade ja Euroopa Tasandi Poliitiliste Sihtasutuste Amet @et
preferred label: Organ za evropske politične stranke in evropske politične fundacije @sl
preferred label: Urząd ds. Europejskich Partii Politycznych i Europejskich Fundacji Politycznych @pl
preferred label: Myndigheten för europeiska politiska partier och europeiska politiska stiftelser @sv
preferred label: Autoritatea pentru Partidele Politice Europene și Fundațiile Politice Europene @ro
preferred label: Орган за европейските политически партии и европейските политически фондации @bg
preferred label: Autoridad para los Partidos Políticos Europeos y las Fundaciones Políticas Europeas @es
preferred label: Myndigheden for Europæiske Politiske Partier og Europæiske Politiske Fonde @da
preferred label: Europos politinių partijų ir Europos politinių fondų institucija @lt
preferred label: Autoridade para os Partidos Políticos Europeus e as Fundações Políticas Europeias @pt
preferred label: Αρχή για τα Ευρωπαϊκά Πολιτικά Κόμματα και τα Ευρωπαϊκά Πολιτικά Ιδρύματα @el
preferred label: Európai Politikai Pártok és Európai Politikai Alapítványok Hatósága @hu
preferred label: Autoriteit voor Europese politieke partijen en Europese politieke stichtingen @nl
preferred label: An tÚdarás um Páirtithe Polaitiúla Eorpacha agus um Fhondúireachtaí Polaitiúla Eorpacha @ga
preferred label: Úřad pro evropské politické strany a evropské politické nadace @cs
preferred label: Euroopan tason poliittisista puolueista ja Euroopan tason poliittisista säätiöistä vastaava viranomainen @fi
preferred label: L-Awtorità għall-Partiti Politiċi Ewropej u l-Fondazzjonijiet Politiċi Ewropej @mt
preferred label: Úrad pre európske politické strany a európske politické nadácie @sk

Joint committee procedure - LIBE and FEMM
type: Concept
created: 2023-10-31
deprecated: false
alternative label: Commissions conjointes LIBE - FEMM @fr
alternative label: LIBE und FEMM @de
alternative label: Joint LIBE - FEMM
broader: Joint parliamentary committees
definition: Joint committee procedure - LIBE and FEMM.
in scheme: EP taxonomy on entities.
preferred label: Procédure avec commissions conjointes - LIBE et FEMM @fr
preferred label: Gemeinsames Ausschussverfahren - LIBE und FEMM @de

Delegation for relations with the countries of Central America
type: Concept
created: 2023-10-31
deprecated: false
alternative label: Stredná Amerika @sk
alternative label: Kesk-Ameerika riigid @et
alternative label: Ameryka Środkowa @pl
alternative label: Centrālamerika @lv
alternative label: América Central @es
alternative label: America centrale @it
alternative label: Amerika Ċentrali @mt
alternative label: Keski-Amerikka @fi
alternative label: Srednja Amerika @sl
alternative label: Mellemamerika @da
alternative label: Meiriceá Láir @ga
alternative label: Közép-Amerika @hu
alternative label: Central America
alternative label: Mittelamerika @de
alternative label: Κεντρική Αμερική @el
alternative label: Centralamerika @sv
alternative label: Amérique centrale @fr
alternative label: Midden-Amerika @nl
alternative label: Centrinė Amerika @lt
alternative label: Střední Amerika @cs
alternative label: Централна Америка @bg
alternative label: America Centrală @ro
broader: Parliamentary delegation
definition: Delegation for relations with the countries of Central America.
in scheme: EP taxonomy on entities.
preferred label: A Közép-Amerika országaival fenntartott kapcsolatokért felelős küldöttség @hu
preferred label: Suhteista Keski-Amerikan maihin vastaava valtuuskunta @fi
preferred label: Delegationen for Forbindelserne med Landene i Mellemamerika @da
preferred label: Delegation für die Beziehungen zu den Ländern Mittelamerikas @de
preferred label: Delegace pro vztahy se zeměmi Střední Ameriky @cs
preferred label: Izaslanstvo za odnose s državama Srednje Amerike @hr
preferred label: Delegação para as Relações com os Países da América Central @pt
preferred label: Délégation pour les relations avec les pays d'Amérique centrale @fr
preferred label: Delegación para las Relaciones con los Países de la América Central @es
preferred label: Delegacija ryšiams su Centrinės Amerikos šalimis @lt
preferred label: Delegatsioon Kesk-Ameerika riikidega suhtlemiseks @et
preferred label: Delegazzjoni għar-relazzjonijiet mal-pajjiżi tal-Amerika Ċentrali @mt
preferred label: Delegatie voor de betrekkingen met de landen in Midden-Amerika @nl
preferred label: Αντιπροσωπεία για τις σχέσεις με τις χώρες της Κεντρικής Αμερικής @el
preferred label: Delegácia pre vzťahy s krajinami Strednej Ameriky @sk
preferred label: Delegația pentru relațiile cu țările din America Centrală @ro
preferred label: Делегация за връзки с държавите от Централна Америка @bg
preferred label: An Toscaireacht don chaidreamh le tíortha Mheiriceá Láir @ga
preferred label: Delegationen för förbindelserna med länderna i Centralamerika @sv
preferred label: Delegazione per le relazioni con i paesi dell'America centrale @it
preferred label: Delegacija za odnose z državami Srednje Amerike @sl
preferred label: Delegācija attiecībām ar Centrālamerikas valstīm @lv
preferred label: Delegacja do spraw stosunków z państwami Ameryki Środkowej @pl

Cypriot Parliament
type: Concept
created: 2023-10-31
deprecated: false
broader: National chamber
definition: Cypriot Parliament.
in scheme: EP taxonomy on entities.
preferred label: Kyproksen parlamentti @fi
preferred label: Parlamento cipriota @it
preferred label: Cypriotisch parlement @nl
preferred label: ciparski Zastupnički dom @hr
preferred label: Küprose Esindajatekoda @et
preferred label: Parlement chypriote @fr
preferred label: Parlamentul Ciprului @ro
preferred label: Κυπριακή Βουλή των Αντιπροσώπων @el
preferred label: Камара на представителите на Република Кипър @bg
preferred label: det cypriotiske Repræsentanternes Hus @da
preferred label: zyprisches Parlament @de
preferred label: ciprusi képviselőház @hu
preferred label: Kipro Respublikos Atstovų Taryba @lt
preferred label: ciprska poslanska zbornica @sl
preferred label: Parlament Ċiprijott @mt
preferred label: kyperská Sněmovna reprezentantů @cs
preferred label: Kipras parlaments @lv
preferred label: Parlaimint na Cipire @ga
preferred label: Cámara de Representantes chipriota @es
preferred label: cyperský parlament @sk
preferred label: parlament Cypru @pl
preferred label: Det cypriotiska parlamentet @sv

Joint committee procedure - ENVI and ITRE
type: Concept
created: 2023-10-31
deprecated: false
alternative label: ENVI und ITRE @de
alternative label: Commissions conjointes ENVI - ITRE @fr
alternative label: Joint ENVI - ITRE
broader: Joint parliamentary committees
definition: Joint committee procedure - ENVI and ITRE.
in scheme: EP taxonomy on entities.
preferred label: Procédure avec commissions conjointes - ENVI et ITRE @fr
preferred label: Gemeinsames Ausschussverfahren - ENVI und ITRE @de

Court of Justice
type: Concept
created: 2023-10-31
deprecated: false
broader: EU institution
definition: European Court of Justice.
in scheme: EP taxonomy on entities.
preferred label: Súdny dvor @sk
preferred label: Bíróság @hu
preferred label: Teisingumo Teismas @lt
preferred label: Sodišče @sl
preferred label: Tiesa @lv
preferred label: An Chúirt Bhreithiúnais @ga
preferred label: Trybunał Sprawiedliwości @pl
preferred label: Το Δικαστήριο @el
preferred label: Cour de justice @fr
preferred label: Euroopa Ühenduste Kohus @et
preferred label: Yhteisön tuomioistuin @fi
preferred label: Curtea de justiție @ro
preferred label: Europeiska gemenskapernas domstol @sv
preferred label: Tribunal de Justiça @pt
preferred label: Qorti tal-Ġustizzja @mt
preferred label: Soudní dvůr @cs
preferred label: Съд на Европейската общност @bg
preferred label: Corte di giustizia @it
preferred label: Europäischer Gerichtshof @de
preferred label: Het Hof van Justitie @nl
preferred label: Domstolen @da
preferred label: Tribunal de Justicia @es
preferred label: Sud Europske unije @hr

Delegation to the EU-Russia Parliamentary Cooperation Committee
type: Concept
created: 2023-10-31
deprecated: true
alternative label: EU-Rusko @cs
alternative label: EÚ-Rusko @sk
alternative label: EU-Rusija @sl
alternative label: UE-Russie @fr
alternative label: UE-Russia @it
alternative label: EL-Venemaa @et
alternative label: Ρωσία @el
alternative label: ЕС-Русия @bg
alternative label: EU-Rußland @de
alternative label: UE-Rusia @ro
alternative label: EU-Venäjä @fi
alternative label: ES-Krievija @lv
alternative label: UE-Rússia @pt
alternative label: EU-Oroszország @hu
alternative label: UE-Rosja @pl
alternative label: EU-Ryssland @sv
alternative label: EU-Russia
alternative label: AE-an Rúis @ga
alternative label: EU – Rusija @hr
alternative label: EU-Rusland @da
alternative label: ES-Rusija @lt
alternative label: UE-Russja @mt
broader: Parliamentary delegation
definition: Delegation to the EU-Russia Parliamentary Cooperation Committee.
in scheme: EP taxonomy on entities.
preferred label: Delegação à Comissão Parlamentar de Cooperação UE-Rússia @pt
preferred label: Toscaireacht chun an Choiste um Chomhar Parlaiminteach den AE agus den Rúis @ga
preferred label: Delegacija i ES-Rusijos parlamentini bendradarbiavimo komiteta @lt
preferred label: Αντιπροσωπία στην κοινοβουλευτική επιτροπή συνεργασίας ΕΕ-Ρωσίας @el
preferred label: Delegationen til Det Parlamentariske Samarbejdsudvalg EU-Rusland @da
preferred label: Делегация в Комитета за парламентарно сътрудничество ЕС-Русия @bg
preferred label: Delegación en la Comisión Parlamentaria de Cooperación UE-Rusia @es
preferred label: Delegatsioon EL-Venemaa parlamentaarses koostöökomitees @et
preferred label: Delegația la Comisia parlamentară de cooperare UE-Rusia @ro
preferred label: Délégation à la commission parlementaire de coopération UE-Russie @fr
preferred label: Delegationen till den parlamentariska samarbetskommittén EU-Ryssland @sv
preferred label: Delegacja do Komisji Wspólpracy Parlamentarnej UE-Rosja @pl
preferred label: Delegatie in de parlementaire samenwerkingscommissie EU-Rusland @nl
preferred label: Izaslanstvo u Odboru za parlamentarnu suradnju EU-a i Rusije @hr
preferred label: Delegazzjoni lejn il-Kumitat Parlamentari Maghqud UE-Russja @mt
preferred label: Delegacija odbora za parlamentarno sodelovanje med EU in Rusijo @sl
preferred label: Delegacija ES-Krievijas parlamentaras sadarbibas komisijai @lv
preferred label: Delegace při Výboru pro parlamentní spolupráci EU-Rusko @cs
preferred label: Delegazione alla commissione parlamentare di cooperazione UE-Russia @it
preferred label: Valtuuskunta EU:n ja Venäjän välisessä parlamentaarisessa yhteistyövaliokunnassa @fi
preferred label: Delegácia pre Parlamentný kooperacný výbor EÚ-Rusko @sk
preferred label: Az EU-Oroszország Parlamenti Kooperációs Bizottsághoz delegáltak @hu
preferred label: Delegation im Parlamentarischen Ausschuß für die Zusammenarbeit EU-Rußland @de

French National Assembly
type: Concept
created: 2023-10-31
deprecated: false
broader: National chamber
definition: French National Assembly.
in scheme: EP taxonomy on entities.
preferred label: Γαλλική Εθνοσυνέλευση @el
preferred label: Den franska nationalförsamlingen @sv
preferred label: Zgromadzenie Narodowe Francji @pl
preferred label: francouzské Národní shromáždění @cs
preferred label: francoska narodna skupščina @sl
preferred label: französische Nationalversammlung @de
preferred label: francia nemzetgyűlés @hu
preferred label: Tionól Náisiúnta na Fraince @ga
preferred label: francuska Nacionalna skupština @hr
preferred label: francúzske Národné zhromaždenie @sk
preferred label: Asamblea Nacional francesa @es
preferred label: Prancūzijos Respublikos Nacionalinė Asamblėja @lt
preferred label: Assemblée nationale française @fr
preferred label: Prantsusmaa Rahvuskogu @et
preferred label: Francijas parlamenta Nacionālā asambleja @lv
preferred label: Assembleia Nacional francesa @pt
preferred label: Adunarea Națională din Franța @ro
preferred label: Assemblea Nazzjonali Franċiża @mt
preferred label: Ranskan kansalliskokous @fi
preferred label: den franske Nationalforsamling @da
preferred label: Национално събрание на Френската република @bg
preferred label: Assemblea nazionale francese @it
preferred label: Franse Nationale Vergadering @nl

Non-attached Members
type: Concept
created: 2023-10-31
deprecated: false
preferred label: Sitoutumattomat @fi
preferred label: Non iscritti @it
alternative label: független képviselő @hu
preferred label: No inscritos @es
preferred label: Fraktsioonilise kuuluvuseta parlamendiliikmed @et
preferred label: Niet-fractiegebonden leden @nl
preferred label: Grupplösa @sv
preferred label: Fraktionslos @de
preferred label: Nezavisni zastupnici @hr
preferred label: Non-inscrits @fr
preferred label: Nepriklausomi nariai @lt
preferred label: Независими членове @bg
preferred label: Feisirí Neamhcheangailte @ga
preferred label: Samostojni poslanci @sl
preferred label: Não Inscritos @pt
preferred label: Deputați neafiliați @ro
preferred label: Μη Εγγεγραμμένοι @el
preferred label: Løsgængere @da
preferred label: Membri mhux affiljati @mt
preferred label: Niezrzeszeni @pl
preferred label: Pie politiskajām grupām nepiederošie deputāti @lv
preferred label: Nezařazení poslanci @cs
preferred label: Nezaradení poslanci @sk
broader: POLITICAL GROUP
definition: Non-attached Members to a European political group.
in scheme: EP taxonomy on entities.
preferred label: független képviselők @hu

Committee on the Internal Market and Consumer Protection
type: Concept
created: 2023-10-31
deprecated: false
alternative label: Sisämarkkinat ja kuluttajansuoja @fi
alternative label: Mercado Interior y Protección del Consumidor @es
alternative label: Piața internă și protecția consumatorilor @ro
alternative label: Vnútorný trh a ochrana spotrebiteľa @sk
alternative label: Internal Market and Consumer Protection
alternative label: Mercato interno e protezione dei consumatori @it
alternative label: Indre Marked og Forbrugerbeskyttelse @da
alternative label: Rynek Wewnętrzny i Ochrona Konsumentów @pl
alternative label: Margadh Inmheánach agus Cosaint an Tomhaltóra @ga
alternative label: Unutarnje tržište i zaštita potrošača @hr
alternative label: Εσωτερική Αγορά και Προστασία των Καταναλωτών @el
alternative label: Mercado Interno e Proteção dos Consumidores @pt
alternative label: Marché intérieur et protection des consommateurs @fr
alternative label: Binnenmarkt und Verbraucherschutz @de
alternative label: Inre marknaden och konsumentskydd @sv
alternative label: Iekšējais tirgus un patērētāju aizsardzība @lv
alternative label: Vnitřní trh a ochrana spotřebitelů @cs
alternative label: Vidaus rinka ir vartotojų apsauga @lt
alternative label: Belső piac és fogyasztóvédelem @hu
alternative label: Siseturg ja tarbijakaitse @et
alternative label: Interne markt en consumentenbescherming @nl
alternative label: Вътрешен пазар и защита на потребителите @bg
alternative label: Notranji trg in varstvo potrošnikov @sl
alternative label: Suq Intern u Ħarsien tal-Konsumatur @mt
broader: Standing parliamentary committee
definition: European parliamentary committee on the internal market and consumer protection.
in scheme: EP taxonomy on entities.
preferred label: Комисия по вътрешния пазар и защита на потребителите @bg
preferred label: Commissione per il mercato interno e la protezione dei consumatori @it
preferred label: Výbor pro vnitřní trh a ochranu spotřebitelů @cs
preferred label: An Coiste um an Margadh Inmheánach agus um Chosaint an Tomhaltóra @ga
preferred label: Επιτροπή Εσωτερικής Αγοράς και Προστασίας των Καταναλωτών @el
preferred label: Utskottet för den inre marknaden och konsumentskydd @sv
preferred label: Odbor za notranji trg in varstvo potrošnikov @sl
preferred label: Ausschuss für Binnenmarkt und Verbraucherschutz @de
preferred label: Kumitat għas-Suq Intern u l-Ħarsien tal-Konsumatur @mt
preferred label: Siseturu- ja tarbijakaitsekomisjon @et
preferred label: Výbor pre vnútorný trh a ochranu spotrebiteľa @sk
preferred label: Belső Piaci és Fogyasztóvédelmi Bizottság @hu
preferred label: Comisia pentru piața internă și protecția consumatorilor @ro
preferred label: Sisämarkkina- ja kuluttajansuojavaliokunta @fi
preferred label: Vidaus rinkos ir vartotojų apsaugos komitetas @lt
preferred label: Iekšējā tirgus un patērētāju aizsardzības komiteja @lv
preferred label: Odbor za unutarnje tržište i zaštitu potrošača @hr
preferred label: Comisión de Mercado Interior y Protección del Consumidor @es
preferred label: Commissie interne markt en consumentenbescherming @nl
preferred label: Komisja Rynku Wewnętrznego i Ochrony Konsumentów @pl
preferred label: Comissão do Mercado Interno e da Proteção dos Consumidores @pt
preferred label: Udvalget om det Indre Marked og Forbrugerbeskyttelse @da
preferred label: Commission du marché intérieur et de la protection des consommateurs @fr

European Union
type: Concept
created: 2023-10-31
deprecated: false
definition: European Union
in scheme: EP taxonomy on entities.
preferred label: An tAontas Eorpach @ga
preferred label: Uniunea Europeană @ro
preferred label: Union européenne @fr
preferred label: Europska unija @hr
preferred label: Unia Europejska @pl
preferred label: União Europeia @pt
preferred label: Den Europæiske Union @da
preferred label: Európska únia @sk
preferred label: Evropská unie @cs
preferred label: L-Unjoni Ewropea @mt
preferred label: Euroopa Liit @et
preferred label: Evropska unija @sl
preferred label: Euroopan unioni @fi
preferred label: Európai Unió @hu
preferred label: Eiropas Savienība @lv
preferred label: Ευρωπαϊκή Ένωση @el
preferred label: Europese Unie @nl
preferred label: Европейски съюз @bg
preferred label: Unión Europea @es
preferred label: Europos Sąjunga @lt
preferred label: Europäische Union @de
preferred label: Unione europea @it
preferred label: Europeiska unionen @sv
top concept of: EP taxonomy on entities.

European Union Agency for the Space Programme
type: Concept
created: 2023-10-31
deprecated: false
broader: Decentralised agency
definition: European Union Agency for the Space Programme.
in scheme: EP taxonomy on entities.
preferred label: Euroopan unionin avaruusohjelmavirasto @fi
preferred label: Agentura Evropské unie pro Kosmický program @cs
preferred label: Aġenzija tal-Unjoni Ewropea għall-Programm Spazjali @mt
preferred label: Agence de l’Union européenne pour le programme spatial @fr
preferred label: Агенция на Европейския съюз за космическата програма @bg
preferred label: Az Európai Unió Űrprogramügynöksége @hu
preferred label: Agenția Uniunii Europene pentru Programul spațial @ro
preferred label: Agencija Evropske unije za vesoljski program @sl
preferred label: Euroopa Liidu Kosmoseprogrammi Amet @et
preferred label: Agencia de la Unión Europea para el Programa Espacial @es
preferred label: Agenzia dell’Unione europea per il programma spaziale @it
preferred label: Agentur der Europäischen Union für das Weltraumprogramm @de
preferred label: Agencja Unii Europejskiej ds. Programu Kosmicznego @pl
preferred label: Agência da União Europeia para o Programa Espacia @pt
preferred label: Gníomhaireacht an Aontais Eorpaigh um an gClár Spáis @ga
preferred label: Agentschap van de Europese Unie voor het ruimtevaartprogramma @nl
preferred label: Agencija Europske unije za svemirski program @hr
preferred label: Eiropas Savienības Kosmosa programmas aģentūra @lv
preferred label: Europeiska unionens rymdprogrambyrå @sv
preferred label: Den Europæiske Unions Agentur for Rumprogrammet @da
preferred label: Agentúra Európskej únie pre vesmírny program @sk
preferred label: Οργανισμός της Ευρωπαϊκής Ένωσης για το Διαστημικό Πρόγραμμα @el
preferred label: Europos Sąjungos kosmoso programos agentūra @lt

Joint committee procedure - EMPL and REGI
type: Concept
created: 2025-01-31
deprecated: false
alternative label: Commissions conjointes EMPL - REGI @fr
alternative label: EMPL und REGI @de
alternative label: Joint EMPL - REGI
broader: Joint parliamentary committees
definition: Joint committee procedure - EMPL and REGI.
in scheme: EP taxonomy on entities.
preferred label: Procédure avec commissions conjointes - EMPL et REGI @fr
preferred label: Gemeinsames Ausschussverfahren - EMPL und REGI @de

The Left group in the European Parliament - GUE/NGL
type: Concept
created: 2023-10-31
deprecated: false
alternative label: Vänstern - GUE/NGL @sv
alternative label: Kairieji - GUE/NGL @lt
alternative label: Stânga - GUE/NGL @ro
alternative label: Ix-Xellug - GUE/NGL @mt
alternative label: Η Αριστερά - GUE/NGL @el
alternative label: Ľavica - GUE/NGL @sk
alternative label: Kreisie - GUE/NGL @lv
alternative label: Vasemmisto - GUE/NGL @fi
alternative label: Lewica - GUE/NGL @pl
alternative label: La Gauche - GUE/NGL @fr
alternative label: Левица - GUE/NGL @bg
alternative label: Vasakpoolsed - GUE/NGL @et
alternative label: Ljevica - GUE/NGL @hr
alternative label: Levice - GUE/NGL @cs
alternative label: Linkse Fractie - GUE/NGL @nl
alternative label: A Esquerda - GUE/NGL @pt
alternative label: Venstrefløjen - GUE/NGL @da
alternative label: La Sinistra - GUE/NGL @it
alternative label: Baloldal - GUE/NGL @hu
alternative label: The Left - GUE/NGL
alternative label: La Izquierda - GUE/NGL @es
alternative label: Levica − GUE/NGL @sl
alternative label: Die Linke - GUE/NGL @de
alternative label: An Chlé - GUE/NGL @ga
broader: POLITICAL GROUP
definition: European political group of the left.
in scheme: EP taxonomy on entities.
preferred label: Il gruppo della Sinistra al Parlamento europeo - GUE/NGL @it
preferred label: Le groupe de la gauche au Parlement européen - GUE/NGL @fr
preferred label: Venstrefløjsgruppen i Europa-Parlamentet - GUE/NGL @da
preferred label: Euroopan parlamentin vasemmistoryhmä - GUE/NGL @fi
preferred label: Fraktion Die Linke im Europäischen Parlament - GUE/NGL @de
preferred label: Kreiso grupa Eiropas Parlamentā - GUE/NGL @lv
preferred label: Ομάδα της Αριστεράς στο Ευρωπαϊκό Κοινοβούλιο - GUE/NGL @el
preferred label: Grupul Stângii din Parlamentul European - GUE/NGL @ro
preferred label: Grupa Lewicy w Parlamencie Europejskim - GUE/NGL @pl
preferred label: Vänstergruppen i Europaparlamentet - GUE/NGL @sv
preferred label: Skupina Levice v Evropskem parlamentu − GUE/NGL @sl
preferred label: Klub zastupnika Ljevice u Europskom parlamentu - GUE/NGL @hr
preferred label: Euroopa Parlamendi Vasakpoolsete fraktsioon - GUE/NGL @et
preferred label: Levice v Evropském parlamentu - GUE/NGL @cs
preferred label: Baloldal az Európai Parlamentben képviselőcsoport - GUE/NGL @hu
preferred label: Grúpa na Clé i bParlaimint na hEorpa - GUE/NGL @ga
preferred label: Grupo da Esquerda no Parlamento Europeu - GUE/NGL @pt
preferred label: Skupina ľavice v Európskom parlamente - GUE/NGL @sk
preferred label: Grupp tax-Xellug fil-Parlament Ewropew - GUE/NGL @mt
preferred label: Група на левицата в Европейския парламент - GUE/NGL @bg
preferred label: Grupo de la Izquierda en el Parlamento Europeo - GUE/NGL @es
preferred label: Europos vieningųjų kairiųjų frakcija / Šiaurės šalių žalieji kairieji @lt

Czech Senate
type: Concept
created: 2023-10-31
deprecated: false
broader: National chamber
definition: Czech Senate.
in scheme: EP taxonomy on entities.
preferred label: Senat Ċek @mt
preferred label: Tsjechische Senaat @nl
preferred label: Sénat tchèque @fr
preferred label: Τσεχική Γερουσία @el
preferred label: cseh szenátus @hu
preferred label: Seanad na Seice @ga
preferred label: Senatul Cehiei @ro
preferred label: Senat Republiki Czeskiej @pl
preferred label: Senát Parlamentu České republiky @cs
preferred label: češki Senat @hr
preferred label: Čekijos Respublikos Senatas @lt
preferred label: Čehijas parlamenta Senāts @lv
preferred label: češki senat @sl
preferred label: det tjekkiske Senat @da
preferred label: Senado checo @es
preferred label: Den tjeckiska senaten @sv
preferred label: Сенат на Чешката република @bg
preferred label: tschechischer Senat @de
preferred label: Tšehhi Senat @et
preferred label: český Senát @sk
preferred label: Tšekin senaatti @fi
preferred label: Senato ceco @it

Delegation for relations with the Federative Republic of Brazil
type: Concept
created: 2023-10-31
deprecated: false
alternative label: Brazília @hu
alternative label: Brasilien @da
alternative label: Brazílie @cs
alternative label: Brazil
alternative label: Бразилия @bg
alternative label: Brazilia @ro
alternative label: Brazilië @nl
alternative label: Brasile @it
alternative label: Brazylia @pl
alternative label: Brazīlija @lv
alternative label: An Bhrasaíl @ga
alternative label: Brazilija @sl
alternative label: Brésil @fr
alternative label: Brasiilia @et
alternative label: Brasil @es
alternative label: Brasilia @fi
alternative label: Brażil @mt
alternative label: Βραζιλία @el
broader: Parliamentary delegation
definition: Delegation for relations with the Federative Republic of Brazil.
in scheme: EP taxonomy on entities.
preferred label: A Brazil Szövetségi Köztársasággal fenntartott kapcsolatokért felelős küldöttség @hu
preferred label: Delegace pro vztahy s Brazilskou federativní republikou @cs
preferred label: Delegacija ryšiams su Brazilijos Federacine Respublika @lt
preferred label: Délégation pour les relations avec la République fédérative du Brésil @fr
preferred label: Delegatsioon Brasiilia Liitvabariigiga suhtlemiseks @et
preferred label: Delegation für die Beziehungen zur Föderativen Republik Brasilien @de
preferred label: Izaslanstvo za odnose sa Saveznom Republikom Brazilom @hr
preferred label: Delegácia pre vzťahy s Brazílskou federatívnou republikou @sk
preferred label: Делегация за връзки с Федеративна република Бразилия @bg
preferred label: Delegācija attiecībām ar Brazīlijas Federatīvo Republiku @lv
preferred label: Delegationen för förbindelserna med Förbundsrepubliken Brasilien @sv
preferred label: Suhteista Brasilian liittotasavaltaan vastaava valtuuskunta @fi
preferred label: Αντιπροσωπεία για τις σχέσεις με την Ομοσπονδιακή Δημοκρατία της Βραζιλίας @el
preferred label: Delegația pentru relațile cu Republica Federativă a Braziliei @ro
preferred label: Delegationen for Forbindelserne med Den Føderative Republik Brasilien @da
preferred label: Delegación para las Relaciones conla República Federativa de Brasil @es
preferred label: Delegazzjoni għar-relazzjonijiet mar-Repubblika Federattiva tal-Brażil @mt
preferred label: Delegazione per le relazioni con la Repubblica federativa del Brasile @it
preferred label: Delegacja do spraw stosunków z Federacyjną Republiką Brazylii @pl
preferred label: Delegação para as relações com a República Federativa do Brasil @pt
preferred label: An Toscaireacht don chaidreamh le Poblacht Chónaidhmitheach na Brasaíle @ga
preferred label: Delegacija za odnose s Federativno republiko Brazilijo @sl
preferred label: Delegatie voor de betrekkingen met de Federale Republiek Brazilië @nl

Joint committee procedure - EMPL and CULT
type: Concept
created: 2023-10-31
deprecated: false
alternative label: Commissions conjointes EMPL - CULT @fr
alternative label: EMPL und CULT @de
alternative label: Joint EMPL - CULT
broader: Joint parliamentary committees
definition: Joint committee procedure - EMPL and CULT.
in scheme: EP taxonomy on entities.
preferred label: Procédure avec commissions conjointes - EMPL et CULT @fr
preferred label: Gemeinsames Ausschussverfahren - EMPL und CULT @de

Group of the Greens/European Free Alliance
type: Concept
created: 2023-10-31
deprecated: false
alternative label: Πράσινοι / Ευρωπαϊκή Ελεύθερη Συμμαχία @el
alternative label: I Verdi/Alleanza libera europea @it
alternative label: Die Grünen/Freie Europäische Allianz @de
alternative label: Les Verts/Alliance libre européenne @fr
alternative label: Žalieji/Europos laisvasis aljansas @lt
alternative label: Zelení/Evropská svobodná aliance @cs
alternative label: Zelení/Európska slobodná aliancia @sk
alternative label: Zieloni / Wolny Sojusz Europejski @pl
alternative label: Verzi/Alianța Liberă Europeană @ro
alternative label: The Greens/European Free Alliance
alternative label: De Grønne/Den Europæiske Fri Alliance @da
alternative label: Ħodor/Alleanza Ħielsa Ewropea @mt
alternative label: Зелените / Европейски Свободен Алианс @bg
alternative label: Na Glasaigh/An tSaor-Chomhghuaillíocht Eorpach @ga
alternative label: Zaļie/Eiropas Brīvā apvienība @lv
alternative label: Zeleni/Europski slobodni savez @hr
alternative label: Zelení/Evropska svobodna zveza @sl
alternative label: Os Verdes/Aliança Livre Europeia @pt
alternative label: Zöldek/Európai Szabad Szövetség @hu
preferred label: Roheliste / Euroopa Vabaliidu fraktsioon @et
alternative label: De Gröna/Europeiska fria alliansen @sv
alternative label: Vihreät / Euroopan vapaa allianssi @fi
alternative label: De Groenen/Vrije Europese Alliantie @nl
alternative label: Los Verdes/Alianza Libre Europea @es
broader: POLITICAL GROUP
definition: European political group of the Greens/European Free Alliance.
in scheme: EP taxonomy on entities.
preferred label: Žaliųjų frakcija/Europos laisvasis aljansas @lt
preferred label: Gruppen De Grønne/Den Europæiske Fri Alliance @da
preferred label: Grupp tal-Ħodor/Alleanza Ħielsa Ewropea @mt
preferred label: Fraktion der Grünen / Freie Europäische Allianz @de
preferred label: Skupina zelených/Európska slobodná aliancia @sk
preferred label: Gruppo dei Verdi/Alleanza libera europea @it
preferred label: Grupo dos Verdes/Aliança Livre Europeia @pt
preferred label: Groupe des Verts/Alliance libre européenne @fr
preferred label: Grupo de los Verdes/Alianza Libre Europea @es
preferred label: skupina Zelených / Evropské svobodné aliance @cs
preferred label: Zaļo un Eiropas Brīvās apvienības grupa @lv
preferred label: Zöldek/Európai Szabad Szövetség képviselőcsoport @hu
preferred label: Група на Зелените/Европейски свободен алианс @bg
preferred label: Grupul Verzilor/Alianța Liberă Europeană @ro
preferred label: Klub zastupnika Zelenih/Europskog slobodnog saveza @hr
preferred label: Skupina Zelenih/Evropske svobodne zveze @sl
preferred label: Vihreät / Euroopan vapaa allianssi -ryhmä @fi
preferred label: An Grúpa Glas/Grúpa na Saor-Comhghuaillíochta Eorpaí @ga
preferred label: Gruppen De gröna/Europeiska fria alliansen @sv
preferred label: Ομάδα των Πρασίνων / Ευρωπαϊκή Ελεύθερη Συμμαχία @el
preferred label: Grupa Zielonych / Wolne Przymierze Europejskie @pl
preferred label: Fractie De Groenen/Vrije Europese Alliantie @nl

Committee on Women’s Rights and Gender Equality
type: Concept
created: 2023-10-31
deprecated: false
alternative label: Práva žien a rodová rovnosť @sk
alternative label: Naisten oikeudet ja sukupuolten tasa-arvo @fi
alternative label: Prawa Kobiet i Równouprawnienie @pl
alternative label: Права на жените и равенство между половете @bg
alternative label: Drittijiet tan-Nisa u Ugwaljanza bejn is-Sessi @mt
alternative label: Kvinders Rettigheder og Ligestilling @da
alternative label: Naiste õigused ja sooline võrdõiguslikkus @et
alternative label: Direitos das Mulheres e Igualdade dos Géneros @pt
alternative label: Práva žen a rovnost pohlaví @cs
alternative label: Nőjog és esélyegyenlőség @hu
alternative label: Moterų teisės ir lyčių lygybė @lt
alternative label: Sieviešu tiesības un dzimumu līdztiesība @lv
alternative label: Rechte der Frauen und Gleichstellung der Geschlechter @de
preferred label: Odbor za pravice žensk in enakost spolov @sl
alternative label: Cearta na mBan agus Comhionannas Inscne @ga
alternative label: Vrouwenrechten en gendergelijkheid @nl
alternative label: Diritti delle donne e uguaglianza di genere @it
alternative label: Drepturile femeilor și egalitatea de gen @ro
alternative label: Droits des femmes et égalité des genres @fr
alternative label: Women’s Rights and Gender Equality
alternative label: Prava žena i rodna ravnopravnost @hr
alternative label: Kvinnors rättigheter och jämställdhet @sv
alternative label: Derechos de las Mujeres e Igualdad de Género @es
alternative label: Δικαιώματα των Γυναικών και Ισότητα των Φύλων @el
broader: Standing parliamentary committee
definition: European parliamentary committee on women’s rights and gender equality.
in scheme: EP taxonomy on entities.
preferred label: An Coiste um Chearta na mBan agus um Chomhionannas Inscne @ga
preferred label: Odbor za prava žena i rodnu ravnopravnost @hr
preferred label: Naiste õiguste ja soolise võrdõiguslikkuse komisjon @et
preferred label: Sieviešu tiesību un dzimumu līdztiesības komiteja @lv
preferred label: Nőjogi és Esélyegyenlőségi Bizottság @hu
preferred label: Επιτροπή Δικαιωμάτων των Γυναικών και Ισότητας των Φύλων @el
preferred label: Commissie vrouwenrechten en gendergelijkheid @nl
preferred label: Kumitat ghad-Drittijiet tan-Nisa u l-Ugwaljanza bejn il-Generi @mt
preferred label: Naisten oikeuksien ja sukupuolten tasa-arvon valiokunta @fi
preferred label: Komisja Praw Kobiet i Równouprawnienia @pl
preferred label: Comisión de Derechos de las Mujeres e Igualdad de Género @es
preferred label: Комисия по правата на жените и равенството между половете @bg
preferred label: Ausschuss für die Rechte der Frauen und die Gleichstellung der Geschlechter @de
preferred label: Commission des droits des femmes et de l'égalité des genres @fr
preferred label: Výbor pro práva žen a rovnost pohlaví @cs
preferred label: Moterų teisių ir lyčių lygybės komitetas @lt
preferred label: Comissão dos Direitos das Mulheres e da Igualdade dos Géneros @pt
preferred label: Výbor pre práva žien a rodovú rovnosť @sk
preferred label: Udvalget om Kvinders Rettigheder og Ligestilling @da
preferred label: Utskottet för kvinnors rättigheter och jämställdhet mellan kvinnor och män @sv
preferred label: Commissione per i diritti delle donne e l'uguaglianza di genere @it
preferred label: Comisia pentru drepturile femeilor și egalitatea de gen @ro

Group of the European People's Party (Christian Democrats)
type: Concept
created: 2023-10-31
deprecated: false
preferred label: Europos liaudies partijos (krikščionių demokratų) frakcija @lt
preferred label: Poslanecký klub Európskej ľudovej strany (Kresťanských demokratov) @sk
preferred label: Eiropas Tautas partijas (Kristīgie demokrāti) grupa @lv
preferred label: Grupo do Partido Popular Europeu (Democratas-Cristãos) @pt
preferred label: Det Europæiske Folkepartis Gruppe (Kristelige Demokrater) @da
preferred label: Euroopa Rahvapartei (kristlike demokraatide) fraktsioon @et
alternative label: Κoιvoβoυλευτική Ομάδα τoυ Ευρωπαϊκoύ Λαϊκoύ Κόμματoς (Χριστιαvoδημoκράτες) @el
preferred label: Grupo del Partido Popular Europeo (Demócrata-Cristianos) @es
preferred label: Grupa Europejskiej Partii Ludowej (Chrześcijańscy Demokraci) @pl
preferred label: Grupp tal-Partit Popolari Ewropew (Demokristjani) @mt
preferred label: Fraktion der Europäischen Volkspartei (Christdemokraten) @de
preferred label: Euroopan kansanpuolueen ryhmä (kristillisdemokraatit) @fi
preferred label: Grupul Partidului Popular European (Creștin Democrat) @ro
preferred label: Група на Европейската народна партия (Християндемократи) @bg
preferred label: Európai Néppárt (Kereszténydemokraták) képviselőcsoport @hu
preferred label: Groupe du Parti populaire européen (Démocrates-Chrétiens) @fr
preferred label: Gruppo del Partito popolare europeo (Democratici cristiani) @it
preferred label: Grúpa Pháirtí an Phobail Eorpaigh (Na Daonlathaithe Críostaí) @ga
preferred label: poslanecký klub Evropské lidové strany (Křesťanských demokratů) @cs
preferred label: Klub zastupnika Europske pučke stranke (kršćanski demokrati) @hr
preferred label: Fractie van de Europese Volkspartij (christendemocraten) @nl
preferred label: Poslanska skupina Evropske ljudske stranke (Krščanskih demokratov) @sl
broader: POLITICAL GROUP
definition: European political group of the European People's Party (Christian Democrats).
in scheme: EP taxonomy on entities.
preferred label: Ομάδα του Ευρωπαϊκού Λαϊκού Κόμματος (Χριστιανοδημοκράτες) @el

European ombudsman
type: Concept
created: 2023-10-31
deprecated: false
broader: EU body
definition: European Ombudsman.
in scheme: EP taxonomy on entities.
preferred label: Európai ombudsman @hu
preferred label: Provedor de Justiça europeu @pt
preferred label: Evropski varuh človekovih pravic @sl
preferred label: Europäischer Bürgerbeauftragter @de
preferred label: Europese ombudsman @nl
preferred label: Defensor del Pueblo europeo @es
preferred label: Europeiska ombudsmannen @sv
preferred label: Médiateur européen @fr
preferred label: Eurooppa-asiamies @fi
preferred label: Euroopa ombudsman @et
preferred label: Evropský ochránce práv @cs
preferred label: Ombudsman ewropew @mt
preferred label: Mediatore europeo @it
preferred label: An tOmbudsman Eorpach @ga
preferred label: Europejski Rzecznik Praw Obywatelskich @pl
preferred label: Ευρωπαίο Διαμεσολαβητή @el
preferred label: Eiropas ombudsmens @lv
preferred label: Europos ombudsmenas @lt
preferred label: Европейски омбудсман @bg
preferred label: Európsky ombudsman @sk
preferred label: Europski ombudsman @hr
preferred label: Europæisk Ombudsmand @da

Joint committee procedure - ECON and LIBE
type: Concept
created: 2023-10-31
deprecated: false
alternative label: ECON und LIBE @de
alternative label: Commissions conjointes ECON - LIBE @fr
alternative label: Joint ECON - LIBE
broader: Joint parliamentary committees
definition: Joint committee procedure - ECON and LIBE.
in scheme: EP taxonomy on entities.
preferred label: Procédure avec commissions conjointes - ECON et LIBE @fr
preferred label: Gemeinsames Ausschussverfahren - ECON und LIBE @de

Special Committee on the Union’s authorisation procedure for pesticides
type: Concept
created: 2023-10-31
deprecated: true
alternative label: Postupak EU-a za odobravanje pesticida @hr
alternative label: Procedura di autorizzazione dei pesticidi da parte dell'Unione @it
alternative label: Procédure d’autorisation des pesticides par l’Union @fr
alternative label: Procedimento de Autorização da União para os Pesticidas @pt
alternative label: ES pesticidų autorizacijos procedūra @lt
alternative label: Torjunta-aineiden lupamenettely unionissa @fi
alternative label: Postopek Unije za registracijo pesticidov @sl
alternative label: Toelatingsprocedure van de Unie voor pesticiden @nl
alternative label: Procedimiento de Autorización de la Unión para los Plaguicidas @es
alternative label: Ενωσιακή διαδικασία έγκρισης φυτοφαρμάκων @el
alternative label: Процедура на ЕС за разрешаване на пестициди @bg
alternative label: Postup Únie pre povoľovanie pesticídov @sk
alternative label: A peszticidek uniós engedélyezési eljárása @hu
alternative label: Nós imeachta údaraithe AE maidir le lotnaidicídí @ga
alternative label: Postup Unie pro povolování pesticidů @cs
alternative label: EU authorisation procedure for pesticides
alternative label: Proċeduri tal-UE għall-awtorizzazzjoni tal-pestiċidi @mt
alternative label: EU-Genehmigungsverfahren für Pestizide @de
alternative label: Procedura de autorizare a pesticidelor de către Uniune @ro
alternative label: Unijna Procedura Wydawania Zezwoleń na Dopuszczenie Pestycydów do Obrotu @pl
alternative label: Unionens förfarande för godkännande av bekämpningsmedel @sv
alternative label: ES pesticīdu atļaušanas procedūra @lv
alternative label: pestitsiididele lubade andmise ELi menetlus @et
alternative label: Unionens godkendelsesprocedure for pesticider @da
broader: Special parliamentary committee
definition: The Committee will assess the EU's pesticide authorisation procedure, its independence vis-à-vis the pesticide industry, the transparency of the decision-making process and the implementation methods, and put forward specific proposals to improve procedures. It will also examine the roles of the all the bodies involved: the relevant national authorities, the European Commission and the European Food Safety Authority (EFSA), whose methods will also be evaluated.
in scheme: EP taxonomy on entities.
preferred label: Sonderausschuss für das Genehmigungsverfahren der EU für Pestizide @de
preferred label: Cпециална комисия относно процедурата на Съюза за разрешаване на пестициди @bg
preferred label: Kumitat Speċjali dwar il-proċeduri tal-Unjoni għall-awtorizzazzjoni tal-pestiċidi @mt
preferred label: An Coiste Speisialta um nós imeachta údaraithe AE maidir le lotnaidicídí @ga
preferred label: Osobitnývýbor pre postup Únie pre povoľovanie pesticídov @sk
preferred label: Ειδική επιτροπή για την ενωσιακή διαδικασία έγκρισης φυτοφαρμάκων @el
preferred label: Comisia specială pentru procedura de autorizare a pesticidelor de către Uniune @ro
preferred label: Pestitsiididele lubade andmise ELi menetlust käsitlev erikomisjon @et
preferred label: Posebni odbor za postupak Unije za odobravanje pesticida @hr
preferred label: Savienības pesticīdu atļaušanas procedūras īpašā komiteja @lv
preferred label: Zvláštní výbor pro postup Unie pro povolování pesticidů @cs
preferred label: Commission spéciale sur la procédure d’autorisation des pesticides par l’Union @fr
preferred label: Commissione speciale sulla procedura di autorizzazione dei pesticidi da parte dell'Unione @it
preferred label: Posebni odbor za postopek Unije za registracijo pesticidov @sl
preferred label: Specialusis komitetas ES pesticidų autorizacijos procedūros klausimais @lt
preferred label: Särskilda utskottet för unionens förfarande för godkännande av bekämpningsmedel @sv
preferred label: Det Særlige Udvalg om Unionens Godkendelsesprocedure for Pesticider @da
preferred label: A peszticidek uniós engedélyezési eljárásával foglalkozó különbizottság @hu
preferred label: Comisión Especial sobre el Procedimiento de Autorización de la Unión para los Plaguicidas @es
preferred label: Comissão Especial sobre o Procedimento de Autorização da União para os Pesticidas @pt
preferred label: Komisja Specjalna ds. Unijnej Procedury Wydawania Zezwoleń na Dopuszczenie Pestycydów do Obrotu @pl
preferred label: Bijzondere Commissie toelatingsprocedure van de Unie voor pesticiden @nl
preferred label: Torjunta-aineiden lupamenettelyä unionissa käsittelevä erityisvaliokunta @fi

Joint committee procedure - JURI and LIBE
type: Concept
created: 2023-10-31
deprecated: false
alternative label: Commissions conjointes JURI - LIBE @fr
alternative label: Joint JURI - LIBE
alternative label: JURI und LIBE @de
broader: Joint parliamentary committees
definition: Joint committee procedure - JURI and LIBE.
in scheme: EP taxonomy on entities.
preferred label: Procédure avec commissions conjointes - JURI et LIBE @fr
preferred label: Gemeinsames Ausschussverfahren - JURI und LIBE @de

Joint committee procedure - ENVI and PECH
type: Concept
created: 2025-06-30
deprecated: false
alternative label: Commissions conjointes ENVI - PECH @fr
alternative label: Joint ENVI - PECH
alternative label: ENVI und PECH @de
broader: Joint parliamentary committees
definition: Joint committee procedure - ENVI and PECH.
in scheme: EP taxonomy on entities.
preferred label: Gemeinsames Ausschussverfahren - ENVI und PECH @de
preferred label: Procédure avec commissions conjointes - ENVI et PECH @fr

Delegation to the Caribbean-EU Parliamentary Assembly
type: Concept
created: 2023-12-31
deprecated: false
alternative label: AE-an Chairib @ga
alternative label: Caraibi-UE @it
alternative label: Karibų valstybių ir ES @lt
alternative label: Karību jūras valstu un ES @lv
alternative label: Caribisch gebied-EU @nl
alternative label: Caribien-EU @da
alternative label: Кариби – ЕС @bg
alternative label: Karibia-EU @fi
alternative label: Καραϊβική-ΕΕ @el
alternative label: Karibi-EU @hr
alternative label: Karibien–EU @sv
alternative label: Karibik-EU @de
alternative label: Karibik–EU @cs
alternative label: Caribbean-EU
alternative label: Kariibi piirkonna ja ELi @et
alternative label: Caribe-UE @es
alternative label: Karibik – EÚ @sk
alternative label: Caraïbes-UE @fr
alternative label: Karibew-UE @mt
alternative label: Caraíbas-UE @pt
alternative label: Karib-tengeri térség–EU @hu
alternative label: Karaiby–UE @pl
broader: Temporary parliamentary legislative committee
definition: Delegation to the Caribbean-EU Parliamentary Assembly.
in scheme: EP taxonomy on entities.
preferred label: Αντιπροσωπεία στην Κοινοβουλευτική Συνέλευση Καραϊβικής-ΕΕ @el
preferred label: Delegazione all'Assemblea parlamentare Caraibi-UE @it
preferred label: Delegación en la Asamblea Parlamentaria Caribe-UE @es
preferred label: Delegācija Karību jūras valstu un ES Parlamentārajā asamblejā @lv
preferred label: Делегация в Парламентарната асамблея Кариби – ЕС @bg
preferred label: Delegácia pri Parlamentnom zhromaždení Karibik – EÚ @sk
preferred label: Delegatie in de Parlementaire Vergadering Caribisch gebied-EU @nl
preferred label: Delegação à Assembleia Parlamentar Caraíbas-UE @pt
preferred label: Delegazzjoni għall-Assemblea Parlamentari Karibew-UE @mt
preferred label: Valtuuskunta Karibian alueen ja EU:n parlamentaarisessa edustajakokouksessa @fi
preferred label: Toscaireacht chuig Tionól Parlaiminteach AE-an Chairib @ga
preferred label: Delegacja do Zgromadzenia Parlamentarnego Karaiby–UE @pl
preferred label: Délégation à l'Assemblée parlementaire Caraïbes-UE @fr
preferred label: Delegationen till den parlamentariska församlingen Karibien–EU @sv
preferred label: Delegația la Adunarea Parlamentară Caraibi-UE @ro
preferred label: Delegace v Parlamentním shromáždění Karibik–EU @cs
preferred label: Delegationen til Den Parlamentariske Forsamling Caribien-EU @da
preferred label: Delegatsioon Kariibi piirkonna ja ELi parlamentaarses assamblees @et
preferred label: Delegacija Karibų valstybių ir ES parlamentinėje asamblėjoje @lt
preferred label: a Karib-tengeri térség–EU Parlamenti Közgyűlésbe delegált küldöttség @hu
preferred label: Izaslanstvo u Parlamentarnoj skupštini Karibi-EU @hr
preferred label: Delegation in der Parlamentarischen Versammlung Karibik-EU @de
preferred label: Delegacija pri Parlamentarni skupščini Karibi-EU @sl

Delegation to the EU-Albania Stabilisation and Association Parliamentary Committee
type: Concept
created: 2023-10-31
deprecated: false
alternative label: Albanië @nl
alternative label: Albánia @hu
alternative label: Albanien @de
alternative label: Albánie @cs
alternative label: Albānija @lv
alternative label: Albanija @hr
alternative label: An Albáin @ga
alternative label: Албания @bg
alternative label: Albánsko @sk
alternative label: Albania
alternative label: Albaania @et
alternative label: Albanie @fr
alternative label: Αλβανία @el
alternative label: Albânia @pt
broader: Delegation to Joint Parliamentary Committee
definition: Delegation to the EU-Albania Stabilisation and Association Parliamentary Committee.
in scheme: EP taxonomy on entities.
preferred label: Delegazione al comitato parlamentare di stabilizzazione e di associazione UE-Albania @it
preferred label: Delegácia pri Parlamentnom výbore pre stabilizáciu a pridruženie EÚ – Albánsko @sk
preferred label: Delegația la Comisia parlamentară de stabilizare și de asociere UE-Albania @ro
preferred label: Az EU–Albánia Stabilizációs és Társulási Parlamenti Bizottságba delegált küldöttség @hu
preferred label: Delegace v Parlamentním výboru pro stabilizaci a přidružení EU-Albánie @cs
preferred label: Αντιπροσωπεία στην Κοινοβουλευτική Επιτροπή Σταθεροποίησης και Σύνδεσης ΕΕ-Αλβανίας @el
preferred label: Izaslanstvo u Parlamentarnom odboru za stabilizaciju i pridruživanje EU-a i Albanije @hr
preferred label: Delegacija pri stabilizacijsko-pridružitvenem parlamentarnem odboru EU-Albanija @sl
preferred label: Delegação à Comissão Parlamentar de Estabilização e Associação UE-Albânia @pt
preferred label: Délégation à la commission parlementaire de stabilisation et d'association UE-Albanie @fr
preferred label: Delegationen till den parlamentariska stabiliserings- och associeringskommittén för EU–Albanien @sv
preferred label: Delegacija ES ir Albanijos stabilizacijos ir asociacijos parlamentiniame komitete @lt
preferred label: Делегация в Парламентарния комитет по стабилизиране и асоцииране ЕС – Албания @bg
preferred label: Delegācija ES un Albānijas stabilizācijas un asociācijas parlamentārajā komitejā @lv
preferred label: Delegación en la Comisión Parlamentaria de Estabilización y Asociación UE-Albania @es
preferred label: Delegazzjoni għall-Kumitat Parlamentari ta' Stabbilizzazzjoni u Assoċjazzjoni UE-Albanija @mt
preferred label: Delegatie in het Parlementair Stabilisatie- en Associatiecomité EU-Albanië @nl
preferred label: Delegation im Parlamentarischen Stabilitäts- und Assoziationsausschuss EU-Albanien @de
preferred label: Valtuuskunta EU:n ja Albanian parlamentaarisessa vakautus- ja assosiaatiovaliokunnassa @fi
preferred label: Delegationen til Det Parlamentariske Stabiliserings- og Associeringsudvalg EU-Albanien @da
preferred label: Delegacja do Parlamentarnego Komitetu Stabilizacji i Stowarzyszenia UE-Albania @pl
preferred label: An Toscaireacht chun an Choiste Pharlaimintigh Cobhsaíochta agus Comhlachais idir AE agus an Albáin @ga
preferred label: Delegatsioon ELi–Albaania parlamentaarses stabiliseerimis- ja assotsieerimiskomitees @et

Joint committee procedure - IMCO and SEDE
type: Concept
created: 2025-06-30
deprecated: false
alternative label: IMCO und SEDE @de
alternative label: Joint IMCO - SEDE
alternative label: Commissions conjointes IMCO - SEDE @fr
broader: Joint parliamentary committees
definition: Joint committee procedure - IMCO and SEDE.
in scheme: EP taxonomy on entities.
preferred label: Gemeinsames Ausschussverfahren - IMCO und SEDE @de
preferred label: Procédure avec commissions conjointes - IMCO et SEDE @fr

Temporary committee on policy challenges and budgetary means of the enlarged Union 2007-2013
type: Concept
created: 2023-10-31
deprecated: true
alternative label: Paplašinātās Eiropas Savienības politikas uzdevumi un budžeta līdzekļi (2007.–2013.g.) @lv
alternative label: Politische Herausforderungen und Haushaltsmittel der erweiterten Union 2007-2013 @de
alternative label: Wyzwania polityczne i środki budżetowe w rozszerzonej Unii w latach 2007-2013 @pl
alternative label: Politikudfordringer og budgetmidler i det udvidede EU 2007-2013 @da
alternative label: A Kibővített Unió 2007 és 2013 Közötti Politikai Kihívásai, Költségvetési Eszközei @hu
alternative label: Πολιτικές προκλήσεις και δημοσιονομικά μέσα της διευρυμένης Ένωσης 2007-2013 @el
alternative label: Provocările politice și resursele bugetare ale Uniunii extinse 2007-2013 @ro
alternative label: Desafios Políticos e Recursos Orçamentais da União Alargada 2007-2013 @pt
alternative label: Retos Políticos y Medios Presupuestarios de la Unión Ampliada (2007-2013) @es
alternative label: L-isfidi politiċi u l-mezzi baġitarji ta' l-Unjoni wara t-tkabbir 2007-2013 @mt
alternative label: Laienenud Euroopa Liidu (2007–2013) poliitilised väljakutsed ja eelarvevahendid @et
alternative label: Politické výzvy a rozpočtové prostriedky rozšírenej Únie 2007-2013 @sk
alternative label: Politični izzivi in proračunska sredstva razširjene Unije 2007-2013 @sl
alternative label: Beleidsuitdagingen en begrotingsmiddelen in de uitgebreide Unie 2007-2013 @nl
alternative label: Sfide e mezzi finanziari dell'Unione allargata nel periodo 2007-2013 @it
alternative label: Policy challenges and budgetary means of the enlarged Union 2007-2013
alternative label: Politički izazovi i proračunska sredstva proširene Unije za razdoblje 2007. – 2013. @hr
alternative label: Временна комисия по политически предизвикателства @bg
alternative label: Politiska utmaningar och budgetmedel i ett utvidgat EU 2007–2013 @sv
alternative label: Dočasný výbor pro politické výzvy a rozpočtové prostředky rozšířené Unie (2007–2013) @cs
alternative label: Poliittiset haasteet ja rahoitusmahdollisuudet laajentuneessa unionissa 2007–2013 @fi
alternative label: Défis politiques et moyens budgétaires de l'Union élargie 2007-2013 @fr
alternative label: Dúshláin bheartas agus meáin bhuiséadacha an Aontais mhéadaithe 2007-2013 @ga
alternative label: Išsiplėtusios Europos Sąjungos 2007–2013 m. politiniai iššūkiai ir biudžeto lėšos @lt
broader: Temporary parliamentary committee
definition: European temporary parliamentary committee on policy challenges and budgetary means of the enlarged Union 2007-2013.
in scheme: EP taxonomy on entities.
preferred label: Comisia temporară privind provocările politice și resursele bugetare ale Uniunii extinse 2007-2013 @ro
preferred label: Commission temporaire sur les défis politiques et les moyens budgétaires de l'Union élargie 2007-2013 @fr
preferred label: Tillfälligt utskott för politiska utmaningar och budgetmedel i ett utvidgat EU 2007–2013 @sv
preferred label: An coiste sealadach um dhúshláin bheartas agus um mheáin bhuiséadacha an Aontais mhéadaithe 2007-2013 @ga
preferred label: Временна комисия по политически предизвикателства и бюджетни средства на разширения Съюз между 2007 и 2013 г. @bg
preferred label: Tijdelijke Commissie beleidsuitdagingen en begrotingsmiddelen in de uitgebreide Unie 2007-2013 @nl
preferred label: Komisji tymczasowej do spraw wyzwań politycznych i środków budżetowych w rozszerzonej Unii w latach 2007-2013 @pl
preferred label: Προσωρινή επιτροπή για τις πολιτικές προκλήσεις και τα δημοσιονομικά μέσα της διευρυμένης Ένωσης 2007-2013 @el
preferred label: Pagaidu komitejas izveidi saistībā ar paplašinātās Eiropas Savienības politikas uzdevumiem un budžeta līdzekļiem no 2007. gada līdz 2013 @lv
preferred label: Politiikan haasteita ja rahoitusmahdollisuuksia laajentuneessa unionissa 2007–2013 käsittelevä väliaikainen valiokunta @fi
preferred label: Kumitat temporanju għall-isfidi politiċi u l-mezzi baġitarji ta' l-Unjoni wara t-tkabbir 2007-2013 @mt
preferred label: Comisión temporal sobre Retos Políticos y Medios Presupuestarios de la Unión Ampliada (2007-2013) @es
preferred label: Det Midlertidige Udvalg om Politikudfordringer og Budgetmidler i det Udvidede EU 2007-2013 @da
preferred label: Dočasný výbor pre politické výzvy a rozpočtové prostriedky rozšírenej Únie v rokoch 2007-2013 @sk
preferred label: Commissione temporanea sulle sfide e i mezzi finanziari dell'Unione allargata nel periodo 2007-2013 @it
preferred label: A kibővült Unió 2007 és 2013 közötti politikai kihívásaival és költségvetési eszközeivel foglalkozó ideiglenes bizottság @hu
preferred label: Privremeni odbor za političke izazove i proračunska sredstva proširene Unije za razdoblje 2007. – 2013. @hr
preferred label: Laikinojo komiteto dėl išsiplėtusios Europos Sąjungos politikos sunkumų ir biudžetinių priemonių 2007–2013 @lt
preferred label: Začasni odbor za politične izzive in proračunska sredstva razširjene Unije 2007-2013 @sl
preferred label: Comissão temporária sobre os desafios políticos e os recursos orçamentais da União alargada 2007-2013 @pt
preferred label: Nichtständiger Ausschuss zu den politischen Herausforderungen und Haushaltsmitteln der erweiterten Union 2007-2013 @de
preferred label: Laienenud Euroopa Liidu (2007–2013) poliitiliste väljakutsete ja eelarvevahendite ajutise komisjon @et
preferred label: Dočasný výbor pro politické výzvy a rozpočtové prostředky rozšířené Unie v letech 2007–2013 @cs

European Union Agency for Cybersecurity
type: Concept
created: 2023-10-31
deprecated: false
broader: Decentralised agency
definition: European Union Agency for Cybersecurity.
in scheme: EP taxonomy on entities.
preferred label: Agence de l’Union européenne pour la cybersécurité @fr
preferred label: Europos Sąjungos kibernetinio saugumo agentūra @lt
preferred label: Agencia de la Unión Europea para la Ciberseguridad @es
preferred label: Agentschap van de Europese Unie voor cyberbeveiliging @nl
preferred label: Агенция на Европейския съюз за киберсигурност @bg
preferred label: Euroopa Liidu Küberturvalisuse Amet @et
preferred label: Europeiska unionens cybersäkerhetsbyrå @sv
preferred label: Agentura Evropské unie pro kybernetickou bezpečnost @cs
preferred label: Agencja Unii Europejskiej ds. Cyberbezpieczeństwa @pl
preferred label: Agenția Uniunii Europene pentru Securitate Cibernetică @ro
preferred label: Agencija Europske unije za kibersigurnost @hr
preferred label: Agentúra Európskej únie pre kybernetickú bezpečnosť @sk
preferred label: Οργανισμός της Ευρωπαϊκής Ένωσης για την Κυβερνοασφάλεια @el
preferred label: Euroopan unionin kyberturvallisuusvirasto @fi
preferred label: Agência da União Europeia para a Cibersegurança @pt
preferred label: Agencija Evropske unije za kibernetsko varnost @sl
preferred label: L-Aġenzija tal-Unjoni Ewropea għaċ-Ċibersigurtà @mt
preferred label: Gníomhaireacht an Aontais Eorpaigh um Chibearshlándáil @ga
preferred label: Den Europæiske Unions Agentur for Cybersikkerhed @da
preferred label: Agenzia dell’Unione europea per la cibersicurezza @it
preferred label: Agentur der Europäischen Union für Cybersicherheit @de
preferred label: Európai Uniós Kiberbiztonsági Ügynökség @hu
preferred label: Eiropas Savienības Kiberdrošības aģentūra @lv

Spanish Senate
type: Concept
created: 2023-10-31
deprecated: false
broader: National chamber
definition: Spanish Senate.
in scheme: EP taxonomy on entities.
preferred label: Spaanse Senaat @nl
preferred label: Senado español @es
preferred label: španielsky Senát @sk
preferred label: Senat Hiszpanii @pl
preferred label: Ispanijos Karalystės Senatas @lt
preferred label: Senato spagnolo @it
preferred label: španělský Senát @cs
preferred label: Ισπανική Γερουσία @el
preferred label: Spānijas parlamenta Senāts @lv
preferred label: spanyol szenátus @hu
preferred label: Senat Spanjol @mt
preferred label: Seanad na Spáinne @ga
preferred label: Senatul Spaniei @ro
preferred label: Hispaania Senat @et
preferred label: Den spanska senaten @sv
preferred label: španski senat @sl
preferred label: spanischer Senat @de
preferred label: Espanjan senaatti @fi
preferred label: Senado espanhol @pt
preferred label: Сенат на Кралство Испания @bg
preferred label: španjolski Senat @hr
preferred label: det spanske Senat @da
preferred label: Sénat espagnol @fr

European Union Satellite Centre
type: Concept
created: 2023-10-31
deprecated: false
broader: EU agency
definition: EU Satellite Centre.
in scheme: EP taxonomy on entities.
preferred label: Lárionad Satailíte an Aontais Eorpaigh @ga
preferred label: Centre satellitaire de l’Union européenne @fr
preferred label: Az Európai Unió Műholdközpontja @hu
preferred label: EU-Satellitcentret @da
preferred label: Eiropas Savienības Satelītcentrs @lv
preferred label: Сателитен център на Европейския съюз @bg
preferred label: Satelitski centar Europske unije @hr
preferred label: Satelitski center Evropske unije @sl
preferred label: Centro satellitare dell’Unione europea @it
preferred label: Centrum Satelitarne Unii Europejskiej @pl
preferred label: Δορυφορικό Κέντρο της Ευρωπαϊκής Ένωσης @el
preferred label: Europeiska unionens satellitcentrum @sv
preferred label: Satellietcentrum van de Europese Unie @nl
preferred label: Europos Sąjungos palydovų centras @lt
preferred label: Euroopa Liidu Satelliidikeskus @et
preferred label: Satellitenzentrum der Europäischen Union @de
preferred label: Euroopan unionin satelliittikeskus @fi
preferred label: Satelitní středisko Evropské unie @cs
preferred label: Centro de Satélites de la Unión Europea @es
preferred label: Satelitné stredisko Európskej únie @sk
preferred label: Centrul Satelitar al Uniunii Europene @ro
preferred label: Centro de Satélites da União Europeia @pt
preferred label: Iċ-Ċentru Satellitari tal-Unjoni Ewropea @mt

Delegation to the EU-Czech Republic Joint Parliamentary Committee
type: Concept
created: 2023-10-31
deprecated: true
alternative label: ЕС-Чешка република @bg
alternative label: ES-Cehija @lv
alternative label: EU-Česká republika @cs
alternative label: EU – Češka Republika @hr
alternative label: EU-Tjeckiska republiken @sv
alternative label: EL-Tšehhi Vabariik @et
alternative label: UE-République tchèque @fr
alternative label: UE-Czechy @pl
alternative label: UE-Republica Cehă @ro
alternative label: EU-Tsekin tasavalta @fi
alternative label: EU-Tsjechische Republiek @nl
alternative label: ES-Cekijos Respublika @lt
alternative label: ΕΕ-Τσεχικής Δημοκρατίας @el
alternative label: UE-República Checa @es
alternative label: AE-Poblacht na Seice @ga
alternative label: EU-Den Tjekkiske Republik @da
alternative label: EU-Cseh Köztársaság @hu
alternative label: EÚ-Ceská republika @sk
alternative label: EU-Češka republika @sl
alternative label: UE-Repubblika Ceka @mt
alternative label: EU-Czech Republic
alternative label: UE-Repubblica ceca @it
alternative label: EU-Tschechische Republik @de
broader: Delegation to Joint Parliamentary Committee
definition: Delegation to the EU-Czech Republic Joint Parliamentary Committee.
in scheme: EP taxonomy on entities.
preferred label: Delegacija pri Skupnem parlamentarnem odboru EU-Češka republika @sl
preferred label: Az EU-Cseh Köztársaság Parlamenti Vegyes Bizottságba delegált küldöttség @hu
preferred label: ES-Čehijas Apvienotās parlamentārās komitejas delegācija @lv
preferred label: Delegação à Comissão Parlamentar Mista UE-República Checa @pt
preferred label: Delegationen til Det Blandede Parlamentariske Udvalg EU-Den Tjekkiske Republik @da
preferred label: Delegácia pri Spoločnom parlamentnom výbore EÚ-Česká republika @sk
preferred label: Delegația la Comisia parlamentară mixtă UE-Republica Cehă @ro
preferred label: Toscaireacht chun an Chomhchoiste Pharlaimintigh den AE-Poblacht na Seice @ga
preferred label: Delegationen till den gemensamma parlamentarikerkommittén EU-Tjeckiska republiken @sv
preferred label: Delegatsioon parlamendi ELi-Tšehhi Vabariigi ühiskomisjonis @et
preferred label: Delegazione alla commissione parlamentare mista UE-Repubblica ceca @it
preferred label: Делегация в Съвместния парламентарен комитет ЕС-Чешка република @bg
preferred label: Delegación en la Comisión Parlamentaria Mixta UE-República Checa @es
preferred label: Delegazzjoni lejn il-Kumitat Parlamentari Mag]qud UE-Repubblika Ceka @mt
preferred label: Delegatie in de Gemengde Parlementaire Commissie EU-Republiek Tsjechië @nl
preferred label: Delegacija ES-Čekijos Respublikos jungtiniame parlamentiniame komitete @lt
preferred label: Valtuuskunta EU:n ja Tsekin tasavallan välisessä parlamentaarisessa sekavaliokunnassa @fi
preferred label: Αντιπροσωπεία στη Μικτή Κοινοβουλευτική Επιτροπή ΕΕ-Τσεχικής Δημοκρατίας @el
preferred label: Delegacja do wspólnej komisji parlamentarnej UE-Republika Czeska @pl
preferred label: Délégation à la commission parlementaire mixte UE-République tchèque @fr
preferred label: Izaslanstvo u Zajedničkom parlamentarnom odboru EU-a i Češke Republike @hr
preferred label: Delegace při smíšeném parlamentním výboru EU-Česká republika @cs
preferred label: Delegation im gemischten parlamentarischen Ausschuss EU-Tschechische Republik @de

Delegation for relations with Iran
type: Concept
created: 2023-10-31
deprecated: false
alternative label: Иран @bg
alternative label: Irão @pt
alternative label: Iran
alternative label: Iraan @et
alternative label: An Iaráin @ga
alternative label: Írán @cs
alternative label: Ιράν @el
alternative label: Irāna @lv
alternative label: Irán @es
alternative label: Iranas @lt
broader: Parliamentary delegation
definition: Delegation for relations with Iran.
in scheme: EP taxonomy on entities.
preferred label: Delegacija ryšiams su Iranu @lt
preferred label: Az Iránnal fenntartott kapcsolatokért felelős küldöttség @hu
preferred label: Delegacija za odnose z Iranom @sl
preferred label: Delegácia pre vzťahy s Iránom @sk
preferred label: Delegation für die Beziehungen zu Iran @de
preferred label: Delegazzjoni għar-relazzjonijiet mal-Iran @mt
preferred label: Delegace pro vztahy s Íránem @cs
preferred label: Delegationen for Forbindelserne med Iran @da
preferred label: Delegationen för förbindelserna med Iran @sv
preferred label: Delegazione per le relazioni con l'Iran @it
preferred label: Delegatie voor de betrekkingen met Iran @nl
preferred label: Delegación para las Relaciones con Irán @es
preferred label: Αντιπροσωπεία για τις σχέσεις με το Ιράν @el
preferred label: An Toscaireacht don chaidreamh leis an Iaráin @ga
preferred label: Делегация за връзки с Иран @bg
preferred label: Delegația pentru relațiile cu Iran @ro
preferred label: Delegatsioon Iraaniga suhtlemiseks @et
preferred label: Delegação para as Relações com o Irão @pt
preferred label: Izaslanstvo za odnose s Iranom @hr
preferred label: Délégation pour les relations avec l'Iran @fr
preferred label: Delegacja do spraw stosunków z Iranem @pl
preferred label: Suhteista Iraniin vastaava valtuuskunta @fi
preferred label: Delegācija attiecībām ar Irānu @lv

Agency for Support for BEREC
type: Concept
created: 2023-10-31
deprecated: false
alternative label: Urząd BEREC @pl
alternative label: L-Uffiċċju tal-BEREC @mt
alternative label: Berecbyrån @sv
alternative label: BEREC-kontoret @da
alternative label: Úřad BEREC @cs
alternative label: Office de l’ORECE @fr
alternative label: Υπηρεσία του BEREC @el
alternative label: Ufficio BEREC @it
alternative label: BEREC Hivatal @hu
alternative label: Oficina del ORECE @es
alternative label: Служба на ОЕРЕС @bg
alternative label: BEREC-virasto @fi
alternative label: Oifig BEREC @ga
alternative label: Berec-Bureau @nl
alternative label: BEREC Office
alternative label: BERECi büroo @et
alternative label: BEREC birojs @lv
alternative label: Ured BEREC-a @hr
alternative label: BEREC biuras @lt
alternative label: Úrad BEREC @sk
alternative label: Gabinete do ORECE @pt
alternative label: Oficiul OAREC @ro
alternative label: GEREK-Büro @de
alternative label: Urad BEREC @sl
broader: Decentralised agency
definition: Agency for Support for BEREC.
in scheme: EP taxonomy on entities.
preferred label: Агенция за подкрепа на ОЕРЕС @bg
preferred label: Agencija za podporo BEREC-u @sl
preferred label: Οργανισμός για την Υποστήριξη του BEREC @el
preferred label: Agenția de sprijin pentru OAREC @ro
preferred label: BERECin tukivirasto @fi
preferred label: BEREC atbalsta aģentūra @lv
preferred label: Agentura na podporu BEREC @cs
preferred label: Agentur zur Unterstützung des GEREK @de
preferred label: Agencija za potporu BEREC-u @hr
preferred label: BERECi Tugiamet @et
preferred label: Byrån för stöd till Berec @sv
preferred label: Gníomhaireacht Tacaíochta BEREC @ga
preferred label: BEREC paramos agentūra @lt
preferred label: Agência de Apoio ao ORECE @pt
preferred label: Agentúra na podporu orgánu BEREC @sk
preferred label: L-Aġenzija għall-Appoġġ tal-BEREC @mt
preferred label: Bureau voor ondersteuning van Berec @nl
preferred label: Agenzia di sostegno al BEREC @it
preferred label: Agence de soutien à l’ORECE @fr
preferred label: Agencja Wsparcia BEREC @pl
preferred label: Agencia de apoyo al ORECE @es
preferred label: Agenturet for Støtte til BEREC @da
preferred label: A BEREC Működését Segítő Ügynökség @hu

European Union Agency for Railways
type: Concept
created: 2023-10-31
deprecated: false
broader: Decentralised agency
definition: European Union Agency for Railways.
in scheme: EP taxonomy on entities.
preferred label: Агенция за железопътен транспорт на Европейския съюз @bg
preferred label: Gníomhaireacht Iarnróid an Aontais Eorpaigh @ga
preferred label: Οργανισμός Σιδηροδρόμων της Ευρωπαϊκής Ένωσης @el
preferred label: Euroopa Liidu Raudteeamet @et
preferred label: Europos Sąjungos geležinkelių agentūra @lt
preferred label: Železničná agentúra Európskej únie @sk
preferred label: Euroopan unionin rautatievirasto @fi
preferred label: Agencija Evropske unije za železnice @sl
preferred label: Agencia Ferroviaria de la Unión Europea @es
preferred label: Agencija Europske unije za željeznice @hr
preferred label: Europeiska unionens järnvägsbyrå @sv
preferred label: Agenzia dell’Unione europea per le ferrovie @it
preferred label: Eiropas Savienības Dzelzceļu aģentūra @lv
preferred label: Agencja Kolejowa Unii Europejskiej @pl
preferred label: Agência Ferroviária da União Europeia @pt
preferred label: Den Europæiske Unions Jernbaneagentur @da
preferred label: Agenția Uniunii Europene pentru Căile Ferate @ro
preferred label: Eisenbahnagentur der Europäischen Union @de
preferred label: Spoorwegbureau van de Europese Unie @nl
preferred label: Agence de l’Union européenne pour les chemins de fer @fr
preferred label: L-Aġenzija tal-Unjoni Ewropea għall-Ferroviji @mt
preferred label: Az Európai Unió Vasúti Ügynöksége @hu
preferred label: Agentura Evropské unie pro železnice @cs

Delegation to the EEC-Greece Joint Parliamentary Committee
type: Concept
created: 2023-10-31
deprecated: true
alternative label: EKG-Görögország @hu
alternative label: EWG-Grecja @pl
alternative label: Grecja- KEE @mt
alternative label: EEG-Grekland @sv
alternative label: EMÜ-Kreeka @et
alternative label: EHS-Grécko @sk
alternative label: EGS-Grcija @sl
alternative label: CEE-Grèce @fr
alternative label: ΕΟΚ-Ελλάδα @el
alternative label: EEC-Greece
alternative label: ETY-Kreikka @fi
alternative label: EEK-Griekija @lv
alternative label: EEB-Graikija @lt
alternative label: EWG-Griechenland @de
alternative label: Delegatie in de Gemengde Parlementaire Commissie E @nl
alternative label: CEE-an Ghréig @ga
alternative label: CEE-Grécia @pt
alternative label: ЕИО-Гърция @bg
alternative label: CEE-Grecia @it
alternative label: EØF-Grækenland @da
alternative label: EEZ – Grčka @hr
alternative label: EHS - Řecko @cs
broader: Delegation to Joint Parliamentary Committee
definition: Delegation to the EEC-Greece Joint Parliamentary Committee.
in scheme: EP taxonomy on entities.
preferred label: Delegación en la Comisión parlamentaria mixta CEE-Grecia @es
preferred label: Valtuuskunta Euroopan talousyhteisön ja Kreikan välisessä @fi
preferred label: Delegatsioon EMÜ-Kreeka parlamentaarses ühiskomitees @et
preferred label: Αντιπροσωπεια ατη Μικτή Κοιθοβουλευτική Επιτροπή ΕΟΚ-Ηελλας @el
preferred label: Az EGK-Görögország Interparlamentáris Bizottsághoz delegáltak @hu
preferred label: Delegation im Gemischten Parlamentarischen Ausschuß EWG-Griechenland @de
preferred label: Delegația la Comisia parlamentară mixtă CEE-Grecia @ro
preferred label: Delegacija skupnega parlamentarnega odbora EGS in Grčije @sl
preferred label: Delegatie in de Gemengde Parlementaire Commissie EEG-Griekenland @nl
preferred label: Toscaireacht chun an Chomhchoiste Pharlaimintigh CEE-an Ghréig @ga
preferred label: Delegacja do Wspólnej Komisji Parlamentarnej EWG-Grecja @pl
preferred label: Délégation à la Commission parlementaire mixte CEE-Grèce @fr
preferred label: Delegation til Det Blandede Parlamentariske Udvald EØG-Grækland @da
preferred label: Delegazzjoni lejn il-Kumitat Parlamentari Maghqud Grecja-KEE @mt
preferred label: Delegação à Comissão Parlamentar Mista CEE-Grécia @pt
preferred label: Delegace při smíšeném parlamentním výboru EHS-Řecko @cs
preferred label: Delegácia pre Spolocný parlamentný výbor EHS-Grécko @sk
preferred label: Delegacija EEC-Griekijas kopigai parlamentarai komisijai @lv
preferred label: Делегация в Съвместния парламентарен комитет ЕИО-Гърция @bg
preferred label: Izaslanstvo u Zajedničkom parlamentarnom odboru EEZ-a i Grčke @hr
preferred label: Delegacija i EEB-Graikijos Jungtini parlamentini komiteta @lt
preferred label: Delegazione alla Commissione parlamentare mista CEE-Grecia @it
preferred label: Delegationen till det blandade parlamentariska utskottet EEG-Grekland @sv

Conference of Presidents
type: Concept
created: 2025-04-30
deprecated: false
broader: Governing entities
definition: Conference of Presidents.
in scheme: EP taxonomy on entities.
preferred label: Председателски съвет @bg
preferred label: Konferenca predsednikov @sl
preferred label: Konferencija predsjednika @hr
preferred label: Conferința președinților @ro
preferred label: Konference předsedů @cs
preferred label: Priekšsēdētāju konference @lv
preferred label: Esimeeste konverents @et
preferred label: Konferencja Przewodniczących @pl
preferred label: Elnökök Értekezlete @hu
preferred label: Comhdháil na nUachtarán @ga
preferred label: Conferenza dei presidenti @it
preferred label: Conferencia de Presidentes @es
preferred label: Formandskonferencen @da
preferred label: Konferencia predsedov @sk
preferred label: Διάσκεψη των Προέδρων @el
preferred label: Conférence des présidents @fr
preferred label: Conferência dos Presidentes @pt
preferred label: Konferenz der Präsidenten @de
preferred label: Pirmininkų sueiga @lt
preferred label: Talmanskonferensen @sv
preferred label: Conferentie van voorzitters @nl
preferred label: Konferenza ta’ Presidenti @mt
preferred label: Puheenjohtajakokous @fi

Joint committee procedure - DEVE and ENVI
type: Concept
created: 2023-10-31
deprecated: false
alternative label: Commissions conjointes DEVE - ENVI @fr
alternative label: Joint DEVE - ENVI
alternative label: DEVE und ENVI @de
broader: Joint parliamentary committees
definition: Joint committee procedure - DEVE and ENVI.
in scheme: EP taxonomy on entities.
preferred label: Gemeinsames Ausschussverfahren - DEVE und ENVI @de
preferred label: Procédure avec commissions conjointes - DEVE et ENVI @fr

Delegation for relations with the People's Republic of China
type: Concept
created: 2023-10-31
deprecated: false
alternative label: Китай @bg
alternative label: Cina @it
alternative label: Kina @sv
alternative label: An tSín @ga
alternative label: China
alternative label: Chine @fr
alternative label: Kiina @fi
alternative label: Ķīna @lv
alternative label: Κίνα @el
alternative label: Chiny @pl
alternative label: Hiina @et
alternative label: Kína @hu
alternative label: Kinija @lt
alternative label: Ċina @mt
alternative label: Kitajska @sl
alternative label: Čína @sk
broader: Parliamentary delegation
definition: Delegation for relations with the People's Republic of China.
in scheme: EP taxonomy on entities.
preferred label: Delegația pentru relațiile cu Republica Populară Chineză @ro
preferred label: Delegation für die Beziehungen zur Volksrepublik China @de
preferred label: Delegacija za odnose z Ljudsko republiko Kitajsko @sl
preferred label: Delegace pro vztahy s Čínskou lidovou republikou @cs
preferred label: An Toscaireacht don chaidreamh le Daon-Phoblacht na Síne @ga
preferred label: Delegación para las Relaciones con la República Popular China @es
preferred label: Suhteista Kiinan kansantasavaltaan vastaava valtuuskunta @fi
preferred label: Delegazzjoni għar-relazzjonijiet mar-Repubblika Popolari taċ-Ċina @mt
preferred label: Делегация за връзки с Китайската народна република @bg
preferred label: Delegácia pre vzťahy s Čínskou ľudovou republikou @sk
preferred label: Αντιπροσωπεία για τις σχέσεις με τη Λαϊκή Δημοκρατία της Κίνας @el
preferred label: A Kínai Népköztársasággal fenntartott kapcsolatokért felelős küldöttség @hu
preferred label: Izaslanstvo za odnose s Narodnom Republikom Kinom @hr
preferred label: Délégation pour les relations avec la République populaire de Chine @fr
preferred label: Delegazione per le relazioni con la Repubblica popolare cinese @it
preferred label: Delegação para as Relações com a República Popular da China @pt
preferred label: Delegatsioon Hiina Rahvavabariigiga suhtlemiseks @et
preferred label: Delegacja do spraw stosunków z Chińską Republiką Ludową @pl
preferred label: Delegationen för förbindelserna med Folkrepubliken Kina @sv
preferred label: Delegacija ryšiams su Kinijos Liaudies Respublika @lt
preferred label: Delegationen for Forbindelserne med Folkerepublikken Kina @da
preferred label: Delegācija attiecībām ar Ķīnas Tautas Republiku @lv
preferred label: Delegatie voor de betrekkingen met de Volksrepubliek China @nl

Italian Chamber of Deputies
type: Concept
created: 2023-10-31
deprecated: false
broader: National chamber
definition: Italian Chamber of Deputies.
in scheme: EP taxonomy on entities.
preferred label: italská Poslanecká sněmovna @cs
preferred label: Izba Deputowanych Włoch @pl
preferred label: det italienske Deputeretkammer @da
preferred label: talianska Poslanecká snemovňa @sk
preferred label: italienisches Abgeordnetenhaus @de
preferred label: Камара на депутатите на Италианската република @bg
preferred label: Cámara de Diputados italiana @es
preferred label: Câmara dos Deputados italiana @pt
preferred label: Camera dei deputati italiana @it
preferred label: Den italienska deputeradekammaren @sv
preferred label: Camera Deputaților din Italia @ro
preferred label: Teach Teachtaí na hIodáile @ga
preferred label: Itālijas parlamenta Deputātu palāta @lv
preferred label: Chambre des députés italienne @fr
preferred label: Kamra tad-Deputati Taljana @mt
preferred label: italijanska poslanska zbornica @sl
preferred label: Ιταλική Βουλή @el
preferred label: Itaalia Saadikutekoda @et
preferred label: olasz képviselőház @hu
preferred label: Italiaanse Kamer van Afgevaardigden @nl
preferred label: Italian edustajainhuone @fi
preferred label: Italijos Respublikos Deputatų Rūmai @lt
preferred label: talijanski Zastupnički dom @hr

Temporary parliamentary legislative committee
type: CorporateBodyClassification
type: Concept
created: 2023-10-31
deprecated: false
broader: Parliamentary delegation
definition: Delegation to Parliamentary assembly.
in scheme: EP taxonomy on entities.
preferred label: Dočasný parlamentný legislatívny výbor @sk
preferred label: Commissione legislativa parlamentare temporanea @it
preferred label: Parlamentin väliaikainen lainsäädäntövaliokunta @fi
preferred label: Kumitat leġiżlattiv parlamentari temporanju @mt
preferred label: Začasni parlamentarni zakonodajni odbor @sl
preferred label: Pagaidu parlamentārā likumdošanas komiteja @lv
preferred label: Comisión legislativa parlamentaria temporal @es
preferred label: Ideiglenes parlamenti jogalkotási bizottság @hu
preferred label: Dočasný parlamentní legislativní výbor @cs
preferred label: Ajutine parlamendi seadusandlik komisjon @et
preferred label: Privremeni parlamentarni zakonodavni odbor @hr
preferred label: Tillfälligt parlamentsutskott @sv
preferred label: Tijdelijke parlementaire wetgevingscommissie @nl
preferred label: Προσωρινή κοινοβουλευτική νομοθετική επιτροπή @el
preferred label: Midlertidigt parlamentsudvalg @da
preferred label: Временна парламентарна законодателна комисия @bg
preferred label: Commission législative parlementaire temporaire @fr
preferred label: Comissão legislativa parlamentar temporária @pt
preferred label: Tymczasowa parlamentarna komisja ustawodawcza @pl
preferred label: Comisia legislativă parlamentară temporară @ro
preferred label: Laikinasis Parlamento teisėkūros komitetas @lt
preferred label: Temporärer gesetzgebender parlamentarischer Ausschuss @de
preferred label: Coiste reachtach parlaiminteach sealadach @ga

Joint committee procedure - AFET and ENVI
type: Concept
created: 2023-10-31
deprecated: false
alternative label: Joint AFET - ENVI
alternative label: AFET und ENVI @de
alternative label: Commissions conjointes AFET - ENVI @fr
broader: Joint parliamentary committees
definition: Joint committee procedure - AFET and ENVI.
in scheme: EP taxonomy on entities.
preferred label: Gemeinsames Ausschussverfahren - AFET und ENVI @de
preferred label: Procédure avec commissions conjointes - AFET et ENVI @fr

Decentralised agency
type: Concept
created: 2023-10-31
deprecated: false
broader: EU agency
definition: European decentralised agency.
in scheme: EP taxonomy on entities.
preferred label: Αποκεντρωμένος οργανισμός @el
preferred label: Agência descentralizada @pt
preferred label: Decentralt agentur @da
preferred label: Gníomhaireacht dhíláraithe @ga
preferred label: Hajautettu virasto @fi
preferred label: Gedecentraliseerd agentschap @nl
preferred label: Detsentraliseeritud asutus @et
preferred label: Децентрализирана агенция @bg
preferred label: Agenție descentralizată @ro
preferred label: Agencia descentralizada @es
preferred label: Decentraliserad byrå @sv
preferred label: Decentralizirana agencija @sl
preferred label: Dezentrale Agentur @de
preferred label: Agenzia decentrata @it
preferred label: Agencja zdecentralizowana @pl
preferred label: Aġenzija deċentralizzata @mt
preferred label: Decentralizēta aģentūra @lv
preferred label: Decentralizovaná agentura @cs
preferred label: Decentralizuota agentūra @lt
preferred label: Decentralizovaná agentúra @sk
preferred label: Agence décentralisée @fr
preferred label: Decentralizált ügynökség @hu

Joint committee procedure - IMCO and TRAN
type: Concept
created: 2023-10-31
deprecated: false
alternative label: Joint IMCO - TRAN
alternative label: Commissions conjointes IMCO - TRAN @fr
alternative label: IMCO und TRAN @de
broader: Joint parliamentary committees
definition: Joint committee procedure - IMCO and TRAN.
in scheme: EP taxonomy on entities.
preferred label: Gemeinsames Ausschussverfahren - IMCO und TRAN @de
preferred label: Procédure avec commissions conjointes - IMCO et TRAN @fr

Joint committee procedure - ITRE and SANT
type: Concept
created: 2025-01-31
deprecated: false
alternative label: Joint ITRE - SANT
alternative label: ITRE und SANT @de
alternative label: Commissions conjointes ITRE - SANT @fr
broader: Joint parliamentary committees
definition: Joint committee procedure - ITRE and SANT.
in scheme: EP taxonomy on entities.
preferred label: Procédure avec commissions conjointes - ITRE et SANT @fr
preferred label: Gemeinsames Ausschussverfahren - ITRE und SANT @de

Joint committee procedure - SEDE and TRAN
type: Concept
created: 2025-04-30
deprecated: false
alternative label: Commissions conjointes SEDE - TRAN @fr
alternative label: SEDE und TRAN @de
alternative label: Joint SEDE - TRAN
broader: Joint parliamentary committees
definition: Joint committee procedure - SEDE and TRAN.
in scheme: EP taxonomy on entities.
preferred label: Procédure avec commissions conjointes - SEDE et TRAN @fr
preferred label: Gemeinsames Ausschussverfahren - SEDE und TRAN @de

Delegation to the Euronest Parliamentary Assembly
type: Concept
created: 2023-10-31
deprecated: false
broader: Temporary parliamentary legislative committee
definition: Delegation to the Euronest Parliamentary Assembly.
in scheme: EP taxonomy on entities.
preferred label: Izaslanstvo u Parlamentarnoj skupštini Euronesta @hr
preferred label: Delegatie in de Parlementaire Vergadering Euronest @nl
preferred label: Delegacija EURONEST parlamentinėje asamblėjoje @lt
preferred label: Délégation à l'Assemblée parlementaire Euronest @fr
preferred label: Delegatsioon Euronesti parlamentaarses assamblees @et
preferred label: Delegácia pri Parlamentnom zhromaždení Euronest @sk
preferred label: Valtuuskunta Euronestin parlamentaarisessa edustajakokouksessa @fi
preferred label: Delegationen till den parlamentariska församlingen Euronest @sv
preferred label: Delegationen til Den Parlamentariske Forsamling Euronest @da
preferred label: Delegación en la Asamblea Parlamentaria Euronest @es
preferred label: Az Euronest Parlamenti Közgyűlésbe delegált küldöttség @hu
preferred label: Delegazione all'Assemblea parlamentare Euronest @it
preferred label: Delegacja do Zgromadzenia Parlamentarnego Euronest @pl
preferred label: Delegacija pri parlamentarni skupščini Euronest @sl
preferred label: Delegazzjoni għall-Assemblea Parlamentari Euronest @mt
preferred label: Αντιπροσωπεία στην Κοινοβουλευτική Συνέλευση Euronest @el
preferred label: An Toscaireacht chun Tionól Parlaiminteach Euronest @ga
preferred label: Delegação à Assembleia Parlamentar Euronest @pt
preferred label: Delegation in der Parlamentarischen Versammlung Euronest @de
preferred label: Делегация в Парламентарна асамблея Евронест @bg
preferred label: Delegācija Euronest parlamentārajā asamblejā @lv
preferred label: Delegace v Parlamentním shromáždění Euronest @cs
preferred label: Delegația la Adunarea Parlamentară Euronest @ro

Committee of the Regions
type: Concept
created: 2023-10-31
deprecated: false
broader: EU body
definition: European Union's assembly of local and regional representatives voicing sub-national authorities within the EU's intistutional framework.
in scheme: EP taxonomy on entities.
preferred label: Regionsudvalget @da
preferred label: Comité des Régions @fr
preferred label: Ausschuß der Regionen @de
preferred label: Odbor regija @hr
preferred label: regioonide komitee @et
preferred label: Επιτροπή των ΙΙεριφερειών @el
preferred label: Komitet Regionów @pl
preferred label: Regionala kommittén @sv
preferred label: Comité de las Regiones @es
preferred label: Comité van de regio's @nl
preferred label: Coiste na Réigiún @ga
preferred label: Regionø komitetas @lt
preferred label: Odbor regij @sl
preferred label: Комитет на регионите @bg
preferred label: Výbor regiónov @sk
preferred label: Kumitat tar-Reġjunijiet @mt
preferred label: Comité das Regiões @pt
preferred label: Apgabalu komisija @lv
preferred label: Alueiden komitea @fi
preferred label: Régiók Bizottsága @hu
preferred label: Il Comitato delle regioni @it
preferred label: Výbor regionů @cs
preferred label: Comitetul Regiunilor @ro

Austrian National Council
type: Concept
created: 2023-10-31
deprecated: false
broader: National chamber
definition: Austrian National Council
in scheme: EP taxonomy on entities.
preferred label: austrijsko Nacionalno vijeće @hr
preferred label: Kunsill Nazzjonali Awstrijak @mt
preferred label: Comhairle Náisiúnta na hOstaire @ga
preferred label: Austrijas Nacionālā padome @lv
preferred label: Oostenrijkse Nationale Raad @nl
preferred label: österreichischer Nationalrat @de
preferred label: Austria Rahvusnõukogu @et
preferred label: rakouská Národní rada @cs
preferred label: Conseil national autrichien @fr
preferred label: Conselho Nacional austríaco @pt
preferred label: rakúska Národná rada @sk
preferred label: Национален съвет на Република Австрия @bg
preferred label: avstrijski državni zbor @sl
preferred label: Austrijos Respublikos Nacionalratas @lt
preferred label: Consiglio nazionale austriaco @it
preferred label: Consejo Nacional austríaco @es
preferred label: Det österrikiska nationalrådet @sv
preferred label: Consiliul Național al Austriei @ro
preferred label: Itävallan kansallisneuvosto @fi
preferred label: det østrigske Nationalråd @da
preferred label: osztrák nemzeti tanács @hu
preferred label: Rada Narodowa Austrii @pl
preferred label: Αυστριακό Εθνικό Συμβούλιο @el

National chamber
type: Concept
type: CorporateBodyClassification
created: 2023-10-31
deprecated: false
broader: National entities
definition: National Chamber.
in scheme: EP taxonomy on entities.
preferred label: Nacionalni dom @hr
preferred label: Câmara nacional @pt
preferred label: Izba krajowa @pl
preferred label: Kansallinen kamari @fi
preferred label: Nacionalna zbornica @sl
preferred label: Cameră națională @ro
preferred label: Nemzeti kamara @hu
preferred label: Det nationale kammer @da
preferred label: Εθνικό τμήμα @el
preferred label: Riiklik koda @et
preferred label: Cámara nacional @es
preferred label: Camera nazionale @it
preferred label: Národní komora @cs
preferred label: Nacionaliniai rūmai @lt
preferred label: Nationale kamer @nl
preferred label: Národná komora @sk
preferred label: Valsts palāta @lv
preferred label: Seomra tionóil náisiúnta @ga
preferred label: Chambre nationale @fr
preferred label: Nationella kammaren @sv
preferred label: Nationalkammer @de
preferred label: Национална камара @bg
preferred label: Kamra nazzjonali @mt

Delegation for relations with Australia and New Zealand
type: Concept
created: 2023-10-31
deprecated: false
alternative label: Australien, Nya Zeeland @sv
alternative label: Австралия, Нова Зеландия @bg
alternative label: Awstralja, New Zealand @mt
alternative label: Austrālija, Jaunzēlande @lv
alternative label: Austrálie, Nový Zéland @cs
alternative label: Avstralija, Nova Zelandija @sl
alternative label: Austrália, Nový Zéland @sk
alternative label: Australia, Nuova Zelanda @it
alternative label: Australia, Noua Zeelandă @ro
alternative label: Austrália, Nova Zelândia @pt
alternative label: Australija, Naujoji Zelandija @lt
alternative label: Australien, Neuseeland @de
alternative label: Australien, New Zealand @da
alternative label: An Astráil, An Nua-Shéalainn @ga
alternative label: Australija i Novi Zeland @hr
alternative label: Australie, Nouvelle-Zélande @fr
alternative label: Australia, Nowa Zelandia @pl
alternative label: Αυστραλία, Νέα Ζηλανδία @el
alternative label: Australië, Nieuw-Zeeland @nl
alternative label: Australia, Uusi-Seelanti @fi
alternative label: Austraalia, Uus-Meremaa @et
alternative label: Ausztrália, Új-Zéland @hu
alternative label: Australia, Nueva Zelanda @es
alternative label: Australia, New Zealand
broader: Parliamentary delegation
definition: Delegation for relations with Australia and New Zealand.
in scheme: EP taxonomy on entities.
preferred label: Delegacija za odnose z Avstralijo in Novo Zelandijo @sl
preferred label: Délégation pour les relations avec l'Australie et la Nouvelle-Zélande @fr
preferred label: Delegação para as Relações com a Austrália e a Nova Zelândia @pt
preferred label: Delegazione per le relazioni con l'Australia e la Nuova Zelanda @it
preferred label: Suhteista Australiaan ja Uuteen-Seelantiin vastaava valtuuskunta @fi
preferred label: Delegácia pre vzťahy s Austráliou a Novým Zélandom @sk
preferred label: Delegacja do spraw stosunków z Australią i Nową Zelandią @pl
preferred label: Delegatsioon Austraalia ja Uus-Meremaaga suhtlemiseks @et
preferred label: Delegace pro vztahy s Austrálií a Novým Zélandem @cs
preferred label: Delegația pentru relațiile cu Australia și Noua Zeelandă @ro
preferred label: Delegācija attiecībām ar Austrāliju un Jaunzēlandi @lv
preferred label: Делегация за връзки с Австралия и Нова Зеландия @bg
preferred label: Delegation für die Beziehungen zu Australien und Neuseeland @de
preferred label: Delegationen for Forbindelserne med Australien og New Zealand @da
preferred label: Delegacija ryšiams su Australija ir Naująja Zelandija @lt
preferred label: Delegatie voor de betrekkingen met Australië en Nieuw-Zeeland @nl
preferred label: Delegación para las Relaciones con Australia y Nueva Zelanda @es
preferred label: Delegazzjoni għar-relazzjonijiet mal-Awstralja u New Zealand @mt
preferred label: Az Ausztráliával és Új-Zélanddal fenntartott kapcsolatokért felelős küldöttség @hu
preferred label: Αντιπροσωπεία για τις σχέσεις με την Αυστραλία και τη Νέα Ζηλανδία @el
preferred label: An Toscaireacht don chaidreamh leis an Astráil agus leis an Nua-Shéalainn @ga
preferred label: Izaslanstvo za odnose s Australijom i Novim Zelandom @hr
preferred label: Delegationen för förbindelserna med Australien och Nya Zeeland @sv

Delegation to Joint Parliamentary Committee
type: Concept
type: CorporateBodyClassification
created: 2023-10-31
deprecated: false
broader: Parliamentary delegation
definition: Delegation to Joint Parliamentary Committee.
in scheme: EP taxonomy on entities.
preferred label: Délégation à la commission parlementaire mixte @fr
preferred label: Delegația la Comisia parlamentară mixtă @ro
preferred label: Delegacija pri skupnem parlamentarnem odboru @sl
preferred label: Delegationen till den gemensamma parlamentarikerkommittén @sv
preferred label: Delegazione alla commissione parlamentare mista @it
preferred label: Делегация в Съвместния парламентарен комитет @bg
preferred label: Delegatsioon parlamentaarses ühiskomisjonis @et
preferred label: Delegatie in de Gemengde Parlementaire Commissie @nl
preferred label: Delegācija Apvienotajā parlamentārajā komitejā @lv
preferred label: Delegationen til Det Blandede Parlamentariske Udvalg @da
preferred label: Delegação à Comissão Parlamentar Mista @pt
preferred label: Izaslanstvo u Zajedničkom parlamentarnom odboru @hr
preferred label: Delegation im Gemischten Parlamentarischen Ausschuss @de
preferred label: Delegazzjoni għall-Kumitat Parlamentari Konġunt @mt
preferred label: Delegace ve Smíšeném parlamentním výboru @cs
preferred label: An Toscaireacht chun an Chomhchoiste Pharlaimintigh @ga
preferred label: Αντιπροσωπεία στη Μικτή Κοινοβουλευτική Επιτροπή @el
preferred label: Delegación en la Comisión Parlamentaria Mixta @es
preferred label: Parlamenti vegyes bizottságba delegált küldöttség @hu
preferred label: Delegacija Jungtiniame parlamentiniame komitete @lt
preferred label: Delegacja do wspólnej komisji parlamentarnej @pl
preferred label: Valtuuskunta parlamentaarisessa sekavaliokunnassa @fi
preferred label: Delegácia pri Spoločnom parlamentnom výbore @sk

Subcommittee on Public Health
type: Concept
created: 2023-10-31
deprecated: true
alternative label: Visuomenės sveikata @lt
alternative label: Santé Publique @fr
alternative label: Δημόσια Υγεία @el
alternative label: Javno zdravlje @hr
alternative label: Saúde Pública @pt
alternative label: Saħħa pubblika @mt
alternative label: Folkhälsa @sv
alternative label: Javno zdravje @sl
alternative label: Öffentliche Gesundheit @de
alternative label: Folkesundhed @da
alternative label: Обществено здраве @bg
alternative label: Rahvatervis @et
alternative label: Sabiedrības veselība @lv
alternative label: Salud Pública @es
alternative label: Közegészségügy @hu
alternative label: Sanità pubblica @it
alternative label: Public Health
alternative label: Verejné zdravie @sk
alternative label: Volksgezondheid @nl
alternative label: Sănătate publică @ro
alternative label: Zdrowie Publiczne @pl
alternative label: Kansanterveys @fi
alternative label: veřejné zdraví @cs
alternative label: Sláinte Phoiblí @ga
broader: European parliamentary subcommittee
definition: European parliamentary subcommittee on public health.
in scheme: EP taxonomy on entities.
preferred label: Sabiedrības veselības apakškomiteja @lv
preferred label: Közegészségügyi Albizottság @hu
preferred label: Sottocommissione per la sanità pubblica @it
preferred label: Υποεπιτροπή Δημόσιας Υγείας @el
preferred label: podvýbor pro veřejné zdraví @cs
preferred label: Pododbor za javno zdravlje @hr
preferred label: Unterausschuss für öffentliche Gesundheit @de
preferred label: Podvýbor pre verejné zdravie @sk
preferred label: Podkomisja Zdrowia Publicznego @pl
preferred label: Subcommissie volksgezondheid @nl
preferred label: Sottokumitat għas-Saħħa Pubblika @mt
preferred label: Subcomisia pentru sănătate publică @ro
preferred label: Sous-commission de la santé publique @fr
preferred label: Pododbor za javno zdravje @sl
preferred label: Kansanterveyden alivaliokunta @fi
preferred label: An Fochoiste um Shláinte Phoiblí @ga
preferred label: Underudvalget om Folkesundhed @da
preferred label: Underutskottet för folkhälsa @sv
preferred label: Subcomissão da Saúde Pública @pt
preferred label: Visuomenės sveikatos pakomitetis @lt
preferred label: Subcomisión de Salud Pública @es
preferred label: Rahvatervise allkomisjon @et
preferred label: Подкомисия по обществено здраве @bg

EU body
type: Concept
created: 2023-10-31
deprecated: false
alternative label: EU-szervek @hu
alternative label: Tijela EU-a @hr
alternative label: Όργανα της ΕΕ @el
alternative label: Organi EU @sl
alternative label: Korpi tal-UE @mt
alternative label: EU:n elimet @fi
alternative label: Órganos de la UE @es
alternative label: EU-organen @nl
alternative label: Órgãos da UE @pt
alternative label: Органи на ЕС @bg
alternative label: Organes de l’UE @fr
alternative label: ES struktūras @lv
alternative label: Organe ale UE @ro
alternative label: EU bodies
alternative label: Organi dell’UE @it
alternative label: ES organai @lt
alternative label: EU-organer @da
alternative label: ELi organid @et
alternative label: EU-Einrichtungen @de
alternative label: Orgány EÚ @sk
alternative label: Orgány EU @cs
alternative label: Comhlachtaí an Aontais Eorpaigh @ga
alternative label: Organy UE @pl
definition: European body.
in scheme: EP taxonomy on entities.
preferred label: Όργανο της ΕΕ @el
preferred label: ES struktūra @lv
preferred label: Орган на ЕС @bg
preferred label: Organ al UE @ro
preferred label: Orgán EU @cs
preferred label: EU-szerv @hu
preferred label: EU-Einrichtung @de
preferred label: Organ UE @pl
preferred label: Organe de l’UE @fr
preferred label: Orgán EÚ @sk
preferred label: EU-organ @sv
preferred label: Organo dell’UE @it
preferred label: Korp tal-UE @mt
preferred label: EU-orgaan @nl
preferred label: EU:n elin @fi
preferred label: ES organas @lt
preferred label: Organ EU @sl
preferred label: Órgão da UE @pt
preferred label: ELi organ @et
preferred label: Tijelo EU-a @hr
preferred label: Comhlacht de chuid an AE @ga
preferred label: Órgano de la UE @es
top concept of: EP taxonomy on entities.

Joint committee procedure - ENVI and IMCO
type: Concept
created: 2023-10-31
deprecated: false
alternative label: ENVI und IMCO @de
alternative label: Commissions conjointes ENVI - IMCO @fr
alternative label: Joint ENVI - IMCO
broader: Joint parliamentary committees
definition: Joint committee procedure - ENVI and IMCO.
in scheme: EP taxonomy on entities.
preferred label: Procédure avec commissions conjointes - ENVI et IMCO @fr
preferred label: Gemeinsames Ausschussverfahren - ENVI und IMCO @de

Delegation for relations with the countries of the Andean Community
type: Concept
created: 2023-10-31
deprecated: false
alternative label: Andok Közösség @hu
alternative label: Andinska gemenskapen @sv
alternative label: Andų bendrija @lt
alternative label: Andean Community
alternative label: Andien yhteisö @fi
alternative label: Communauté andine @fr
alternative label: Andska zajednica @hr
alternative label: Andu Kopiena @lv
alternative label: Comunità andina @it
alternative label: Comhphobal na nAindéas @ga
alternative label: Andesgemeenschap @nl
alternative label: Andské spoločenstvo @sk
alternative label: Andské společenství @cs
alternative label: Comunidad Andina @es
alternative label: Andengemeinschaft @de
alternative label: Andinske Fællesskab @da
alternative label: Андска общност @bg
alternative label: Komunità Andina @mt
alternative label: Wspólnota Andyjska @pl
alternative label: Andska skupnost @sl
alternative label: Andide Ühenduse riigid @et
alternative label: Comunidade Andina @pt
alternative label: Κοινότητα τωνΆνδεων @el
alternative label: Comunitatea Andină @ro
broader: Parliamentary delegation
definition: Delegation for relations with the countries of the Andean Community.
in scheme: EP taxonomy on entities.
preferred label: Delegazione per le relazioni con i paesi della Comunità andina @it
preferred label: Αντιπροσωπεία για τις σχέσεις με τις χώρες της Κοινότητας τωνΆνδεων @el
preferred label: Delegation für die Beziehungen zu den Ländern der Andengemeinschaft @de
preferred label: Delegacija ryšiams su Andų bendrijos šalimis @lt
preferred label: Delegacija za odnose z državami Andske skupnosti @sl
preferred label: Delegação para as Relações com os Países da Comunidade Andina @pt
preferred label: Delegācija attiecībām ar Andu Kopienas valstīm @lv
preferred label: Делегация за връзки с държавите от Андската общност @bg
preferred label: Delegación para las Relaciones con los Países de la Comunidad Andina @es
preferred label: Delegatsioon Andide Ühenduse riikidega suhtlemiseks @et
preferred label: Delegationen för förbindelserna med länderna i Andinska gemenskapen @sv
preferred label: Delegatie voor de betrekkingen met de landen van de Andesgemeenschap @nl
preferred label: Toscaireacht don chaidreamh le tíortha Chomhphobal na nAindéas @ga
preferred label: Delegacja do spraw stosunków z państwami Wspólnoty Andyjskiej @pl
preferred label: Delegace pro vztahy se zeměmi Andského společenství @cs
preferred label: Delegația pentru relațiile cu țările din Comunitatea Andină @ro
preferred label: Delegácia pre vzťahy s krajinami Andského spoločenstva @sk
preferred label: Az Andok Közösség országaival fenntartott kapcsolatokért felelős küldöttség @hu
preferred label: Suhteista Andien yhteisön maihin vastaava valtuuskunta @fi
preferred label: Delegationen for Forbindelserne med Landene i Det Andinske Fællesskab @da
preferred label: Délégation pour les relations avec les pays de la Communauté andine @fr
preferred label: Delegazzjoni għar-relazzjonijiet mal-Komunità Andina @mt
preferred label: Izaslanstvo za odnose s državama Andske zajednice @hr

Estonian Parliament
type: Concept
created: 2023-10-31
deprecated: false
broader: National chamber
definition: Estonian Parliament.
in scheme: EP taxonomy on entities.
preferred label: Ests parlement @nl
preferred label: Igaunijas parlaments @lv
preferred label: Parlement estonien @fr
preferred label: Parlamento estone @it
preferred label: Εσθονικό Κοινοβούλιο @el
preferred label: Parlamento estónio @pt
preferred label: Парламент на Република Естония @bg
preferred label: Parlament Estonjan @mt
preferred label: estónsky parlament @sk
preferred label: estonski parlament @sl
preferred label: észt parlament @hu
preferred label: estnisches Parlament @de
preferred label: Viron parlamentti @fi
preferred label: Parlamentul Estoniei @ro
preferred label: Estonski parlament @hr
preferred label: Det estniska parlamentet @sv
preferred label: det estiske parlament @da
preferred label: Parlaimint na hEastóine @ga
preferred label: Estijos Respublikos Rygikogas @lt
preferred label: Eesti Riigikogu @et
preferred label: Zgromadzenie Państwowe Estonii @pl
preferred label: Parlamento estonio @es
preferred label: estonský parlament @cs

Committee on Fisheries
type: Concept
created: 2023-10-31
deprecated: false
alternative label: Pesca @es
alternative label: Fisheries
alternative label: Žuvininkystė @lt
alternative label: Pescuit @ro
alternative label: Fiskeri @sv
alternative label: Pêche @fr
alternative label: Iascach @ga
alternative label: Rybárstvo @sk
alternative label: Visserij @nl
alternative label: Kalandus @et
alternative label: Αλιεία @el
alternative label: Fischerei @de
alternative label: Halászat @hu
alternative label: Kalatalous @fi
alternative label: Рибно стопанство @bg
alternative label: Zivsaimniecība @lv
alternative label: Ribištvo @sl
alternative label: Pescas @pt
alternative label: Sajd @mt
alternative label: Rybołówstwo @pl
alternative label: Ribarstvo @hr
alternative label: Rybolov @cs
broader: Standing parliamentary committee
definition: European parliamentary committee on fisheries.
in scheme: EP taxonomy on entities.
preferred label: Fiskeriudvalget @da
preferred label: Comissão das Pescas @pt
preferred label: Fiskeriutskottet @sv
preferred label: Commissione per la pesca @it
preferred label: Fischereiausschuss @de
preferred label: Komisja Rybołówstwa @pl
preferred label: Žuvininkystės komitetas @lt
preferred label: Zivsaimniecības komiteja @lv
preferred label: Commission de la pêche @fr
preferred label: An Coiste um Iascach @ga
preferred label: Kumitat għas-Sajd @mt
preferred label: Odbor za ribištvo @sl
preferred label: Comisia pentru pescuit @ro
preferred label: Odbor za ribarstvo @hr
preferred label: Kalanduskomisjon @et
preferred label: Επιτροπή Αλιείας @el
preferred label: Výbor pro rybolov @cs
preferred label: Halászati Bizottság @hu
preferred label: Comisión de Pesca @es
preferred label: Kalatalousvaliokunta @fi
preferred label: Commissie visserij @nl
preferred label: Výbor pre rybárstvo @sk
preferred label: Комисия по рибно стопанство @bg

Committee on Development
type: Concept
created: 2023-10-31
deprecated: false
alternative label: Sviluppo @it
alternative label: Forbairt @ga
alternative label: Vystymasis @lt
alternative label: Развитие @bg
alternative label: Areng @et
alternative label: Razvoj @sl
alternative label: Development
alternative label: Udvikling @da
alternative label: Utveckling @sv
alternative label: Kehitys @fi
alternative label: Fejlesztés @hu
alternative label: Attīstība @lv
alternative label: Entwicklung @de
alternative label: Dezvoltare @ro
alternative label: Żvilupp @mt
alternative label: Desenvolvimento @pt
alternative label: Desarrollo @es
alternative label: Rozvoj @cs
alternative label: Ontwikkelingssamenwerking @nl
alternative label: Rozwój @pl
alternative label: Ανάπτυξη @el
alternative label: Développement @fr
broader: Standing parliamentary committee
definition: European parliamentary committee on development.
in scheme: EP taxonomy on entities.
preferred label: Komisja Rozwoju @pl
preferred label: Výbor pro rozvoj @cs
preferred label: Comisia pentru dezvoltare @ro
preferred label: Výbor pre rozvoj @sk
preferred label: Commissione per lo sviluppo @it
preferred label: Attīstības komiteja @lv
preferred label: Kehitysvaliokunta @fi
preferred label: Vystymosi komitetas @lt
preferred label: Entwicklungsausschuss @de
preferred label: Kumitat għall-Iżvilupp @mt
preferred label: Commission du développement @fr
preferred label: Comisión de Desarrollo @es
preferred label: Udviklingsudvalget @da
preferred label: Επιτροπή Ανάπτυξης @el
preferred label: Odbor za razvoj @hr
preferred label: Комисия по развитие @bg
preferred label: Utskottet för utveckling @sv
preferred label: Comissão do Desenvolvimento @pt
preferred label: Fejlesztési Bizottság @hu
preferred label: Commissie ontwikkelingssamenwerking @nl
preferred label: Arengukomisjon @et
preferred label: An Coiste um Fhorbairt @ga

European Union Agency for the Operational Management of Large-Scale IT Systems in the Area of Freedom, Security and Justice
type: Concept
created: 2023-10-31
deprecated: false
broader: Decentralised agency
definition: European Agency for the operational management of large-scale IT systems in the area of freedom, security and justice (EU-LISA).
in scheme: EP taxonomy on entities.
narrow match: LISA 2011 0
preferred label: Vapauden, turvallisuuden ja oikeuden alueen laaja-alaisten tietojärjestelmien operatiivisesta hallinnoinnista vastaava Euroopan unionin virasto @fi
preferred label: Agencija Evropske unije za operativno upravljanje obsežnih informacijskih sistemov s področja svobode, varnosti in pravice @sl
preferred label: Europeiska unionens byrå för den operativa förvaltningen av stora it-system inom området frihet, säkerhet och rättvisa @sv
preferred label: Agenția Uniunii Europene pentru Gestionarea Operațională a Sistemelor Informatice la Scară Largă în Spațiul de Libertate, Securitate și Justiție @ro
preferred label: Агенция на Европейския съюз за оперативното управление на широкомащабни информационни системи в пространството на свобода, сигурност и правосъдие @bg
preferred label: Den Europæiske Unions Agentur for den Operationelle Forvaltning af Store IT-Systemer inden for Området med Frihed, Sikkerhed og Retfærdighed @da
preferred label: Agentur der Europäischen Union für das Betriebsmanagement von IT-Großsystemen im Raum der Freiheit, der Sicherheit und des Rechts @de
preferred label: Eiropas Savienības Aģentūra lielapjoma IT sistēmu darbības pārvaldībai brīvības, drošības un tiesiskuma telpā @lv
preferred label: Οργανισμός της Ευρωπαϊκής Ένωσης για τη Λειτουργική Διαχείριση Συστημάτων ΤΠ Μεγάλης Κλίμακας στον Χώρο Ελευθερίας, Ασφάλειας και Δικαιοσύνης @el
preferred label: Vabadusel, Turvalisusel ja Õigusel Rajaneva Ala Suuremahuliste IT-süsteemide Operatiivjuhtimise Euroopa Liidu Amet @et
preferred label: Agencija Europske unije za operativno upravljanje opsežnim informacijskim sustavima u području slobode, sigurnosti i pravde @hr
preferred label: Agentschap van de Europese Unie voor het operationeel beheer van grootschalige IT-systemen op het gebied van vrijheid, veiligheid en recht @nl
preferred label: Agence de l’Union européenne pour la gestion opérationnelle des systèmes d’information à grande échelle au sein de l’espace de liberté, de sécurité et de justice @fr
preferred label: Gníomhaireacht an Aontais Eorpaigh chun Bainistiú Oibríochtúil a dhéanamh ar Chórais Mhórscála TF sa Limistéar Saoirse, Slándála agus Ceartais @ga
preferred label: Agenzia dell’Unione europea per la gestione operativa dei sistemi IT su larga scala nello spazio di libertà, sicurezza e giustizia @it
preferred label: Europos Sąjungos didelės apimties IT sistemų laisvės, saugumo ir teisingumo erdvėje operacijų valdymo agentūra @lt
preferred label: Agência da União Europeia para a Gestão Operacional de Sistemas Informáticos de Grande Escala no Espaço de Liberdade, Segurança e Justiça @pt
preferred label: Agencja Unii Europejskiej ds. Zarządzania Operacyjnego Wielkoskalowymi Systemami Informatycznymi w Przestrzeni Wolności, Bezpieczeństwa i Sprawiedliwości @pl
preferred label: L-Aġenzija tal-Unjoni Ewropea għat-Tmexxija Operattiva ta’ Sistemi tal-IT fuq Skala Kbira fl-Ispazju ta’ Libertà, Sigurtà u Ġustizzja @mt
preferred label: Agentúra Európskej únie na prevádzkové riadenie rozsiahlych informačných systémov v priestore slobody, bezpečnosti a spravodlivosti @sk
preferred label: Agentura Evropské unie pro provozní řízení rozsáhlých informačních systémů v prostoru svobody, bezpečnosti a práva @cs
preferred label: Agencia de la Unión Europea para la Gestión Operativa de Sistemas Informáticos de Gran Magnitud en el Espacio de Libertad, Seguridad y Justicia @es
preferred label: A Szabadságon, a Biztonságon és a Jog Érvényesülésén Alapuló Térség Nagyméretű IT-rendszereinek Üzemeltetési Igazgatását Végző Európai Uniós Ügynökség @hu

Delegation to the European Parliament/Portuguese Parliament Joint Committee
type: Concept
created: 2023-10-31
deprecated: true
alternative label: Асамблея на Португалската република @bg
alternative label: Delegatie naar de Gemengde Commissie Europees Parl @nl
alternative label: Adunarea Republicii Portugalia @ro
alternative label: Portugalijos Parlamentas @lt
alternative label: Assembleia da República de Portugal @pt
alternative label: Portuguese Parliament
alternative label: Portugál Parlament @hu
alternative label: Portugiesisches Parlament @de
alternative label: Parlaimint na Portaingéile @ga
alternative label: Portugalin parlamentti @fi
alternative label: Parlamento portugués @es
alternative label: Assemblea della Repubblica del Portogallo @it
alternative label: Portugalský parlament @sk
alternative label: Assemblée de la République du Portugal @fr
alternative label: Portugales parlaments @lv
alternative label: Portugalski parlament @sl
alternative label: Parlament Portugalski @pl
alternative label: Portugals parlament @sv
alternative label: Parlament Portugiz @mt
alternative label: Πορτογαλικό Κοινοβούλιο @el
alternative label: Portugali parlament @et
broader: Delegation to Joint Parliamentary Committee
definition: Delegation to the European Parliament/Portuguese Parliament Joint Committee.
in scheme: EP taxonomy on entities.
preferred label: Delegacija Eiropas Parlamenta /Portugales parlamenta kopigai komisijai @lv
preferred label: Delegation im Gemischten Ausschuss Europäisches Parlament/Portugiesisches Parlament @de
preferred label: Delegazione al comitato misto Parlamento europeo/Assemblea della Repubblica del Portogallo @it
preferred label: Az Európai Parlament/Portugál Interparlamentáris Bizottsághoz delegáltak @hu
preferred label: Valtuuskunta Euroopan parlamentin ja Portugalin parlamentin välisessä @fi
preferred label: Delegația la Comitetul mixt Parlamentul European-Adunarea Republicii Portugalia @ro
preferred label: Delegationen till det blandade utskottet Europaparlamentet-Portugals parlament @sv
preferred label: Delegácia pre spolocný výbor Európskeho parlamentu/Portugalského parlamentu @sk
preferred label: Delegacija skupnega odbora Evropskega in portugalskega parlamenta @sl
preferred label: Izaslanstvo u Zajedničkom parlamentarnom odboru Europskog parlamenta i portugalskog parlamenta @hr
preferred label: Delegazzjoni lill-Parlament Ewropew/Kumitat Maghqud Parlament Portugiz @mt
preferred label: Delegacija i Europos Parlamento ir Portugalijos parlamento Jungtini komiteta @lt
preferred label: Delegacja do Parlamentu Europejskiego/Wspólna Komisja Parlamentu Portugalskiego @pl
preferred label: Delegação à Comissão Parlamentar Mista Parlamento Europeu/Assembleia @pt
preferred label: Αντιπροσωπεία στη Μικτή Επιτροπή Ευροπαϊκό Κοινοδούλιο/Κοινοδούλιο της Δημοκρατίας της Πορτογαλίας @el
preferred label: Delegación en la Comisión Parlamentaria Mixta PE-Parlamento portugués @es
preferred label: Delegationen til det blandede udvalg Europa-Parlamentet/Portugals parlament @da
preferred label: Delegatie naar de Gemengde Commissie Europees Parlement/Parlementaire Vergadering van de Republiek Portugal @nl
preferred label: Делегация в Съвместния комитет Европейски парламент/Асамблея на Португалската република @bg
preferred label: Délégation au comité mixte Parlement européen/Assemblée de la République du Portugal @fr
preferred label: Delegatsioon Euroopa Parlamendi ja Portugali parlamendi ühiskomitees @et
preferred label: Delegace při smíšeném výboru Evropského parlamentu a Portugalského parlamentu @cs
preferred label: Toscaireacht chun Comhchoiste Pharlaimint na hEorpa/Pharlaimint na Portaingéile @ga

Conference of Committee Chairs
type: Concept
created: 2025-04-30
deprecated: false
broader: Governing entities
definition: Conference of Committee Chairs.
in scheme: EP taxonomy on entities.
preferred label: Comhdháil Chathaoirligh na gCoistí @ga
preferred label: Komiteju priekšsēdētāju konference @lv
preferred label: Conferencia de Presidentes de Comisión @es
preferred label: Διάσκεψη των Προέδρων των Επιτροπών @el
preferred label: Conferentie van commissievoorzitters @nl
preferred label: Komitetų pirmininkų sueiga @lt
preferred label: Conferenza dei presidenti di commissione @it
preferred label: Udvalgsformandskonferencen @da
preferred label: Konferenza tal-Presidenti tal-Kumitati @mt
preferred label: Konferencja Przewodniczących Komisji @pl
preferred label: Konferenca predsednikov odborov @sl
preferred label: Conferința președinților de comisie @ro
preferred label: Valiokuntien puheenjohtajakokous @fi
preferred label: Konferenz der Ausschussvorsitze @de
preferred label: Съвет на председателите на комисии @bg
preferred label: Konferencija predsjednika odbora @hr
preferred label: Konference předsedů výborů @cs
preferred label: Conférence des présidents des commissions @fr
preferred label: Konferencia predsedov výborov @sk
preferred label: Komisjonide esimeeste konverents @et
preferred label: Conferência dos Presidentes das Comissões @pt
preferred label: Utskottsordförandekonferensen @sv
preferred label: Bizottsági Elnökök Értekezlete @hu

Delegation for relations with the countries of Eastern Europe
type: Concept
created: 2023-10-31
deprecated: true
alternative label: Europa Oriental @es
alternative label: Oost-Europa @nl
alternative label: Europa dell'Est @it
alternative label: Ewropa tal-Lvant @mt
alternative label: Östeuropa @sv
alternative label: Eastern Europe
alternative label: Europa de Leste @pt
alternative label: Vzhodna Evropa @sl
alternative label: Østeuropa @da
alternative label: Kelet-Európa @hu
alternative label: Europe de l'Est @fr
alternative label: Itä-Eurooppa @fi
alternative label: Europa de Est @ro
alternative label: Ida-Euroopa @et
alternative label: Rytu Europa @lt
alternative label: Източна Европа @bg
alternative label: Východná Európa @sk
alternative label: Austrumeiropa @lv
alternative label: Europa Wschodnia @pl
alternative label: Oirthear na hEorpa @ga
alternative label: Ανατολική Ευρώπη @el
alternative label: Východní Evropa @cs
alternative label: Istočna Europa @hr
alternative label: Osteuropa @de
broader: Parliamentary delegation
definition: Delegation for relations with the countries of Eastern Europe.
in scheme: EP taxonomy on entities.
preferred label: Делегация за връзки със страните от Източна Европа @bg
preferred label: Ühenduse ja Ida-Euroopa riikide vaheliste suhetega tegelev delegatsioon @et
preferred label: Delegacija attiecibam ar Austrumeiropas valstim @lv
preferred label: Delegazzjoni ghar-relazzjonijiet mal-pajjizi ta’ l-Ewropa tal-Lvant @mt
preferred label: Αντιπροσωπεία για τις σχέσεις με τις χώρες της Ανατολικής Ευρώπης @el
preferred label: Delegationen for Forbindelserne med landerne i Østeurope @da
preferred label: Delegacija za odnose z državami vzhodne Evrope @sl
preferred label: Delegation für die Beziehungen zu den Ländern Osteuropas @de
preferred label: Delegacja ds. stosunków z panstwami Europy Wschodniej @pl
preferred label: Delegação para as relações com os países da Europa de Leste @pt
preferred label: Delegatie voor de betrekkingen met de Oosteuropese landen @nl
preferred label: A Kelet-Európával való kapcsolatokért felelos küldöttség @hu
preferred label: Delegația pentru relațiile cu țările din Europa de Est @ro
preferred label: Delegácia pre vztahy s krajinami východnej Európy @sk
preferred label: Delegationen för förbindelserna med länderna i Östeuropa @sv
preferred label: Izaslanstvo za odnose sa zemljama Istočne Europe @hr
preferred label: Delegazione per le relazioni con i paesi dell'Europa dell'Est @it
preferred label: Suhteista Itä-Euroopan maihin vastaava valtuuskunta @fi
preferred label: Delegacija ryšiams su Rytu Europos šalimis @lt
preferred label: Délégation pour les relations avec les pays de l'Europe de l'Est @fr
preferred label: Delegace pro vztahy se zeměmi východní Evropy @cs
preferred label: Toscaireacht don chaidreamh le tíortha Oirthear na hEorpa @ga
preferred label: Delegación para las relaciones con los países de la Europa Oriental @es

Joint committee procedure - INTA and LIBE
type: CorporateBodyClassification
type: Concept
created: 2025-12-31
deprecated: false
alternative label: Commissions conjointes INTA - LIBE @fr
alternative label: Joint INTA - LIBE
alternative label: INTA und LIBE @de
broader: Joint parliamentary committees
definition: Joint committee procedure - INTA and LIBE.
in scheme: EP taxonomy on entities.
preferred label: Gemeinsames Ausschussverfahren - INTA und LIBE @de
preferred label: Procédure avec commissions conjointes - INTA et LIBE @fr

Joint committee procedure - CULT and LIBE
type: Concept
created: 2025-08-31
deprecated: false
alternative label: CULT und LIBE @de
alternative label: Commissions conjointes CULT - LIBE @fr
alternative label: Joint CULT - LIBE
broader: Joint parliamentary committees
definition: Joint committee procedure - CULT and LIBE.
in scheme: EP taxonomy on entities.
preferred label: Gemeinsames Ausschussverfahren - CULT und LIBE @de
preferred label: Procédure avec commissions conjointes - CULT et LIBE @fr

Committee on Budgets
type: Concept
created: 2023-10-31
deprecated: false
alternative label: Budgets
alternative label: Orçamentos @pt
alternative label: Baġits @mt
alternative label: Budjetti @fi
alternative label: Προϋπολογισμοί @el
alternative label: Buiséid @ga
alternative label: Budget @sv
alternative label: Haushalt @de
alternative label: Proračuni @hr
alternative label: Eelarve @et
alternative label: Begroting @nl
alternative label: Biudžetas @lt
alternative label: Rozpočet @sk
alternative label: Bilanci @it
alternative label: Presupuestos @es
alternative label: Бюджети @bg
alternative label: Bugete @ro
alternative label: Proračun @sl
alternative label: Budżet @pl
alternative label: Költségvetés @hu
alternative label: Budžets @lv
broader: Standing parliamentary committee
definition: European parliamentary committee on budgets.
in scheme: EP taxonomy on entities.
preferred label: Rozpočtový výbor @cs
preferred label: Comisión de Presupuestos @es
preferred label: Eelarvekomisjon @et
preferred label: Commissione per i bilanci @it
preferred label: Комисия по бюджети @bg
preferred label: Odbor za proračun @sl
preferred label: Begrotingscommissie @nl
preferred label: Budgetutskottet @sv
preferred label: Budžeta komiteja @lv
preferred label: An Coiste um Buiséid @ga
preferred label: Výbor pre rozpočet @sk
preferred label: Budgetudvalget @da
preferred label: Odbor za proračune @hr
preferred label: Επιτροπή Προϋπολογισμών @el
preferred label: Komisja Budżetowa @pl
preferred label: Budjettivaliokunta @fi
preferred label: Kumitat għall-Baġits @mt
preferred label: Költségvetési Bizottság @hu
preferred label: Commission des budgets @fr
preferred label: Biudžeto komitetas @lt
preferred label: Comisia pentru bugete @ro
preferred label: Haushaltsausschuss @de
preferred label: Comissão dos Orçamentos @pt

Slovene National Assembly
type: Concept
created: 2023-10-31
deprecated: false
broader: National chamber
definition: Slovene National Assembly.
in scheme: EP taxonomy on entities.
preferred label: Sloveenia Riigikogu @et
preferred label: Национално събрание на Република Словения @bg
preferred label: Slovenian kansalliskokous @fi
preferred label: Assemblée nationale slovène @fr
preferred label: Assemblea Nazzjonali Slovena @mt
preferred label: slovenski Državni zbor @hr
preferred label: Asamblea Nacional eslovena @es
preferred label: slowenische Staatsversammlung @de
preferred label: den slovenske Nationalforsamling @da
preferred label: slovinské Státní shromáždění @cs
preferred label: Assemblea nazionale slovena @it
preferred label: Assembleia Nacional eslovena @pt
preferred label: slovenski državni zbor @sl
preferred label: Slovēnijas Nacionālā asambleja @lv
preferred label: szlovén nemzetgyűlés @hu
preferred label: Sloveense Nationale Vergadering @nl
preferred label: Tionól Náisiúnta na Slóivéine @ga
preferred label: slovinské Štátne zhromaždenie @sk
preferred label: Slovėnijos Respublikos Valstybės Susirinkimas @lt
preferred label: Den slovenska nationalförsamlingen @sv
preferred label: Zgromadzenie Państwowe Słowenii @pl
preferred label: Σλοβενική Εθνοσυνέλευση @el
preferred label: Adunarea Națională din Slovenia @ro

European Climate, Infrastructure and Environment Executive Agency
type: Concept
created: 2023-10-31
deprecated: false
broader: Executive agency
definition: European Climate, Infrastructure and Environment Executive Agency.
in scheme: EP taxonomy on entities.
preferred label: Agência de Execução Europeia do Clima, das Infraestruturas e do Ambiente @pt
preferred label: Evropska izvajalska agencija za podnebje, infrastrukturo in okolje @sl
preferred label: Европейска изпълнителна агенция за климата, инфраструктурата и околната среда @bg
preferred label: Agenzia esecutiva europea per il clima, l’infrastruttura e l’ambiente @it
preferred label: Det Europæiske Forvaltningsorgan for Klima, Infrastruktur og Miljø @da
preferred label: Europees Uitvoerend Agentschap klimaat, infrastructuur en milieu @nl
preferred label: Európska výkonná agentúra pre klímu, infraštruktúru a životné prostredie @sk
preferred label: Agencia Ejecutiva Europea de Clima, Infraestructuras y Medio Ambiente @es
preferred label: Evropská výkonná agentura pro klima, infrastrukturu a životní prostředí @cs
preferred label: Eiropas Klimata, infrastruktūras un vides izpildaģentūra @lv
preferred label: Ευρωπαϊκός Εκτελεστικός Οργανισμός για το Κλίμα, τις Υποδομές και το Περιβάλλον @el
preferred label: Europos klimato, infrastruktūros ir aplinkos vykdomoji įstaiga @lt
preferred label: Euroopa Kliima, Taristu ja Keskkonna Rakendusamet @et
preferred label: Europejska Agencja Wykonawcza ds. Klimatu, Infrastruktury i Środowiska @pl
preferred label: Europska izvršna agencija za klimu, infrastrukturu i okoliš @hr
preferred label: Agenția Executivă Europeană pentru Climă, Infrastructură și Mediu @ro
preferred label: Európai Éghajlat-politikai, Környezetvédelmi és Infrastrukturális Végrehajtó Ügynökség @hu
preferred label: Europäische Exekutivagentur für Klima, Infrastruktur und Umwelt @de
preferred label: Agence exécutive européenne pour le climat, les infrastructures et l’environnement @fr
preferred label: Euroopan ilmasto-, infrastruktuuri- ja ympäristöasioiden toimeenpanovirasto @fi
preferred label: An Ghníomhaireacht Feidhmiúcháin Eorpach um an Aeráid, Bonneagar agus Comhshaol @ga
preferred label: L-Aġenzija Eżekuttiva Ewropea għall-Klima, għall-Infrastruttura u għall-Ambjent @mt
preferred label: Europeiska genomförandeorganet för klimat, infrastruktur och miljö @sv

Delegation for relations with the Committee of EFTA Parliamentarians
type: Concept
created: 2023-10-31
deprecated: true
alternative label: Comité de Parlamentarios de la EFTA @es
alternative label: Komisja parlamentarzystów panstw EFTA @pl
alternative label: Výbor pro parlamentní zástupce ESVO @cs
alternative label: Kumitat ta’ Parlamentari EFTA @mt
alternative label: Επιτροπή Βουλευτών ΕΖΕΣ @el
alternative label: Comité de parlementaires de l'AELE @fr
alternative label: Comité de Parlamentares da EFTA @pt
alternative label: EFTA parlamendiliikmete komitee @et
alternative label: Výbor poslancov parlamentov EFTA @sk
alternative label: Odbor parlamentarcev držav EFTA @sl
alternative label: EFTA's Parlamentariske Komité @da
alternative label: Comitato dei parlamentari dell'EFTA @it
alternative label: EFTA Parlamenti Tagok Bizottsága @hu
alternative label: Ausschuß der Abgeordneten der EFTA @de
alternative label: Комитет на парламентаристите от ЕАСТ @bg
alternative label: EFTA-maiden parlamenttien jäsenten komitea @fi
alternative label: EFTA parlamentariešu komisija @lv
alternative label: Eftas parlamentarikerkommitté @sv
alternative label: Comitetul parlamentar al AELS @ro
alternative label: Committee of EFTA Parliamentarians
alternative label: Odbor zastupnika EFTA-e @hr
alternative label: Coiste Parlaiminteoirí CSTE @ga
alternative label: EFTA parlamentaru komitetas @lt
alternative label: Delegatie voor de betrekkingen met de Commissie va @nl
broader: Parliamentary delegation
definition: Delegation for relations with the Committee of EFTA Parliamentarians.
in scheme: EP taxonomy on entities.
preferred label: Delegationen för förbindelserna med Eftas parlamentarikerkommitté @sv
preferred label: Délégation pour les relations avec le Comité de parlementaires de l'AELE @fr
preferred label: Ühenduse ja EFTA parlamendiliikmete komitee vaheliste suhetega tegelev delegatsioon @et
preferred label: Αντιπροσωπεία για τις σχέσεις με την Επιτροπή Κοινοβουλευτικών της ΕΖΕΣ @el
preferred label: Delegation für die Beziehungen zu dem Ausschuss der Abgeordneten der EFTA @de
preferred label: Delegatie voor de betrekkingen met de Commissie van parlementsleden uit de EVA-landen @nl
preferred label: Delegazione per le relazioni con il Comitato dei parlamentari dell'EFTA @it
preferred label: Delegacija attiecibam ar EFTA parlamentariešu komisiju @lv
preferred label: Delegacija za odnose z Odborom parlamentarcev držav EFTA @sl
preferred label: Delegación para las relaciones con el Comité de parlamentarios de la EFTA @es
preferred label: Az EFTA Parlamenti Tagok Bizottságával való kapcsolatokért felelos küldöttség @hu
preferred label: Delegace pro vztahy v Výborem parlamentních zástupců ESVO @cs
preferred label: Suhteista EFTA-maiden parlamenttien jäsenten komiteaan vastaava @fi
preferred label: Delegação para as relações com o Comité de Parlamentares da EFTA @pt
preferred label: Delegacja ds. stosunków z Komisja Parlamentarzystów Panstw EFTA @pl
preferred label: Delegacija ryšiams su EFTA parlamentaru komitetu @lt
preferred label: Toscaireacht don chaidreamh le Coiste Parlaiminteoirí CSTE @ga
preferred label: Delegația pentru relațiile cu Comitetul parlamentar al AELS @ro
preferred label: Izaslanstvo za odnose s Odborom zastupnika EFTA-e @hr
preferred label: Delegationen for Forbindelserne med EFTAs Parlamentariske Komite @da
preferred label: Delegazzjoni ghar-relazzjonijiet mal-Kumitat tal-Parlamentari EFTA @mt
preferred label: Делегация за връзки с Комитета на парламентаристите от ЕАСТ @bg
preferred label: Delegácia pre vztahy s Výborom poslancov parlamentu EFTA @sk

Slovak Parliament
type: Concept
created: 2023-10-31
deprecated: false
broader: National chamber
definition: Slovak Parliament.
in scheme: EP taxonomy on entities.
preferred label: Parlamentul Slovaciei @ro
preferred label: Parlaimint na Slóvaice @ga
preferred label: Σλοβακικό Εθνικό Συμβούλιο @el
preferred label: slovaški državni svet @sl
preferred label: slovenská Národní rada @cs
preferred label: Slovākijas parlaments @lv
preferred label: Slovakian parlamentti @fi
preferred label: szlovák nemzeti tanács @hu
preferred label: Slowaaks parlement @nl
preferred label: Parlament Slovakk @mt
preferred label: slowakisches Parlament @de
preferred label: Национален съвет на Словашката република @bg
preferred label: Parlement slovaque @fr
preferred label: det slovakiske parlament @da
preferred label: Slovakkia Rahvuskogu @et
preferred label: Slovakijos Respublikos Nacionalinė Rada @lt
preferred label: Det slovakiska parlamentet @sv
preferred label: Národná rada Slovenskej republiky @sk
preferred label: Rada Narodowa Słowacji @pl
preferred label: Parlamento eslovaco @es
preferred label: slovačko Nacionalno vijeće @hr
preferred label: Parlamento slovacco @it

Joint committee procedure - TRAN and AGRI
type: Concept
created: 2024-02-08
deprecated: false
alternative label: Commissions conjointes TRAN - AGRI @fr
alternative label: Joint TRAN - AGRI
alternative label: TRAN und AGRI @de
broader: Joint parliamentary committees
definition: Joint committee procedure - TRAN and AGRI.
in scheme: EP taxonomy on entities.
preferred label: Procédure avec commissions conjointes - TRAN et AGRI @fr
preferred label: Gemeinsames Ausschussverfahren - TRAN und AGRI @de

Special Committee on the COVID-19 pandemic: lessons learned and recommendations for the future
type: Concept
created: 2023-10-31
deprecated: true
alternative label: Pandemie onemocnění COVID-19: získané zkušenosti a doporučení pro budoucnost @cs
alternative label: Pandemija COVID-19: pridobljene izkušnje in priporočila za prihodnost @sl
alternative label: Covid-19-pandemiasta saadut kokemukset ja suositukset tulevaisuutta varten @fi
alternative label: Covid19-világjárvány: tanulságok és ajánlások a jövőre nézve @hu
alternative label: Пандемията от COVID-19: извлечени поуки и препоръки за бъдещето @bg
alternative label: COVID‑19-pandemie: geleerde lessen en aanbevelingen voor de toekomst @nl
alternative label: Paindéim COVID-19: ceachtanna a foghlaimíodh agus moltaí don todhchaí @ga
alternative label: Pandemia di COVID-19: insegnamenti tratti e raccomandazioni per il futuro @it
alternative label: Pandemia COVID-19: wyciągnięte wnioski i zalecenia na przyszłość @pl
alternative label: COVID-19 pandemijos metu įgyta patirtis ir rekomendacijos ateičiai @lt
alternative label: Πανδημία της COVID-19: διδάγματα που αντλήθηκαν και συστάσεις για το μέλλον @el
alternative label: Pandemia de COVID-19: Ensinamentos Retirados e Recomendações para o Futuro @pt
alternative label: Pandémie de COVID-19: Leçons tirées et recommandations pour l’avenir @fr
alternative label: Pandemia de COVID-19: învățămintele desprinse și recomandări pentru viitor @ro
alternative label: Erkenntnisse aus der COVID-19-Pandemie und Empfehlungen für die Zukunft @de
alternative label: Pandemija bolesti COVID-19: stečena iskustva i preporuke za budućnost @hr
alternative label: Pandemia de COVID-19: Enseñanzas Extraídas y Recomendaciones para el Futuro @es
alternative label: COVID-19 pandeemiast saadud kogemused ja tulevikuks mõeldud soovitused @et
alternative label: Covid-19-pandemin: lärdomar och rekommendationer inför framtiden @sv
alternative label: Covid-19-pandemien: indhøstede erfaringer og anbefalinger for fremtiden @da
alternative label: Pandémia ochorenia COVID-19: získané skúsenosti a odporúčania do budúcnosti @sk
alternative label: Pandemija tal-COVID-19: Tagħlimiet Meħuda u Rakkomandazzjonijiet għall-Futur @mt
alternative label: COVID-19 pandemic: lessons learned and recommendations for the future
alternative label: Covid-19 pandēmijā gūtā pieredze un ieteikumi nākotnei @lv
broader: Special parliamentary committee
definition: The COVI Committee has been tasked with looking into how the Union's response to the pandemic and the lessons learned can contribute to future action. The work will focus on four key pillars: health, democracy and fundamental rights, societal and economic impact, and the EU and the World.
in scheme: EP taxonomy on entities.
preferred label: Kumitat Speċjali dwar il-Pandemija tal-COVID-19: Tagħlimiet Meħuda u Rakkomandazzjonijiet għall-Futur @mt
preferred label: Специална комисия относно пандемията от COVID-19: извлечени поуки и препоръки за бъдещето @bg
preferred label: An Coiste Speisialta um Paindéim COVID-19: ceachtanna a foghlaimíodh agus moltaí don todhchaí @ga
preferred label: Zvláštní výbor pro pandemii onemocnění COVID-19: získané zkušenosti a doporučení pro budoucnost @cs
preferred label: Posebni odbor za pandemijo COVID-19: pridobljene izkušnje in priporočila za prihodnost @sl
preferred label: Comisión Especial sobre la Pandemia de COVID-19: Enseñanzas Extraídas y Recomendaciones para el Futuro @es
preferred label: COVID‑19 pandeemiast saadud kogemuste ja tulevikuks mõeldud soovituste erikomisjon @et
preferred label: Komisja Specjalna ds. Pandemii COVID-19: wyciągnięte wnioski i zalecenia na przyszłość @pl
preferred label: A Covid19-világjárvánnyal, a levont tanulságokkal és a jövőre vonatkozó ajánlásokkal foglalkozó különbizottság @hu
preferred label: Covid-19-pandemiasta saatuja kokemuksia ja suosituksia tulevaisuutta varten käsittelevä erityisvaliokunta @fi
preferred label: Ειδική Επιτροπή για την πανδημία της COVID-19: διδάγματα που αντλήθηκαν και συστάσεις για το μέλλον @el
preferred label: Specialusis COVID-19 pandemijos metu įgytos patirties ir rekomendacijų ateičiai komitetas @lt
preferred label: Osobitný výbor pre pandémiu ochorenia COVID-19: získané skúsenosti a odporúčania do budúcnosti @sk
preferred label: Särskilda utskottet för covid-19-pandemin: lärdomar och rekommendationer inför framtiden @sv
preferred label: Commission spéciale sur la pandémie de COVID-19: Leçons tirées et recommandations pour l’avenir @fr
preferred label: Sonderausschuss zu den Erkenntnissen aus der COVID-19-Pandemie und Empfehlungen für die Zukunft @de
preferred label: Bijzondere Commissie COVID-19-pandemie: geleerde lessen en aanbevelingen voor de toekomst @nl
preferred label: Comisia specială privind pandemia de COVID-19: învățămintele desprinse și recomandări pentru viitor @ro
preferred label: Posebni odbor za pandemiju bolesti COVID-19: stečena iskustva i preporuke za budućnost @hr
preferred label: Særligt udvalg om covid-19-pandemien: indhøstede erfaringer og anbefalinger for fremtiden @da
preferred label: Commissione speciale sulla pandemia di COVID-19: insegnamenti tratti e raccomandazioni per il futuro @it
preferred label: Īpašā komiteja attiecībā uz Covid-19 pandēmijā gūto pieredzi un ieteikumiem nākotnei @lv
preferred label: Comissão Especial sobre a Pandemia de COVID-19: Ensinamentos Retirados e Recomendações para o Futuro @pt

European High-Performance Computing Joint Undertaking
type: Concept
created: 2023-10-31
deprecated: false
broader: EU joint undertaking
definition: European High-Performance Computing Joint Undertaking.
in scheme: EP taxonomy on entities.
preferred label: Zajedničko poduzeće za europsko računalstvo visokih performansi @hr
preferred label: L-Impriża Konġunta għall-Computing ta’ Prestazzjoni Għolja Ewropew @mt
preferred label: Společný podnik pro evropskou vysoce výkonnou výpočetní techniku @cs
preferred label: Gemeenschappelijke Onderneming Europese high-performance computing @nl
preferred label: Skupno podjetje za evropsko visokozmogljivostno računalništvo @sl
preferred label: Europos našiosios kompiuterijos bendroji įmonė @lt
preferred label: Κοινή επιχείρηση για την ευρωπαϊκή υπολογιστική υψηλών επιδόσεων @el
preferred label: Fællesforetagende for europæisk højtydende databehandling @da
preferred label: Entreprise commune pour le calcul à haute performance européen @fr
preferred label: Empresa Común de Informática de Alto Rendimiento Europea @es
preferred label: Întreprinderea comună pentru calculul european de înaltă performanță @ro
preferred label: Euroopa kõrgjõudlusega andmetöötluse ühisettevõte @et
preferred label: Európai nagy teljesítményű számítástechnika közös vállalkozás @hu
preferred label: Wspólne Przedsięwzięcie w dziedzinie Europejskich Obliczeń Wielkiej Skali @pl
preferred label: Euroopan suurteholaskennan yhteisyritys @fi
preferred label: Empresa Comum para a Computação Europeia de Alto Desempenho @pt
preferred label: Spoločný podnik pre európsku vysokovýkonnú výpočtovú techniku @sk
preferred label: Impresa comune per il calcolo ad alte prestazioni europeo @it
preferred label: Съвместно предприятие за европейски високопроизводителни изчислителни технологии @bg
preferred label: Det gemensamma företaget för ett europeiskt högpresterande datorsystem @sv
preferred label: Gemeinsames Unternehmen für europäisches Hochleistungsrechnen @de
preferred label: Eiropas augstas veiktspējas datošanas kopuzņēmums @lv
preferred label: Comhghnóthas Ríomhaireachta Ardfheidhmíochta Eorpach @ga

Joint committee procedure - ITRE and SEDE
type: Concept
created: 2025-03-31
deprecated: false
alternative label: Commissions conjointes ITRE - SEDE @fr
alternative label: Joint ITRE - SEDE
alternative label: ITRE und SEDE @de
broader: Joint parliamentary committees
definition: Joint committee procedure - ITRE and SEDE.
in scheme: EP taxonomy on entities.
preferred label: Procédure avec commissions conjointes - ITRE et SEDE @fr
preferred label: Gemeinsames Ausschussverfahren - ITRE und SEDE @de

Joint committee procedure - LIBE and TRAN
type: Concept
created: 2025-01-31
deprecated: false
alternative label: LIBE und TRAN @de
alternative label: Commissions conjointes LIBE - TRAN @fr
alternative label: Joint LIBE - TRAN
broader: Joint parliamentary committees
definition: Joint committee procedure - LIBE and TRAN.
in scheme: EP taxonomy on entities.
preferred label: Procédure avec commissions conjointes - LIBE et TRAN @fr
preferred label: Gemeinsames Ausschussverfahren - LIBE und TRAN @de

Temporary committee of inquiry into the Community Transit System
type: Concept
created: 2023-10-31
deprecated: true
alternative label: Undersökning om gemenskapens transiteringssystem @sv
alternative label: Bendrijos perejimo sistemos tyrinejimas @lt
alternative label: Inquiry into the Community Transit System
alternative label: Expertní skupina pro systém komunitárního tranzitu @cs
alternative label: Untersuchung ?Gemeinschaftl. Versandverfahren? @de
alternative label: Inchiesta sul regime di transito comunitario @it
alternative label: Εξεταστική επιτροπή-Κοινοτική διαμετακόμιση @el
alternative label: Inquérito ao Regime de Trânsito @pt
alternative label: Preverovanie tranzitného systému spolocenstva @sk
alternative label: A Közösségi Szállítási Rendszer vizsgálata @hu
alternative label: Анкета за транзитния режим на Общността @bg
alternative label: Fiosrúchán maidir le Córas Taistil an Chomhphobail @ga
alternative label: Yhteisön passitusjärjestelmän tutkinta @fi
alternative label: Tijdelijke Enquêtecommissie communautair douanever @nl
alternative label: Istraga o tranzitnom sustavu Zajednice @hr
alternative label: Preiskava – tranzitni sistem Skupnosti @sl
alternative label: Ancheta privind regimul de tranzit comunitar @ro
alternative label: Kopienas tranzita sistemas izpete @lv
alternative label: Dochodzenie w sprawie Wspólnotowego Systemu Tranzytowego @pl
alternative label: Undersøgelse vedrørende fællesskabsforsendelse @da
alternative label: Enquête sur le régime de transit communautaire @fr
alternative label: Inkjesta fis-Sistema Komunitarja ta’ Tranzitu @mt
alternative label: Investigación régimen tránsito comunitario @es
alternative label: Ühenduse transiidisüsteemi komitee @et
broader: Temporary parliamentary committee
definition: European temporary parliamentary committee on the alleged use of European countries by the CIA for the transport and illegal detention of prisoners.
in scheme: EP taxonomy on entities.
preferred label: Comisia temporară de anchetă privind regimul de tranzit comunitar @ro
preferred label: Bendrijos perejimo sistemos tyrinejimo laikinasis komitetas @lt
preferred label: Commissione temporanea di inchiesta sul regime di transito comunitario @it
preferred label: Tijdelijke Enquêtecommissie communautair douanevervoer @nl
preferred label: Kumitat temporanju ta’ inkjesta fis-Sistema Komunitarja ta’ Tranzitu @mt
preferred label: Comissão Temporária de Inquérito ao Regime de Trânsito Comunitário @pt
preferred label: Začasni odbor preiskovalni odbor za tranzitni sistem Skupnosti @sl
preferred label: Ühenduse transiidisüsteemiga tegelev ajutine uurimiskomitee @et
preferred label: Προσωρινή εξεταστική επιτροπή για το καθεστώς κοινοτικής διαμετακόμισης @el
preferred label: Dočasná expertní skupina pro systém komunitárního tranzitu @cs
preferred label: Comisión temporal de investigación sobre el régimen de tránsito comunitario @es
preferred label: Docasný výbor pre preverovanie tranzitného systému spolocenstva @sk
preferred label: Det Midlertidige Undersøgelsesudvalg om Ordningen for Fællesskabsforsendelse @da
preferred label: Tillfällig undersökningskommitté för gemenskapens transiteringssystem @sv
preferred label: Commission temporaire d'enquête sur le régime de transit communautaire @fr
preferred label: Nichtständiger Untersuchungsausschuß für das gemeinschaftliche Versandverfahren @de
preferred label: A Közösségi Szállítási Rendszer vizsgálatára felállított ideiglenes Bizottság @hu
preferred label: Tymczasowa komisja ds. Dochodzenia w Sprawie Wspólnotowego Systemu Tranzytu @pl
preferred label: Privremeni istražni odbor za tranzitni sustav Zajednice @hr
preferred label: Coiste sealadach fiosrúcháin maidir le Córas Taistil an Chomhphobail @ga
preferred label: Väliaikainen yhteisön passitusjärjestelmän tutkintavaliokunta @fi
preferred label: Kopienas tranzita sistemas izpetes pagaidu komisija @lv
preferred label: Временна анкетна комисия по транзитния режим на Общността @bg

Joint committee procedure - AGRI, BUDG and REGI
type: Concept
type: CorporateBodyClassification
created: 2025-10-31
deprecated: false
alternative label: AGRI, BUDG und REGI @de
alternative label: Commissions conjointes AGRI - BUDG - REGI @fr
alternative label: Joint AGRI - BUDG - REGI
broader: Joint parliamentary committees
definition: Joint committee procedure - AGRI, BUDG and REGI.
in scheme: EP taxonomy on entities.
preferred label: Procédure avec commissions conjointes - AGRI, BUDG et REGI @fr
preferred label: Gemeinsames Ausschussverfahren - AGRI, BUDG und REGI @de

European Union Agency for Asylum
type: Concept
created: 2023-10-31
deprecated: false
broader: Decentralised agency
definition: European Union Agency for Asylum.
in scheme: EP taxonomy on entities.
preferred label: Asylagentur der Europäischen Union @de
preferred label: Eiropas Savienības Patvēruma aģentūra @lv
preferred label: Agencija Europske unije za azil @hr
preferred label: Az Európai Unió Menekültügyi Ügynöksége @hu
preferred label: Agencia de Asilo de la Unión Europea @es
preferred label: Europeiska unionens asylbyrå @sv
preferred label: Агенция на Европейския съюз в областта на убежището @bg
preferred label: Agenția Uniunii Europene pentru Azil @ro
preferred label: Euroopan unionin turvapaikkavirasto @fi
preferred label: Europos Sąjungos prieglobsčio agentūra @lt
preferred label: Agencija Evropske unije za azil @sl
preferred label: Den Europæiske Unions Asylagentur @da
preferred label: L-Aġenzija tal-Unjoni Ewropea għall-Ażil @mt
preferred label: Agência da União Europeia para o Asilo @pt
preferred label: Agence de l’Union européenne pour l’asile @fr
preferred label: Euroopa Liidu Varjupaigaamet @et
preferred label: Agentúra Európskej únie pre azyl @sk
preferred label: Gníomhaireacht an Aontais Eorpaigh um Thearmann @ga
preferred label: Agenzia dell’Unione europea per l’asilo @it
preferred label: Οργανισμός της Ευρωπαϊκής Ένωσης για το Άσυλο @el
preferred label: Agentura Evropské unie pro otázky azylu @cs
preferred label: Agencja Unii Europejskiej ds. Azylu @pl
preferred label: Asielagentschap van de Europese Unie @nl

National political group
type: CorporateBodyClassification
type: Concept
created: 2025-04-30
deprecated: false
broader: National entities
definition: National political group
in scheme: EP taxonomy on entities.
preferred label: Grup politic național @ro
preferred label: Gruppo politico nazionale @it
preferred label: Национална политическа група @bg
preferred label: National politisk gruppe @da
preferred label: Národná politická skupina @sk
preferred label: Valsts politiskā grupa @lv
preferred label: Grúpa polaitiúil náisiúnta @ga
preferred label: Riiklik fraktsioon @et
preferred label: Grupo político nacional @es
preferred label: Grupp politiku nazzjonali @mt
preferred label: Nacionalna politična skupina @sl
preferred label: Nacionalni klub zastupnika @hr
preferred label: Kansallinen poliittinen ryhmä @fi
preferred label: Krajowa grupa polityczna @pl
preferred label: Εθνική πολιτική ομάδα @el
preferred label: Nacionalinė frakcija @lt
preferred label: Nemzeti politikai csoport @hu
preferred label: Národní politická skupina @cs
preferred label: Groupe politique national @fr
preferred label: Nationale Fraktion @de
preferred label: Nationale fractie @nl
preferred label: Nationell politisk grupp @sv

Single European Sky ATM Research 3 Joint Undertaking
type: Concept
created: 2023-10-31
deprecated: false
broader: EU joint undertaking
definition: Single European Sky ATM Research 3 Joint Undertaking.
in scheme: EP taxonomy on entities.
preferred label: Zajedničko poduzeće za istraživanja o upravljanju zračnim prometom na jedinstvenom europskom nebu 3 @hr
preferred label: Trečiosios bendro Europos dangaus oro eismo valdymo mokslinių tyrimų programos bendroji įmonė @lt
preferred label: Skupno podjetje za raziskave o upravljanju zračnega prometa enotnega evropskega neba 3 @sl
preferred label: Impresa comune «Ricerca ATM nel cielo unico europeo 3» @it
preferred label: Gemeenschappelijke Onderneming “Derde ATM-onderzoek in het kader van het gemeenschappelijk Europees luchtruim” @nl
preferred label: Společný podnik pro výzkum ATM jednotného evropského nebe 3 @cs
preferred label: L-Impriża Konġunta Riċerka dwar il-Ġestjoni tat-Traffiku tal-Ajru Uniku Ewropew 3 @mt
preferred label: Entreprise commune «Recherche sur la gestion du trafic aérien dans le ciel unique européen 3» @fr
preferred label: Empresa Comum de Investigação sobre a Gestão do Tráfego Aéreo no Céu Único Europeu 3 @pt
preferred label: Euroopa lennuliikluse uue põlvkonna juhtimissüsteemi arendav kolmas ühisettevõte @et
preferred label: Comhghnóthas Taighde BAT 3 an Aerspáis Eorpaigh Aonair @ga
preferred label: Kopuzņēmums “Eiropas vienotās gaisa telpas ATM pētniecība 3” @lv
preferred label: Κοινή επιχείρηση «Ερευνητικό πρόγραμμα ΑΤΜ του Ενιαίου Ευρωπαϊκού Ουρανού 3» @el
preferred label: Съвместно предприятие „Изследване на УВД в единното европейско небе 3“ @bg
preferred label: Fællesforetagendet for forskning i lufttrafikstyring i det fælles europæiske luftrum 3 @da
preferred label: 3. „Egységes Európai Égbolt” Légiforgalmi Szolgáltatási Kutatás Közös Vállalkozás @hu
preferred label: Gemeinsames Unternehmen SESAR3 @de
preferred label: Yhtenäisen eurooppalaisen ilmatilan ilmaliikenteen hallinnan kolmannen tutkimushankkeen yhteisyritys @fi
preferred label: Întreprinderea comună „Proiectul de cercetare privind ATM în contextul Cerului unic european” 3 @ro
preferred label: Det gemensamma företaget Sesar 3 @sv
preferred label: Spoločný podnik pre výskum manažmentu letovej prevádzky jednotného európskeho neba 3 @sk
preferred label: Wspólne Przedsięwzięcie w celu Badań z zakresu Zarządzania Ruchem Lotniczym w Jednolitej Europejskiej Przestrzeni Powietrznej 3 @pl
preferred label: Empresa Común para la Investigación sobre ATM en el Cielo Único Europeo 3 @es

Subcommittee on Security and Defence
type: Concept
created: 2023-10-31
deprecated: true
alternative label: Varnost in obramba @sl
alternative label: Sigurnost i obrana @hr
alternative label: Seguridad y Defensa @es
alternative label: Ασφάλεια και Άμυνα @el
alternative label: Biztonság- és védelempolitika @hu
alternative label: Drošība un aizsardzība @lv
alternative label: Segurança e Defesa @pt
alternative label: Julgeolek ja kaitse @et
alternative label: Slándáil agus Cosaint @ga
alternative label: Sicherheit und Verteidigung @de
alternative label: Sigurtà u d-Difiża @mt
alternative label: Bezpečnosť a obrana @sk
alternative label: Сигурност и отбрана @bg
alternative label: Turvallisuus- ja puolustuspolitiikka @fi
alternative label: Securitate și apărare @ro
alternative label: Security and Defence
alternative label: Saugumas ir gynyba @lt
alternative label: Säkerhet och försvar @sv
alternative label: Sécurité et défense @fr
alternative label: Bezpečnost a obrana @cs
alternative label: Veiligheid en defensie @nl
alternative label: Sicurezza e difesa @it
alternative label: Bezpieczeństwo i Obrona @pl
alternative label: Sikkerhed og Forsvar @da
broader: European parliamentary subcommittee
definition: European parliamentary subcommittee on security and defence.
in scheme: EP taxonomy on entities.
preferred label: Saugumo ir gynybos pakomitetis @lt
preferred label: Podvýbor pro bezpečnost a obranu @cs
preferred label: Julgeoleku ja kaitse allkomisjon @et
preferred label: Pododbor za sigurnost i obranu @hr
preferred label: Podvýbor pre bezpečnosť a obranu @sk
preferred label: Podkomisja Bezpieczeństwa i Obrony @pl
preferred label: Unterausschuss für Sicherheit und Verteidigung @de
preferred label: Sottokumitat għas-Sigurtà u d-Difiża @mt
preferred label: Subcomisión de Seguridad y Defensa @es
preferred label: Pododbor za varnost in obrambo @sl
preferred label: Underudvalget om Sikkerhed og Forsvar @da
preferred label: Υποεπιτροπή Ασφάλειας και Άμυνας @el
preferred label: Sous-commission "sécurité et défense" @fr
preferred label: Подкомисия по сигурност и отбрана @bg
preferred label: Subcomisia pentru securitate și apărare @ro
preferred label: Drošības un aizsardzības apakškomiteja @lv
preferred label: Subcommissie veiligheid en defensie @nl
preferred label: Sottocommissione per la sicurezza e la difesa @it
preferred label: Biztonság- és Védelempolitikai Albizottság @hu
preferred label: Subcomissão da Segurança e da Defesa @pt
preferred label: Underutskottet för säkerhet och försvar @sv
preferred label: An Fochoiste um Shlándáil agus Cosaint @ga
preferred label: Turvallisuus- ja puolustuspolitiikan alivaliokunta @fi

European Centre for Disease Prevention and Control
type: Concept
created: 2023-10-31
deprecated: false
broader: Decentralised agency
definition: European Centre for Disease Prevention and Control.
in scheme: EP taxonomy on entities.
preferred label: An Lárionad Eorpach um Ghalair a Chosc agus a Rialú @ga
preferred label: Evropské středisko pro prevenci a kontrolu nemocí @cs
preferred label: Европейски център за профилактика и контрол върху заболяванията @bg
preferred label: Euroopan tautienehkäisy- ja -valvontakeskus @fi
preferred label: Europäisches Zentrum für die Prävention und die Kontrolle von Krankheiten @de
preferred label: Centro Europeu de Prevenção e Controlo das Doenças @pt
preferred label: Avrupa Hastalık Önleme ve Kontrol Merkezi @tr
preferred label: Centrul European de Prevenire și Control al Bolilor @ro
preferred label: Europejskie Centrum ds. Zapobiegania i Kontroli Chorób @pl
preferred label: Centre européen de prévention et de contrôle des maladies @fr
preferred label: Centro europeo per la prevenzione e il controllo delle malattie @it
preferred label: Eiropas Slimību profilakses un kontroles centrs @lv
preferred label: Iċ-Ċentru Ewropew għall-Prevenzjoni u l-Kontroll tal-Mard @mt
preferred label: Europeiska centrumet för förebyggande och kontroll av sjukdomar @sv
preferred label: Europski centar za sprečavanje i kontrolu bolesti @hr
preferred label: Det Europæiske Center for Forebyggelse af og Kontrol med Sygdomme @da
preferred label: Europees Centrum voor ziektepreventie en -bestrijding @nl
preferred label: Európai Betegségmegelőzési és Járványvédelmi Központ @hu
preferred label: Europos ligų prevencijos ir kontrolės centras @lt
preferred label: Evropski center za preprečevanje in obvladovanje bolezni @sl
preferred label: Centro Europeo para la Prevención y el Control de las Enfermedades @es
preferred label: Ευρωπαϊκό Κέντρο Πρόληψης και Ελέγχου Νόσων @el
preferred label: Haiguste Ennetamise ja Tõrje Euroopa Keskus @et
preferred label: Európske centrum pre prevenciu a kontrolu chorôb @sk

European Banking Authority
type: Concept
created: 2023-10-31
deprecated: false
broader: Decentralised agency
definition: European Banking Authority.
in scheme: EP taxonomy on entities.
preferred label: Európsky orgán pre bankovníctvo @sk
preferred label: Autorità bancaria europea @it
preferred label: Euroopa Pangandusjärelevalve @et
preferred label: Evropski bančni organ @sl
preferred label: Европейски банков орган @bg
preferred label: Europeiska bankmyndigheten @sv
preferred label: Autoridad Bancaria Europea @es
preferred label: Den Europæiske Banktilsynsmyndighed @da
preferred label: Európai Bankhatóság @hu
preferred label: L-Awtorità Bankarja Ewropea @mt
preferred label: Europese Bankautoriteit @nl
preferred label: Eiropas Banku iestāde @lv
preferred label: Ευρωπαϊκή Αρχή Τραπεζών @el
preferred label: Autorité bancaire européenne @fr
preferred label: Euroopan pankkiviranomainen @fi
preferred label: Autoridade Bancária Europeia @pt
preferred label: An tÚdarás Baincéireachta Eorpach @ga
preferred label: Autoritatea Bancară Europeană @ro
preferred label: Europejski Urząd Nadzoru Bankowego @pl
preferred label: Europsko nadzorno tijelo za bankarstvo @hr
preferred label: Europos bankininkystės institucija @lt
preferred label: Europäische Bankenaufsichtsbehörde @de
preferred label: Evropský orgán pro bankovnictví @cs

Parliamentary committee
type: CorporateBodyClassification
type: Concept
created: 2023-10-31
deprecated: false
broader: European Parliament
definition: Parliamentary Committee of the European Parliament.
in scheme: EP taxonomy on entities.
preferred label: Commissione parlamentare @it
preferred label: Парламентарна комисия @bg
preferred label: Parlamento komitetas @lt
preferred label: Commission parlementaire @fr
preferred label: Parlamenti bizottság @hu
preferred label: An Coiste Parlaiminteach @ga
preferred label: Parlamentní výbor @cs
preferred label: Parlamentarni odbor @hr
preferred label: Parlamentný výbor @sk
preferred label: Parlamentaarinen valiokunta @fi
preferred label: Comisión parlamentaria @es
preferred label: Parlamentarischer Ausschuss @de
preferred label: Det parlamentariske udvalg @da
preferred label: Kumitat Parlamentari @mt
preferred label: Comisia parlamentară @ro
preferred label: Parlementaire commissie @nl
preferred label: Parlamendikomisjon @et
preferred label: Κοινοβουλευτική επιτροπή @el
preferred label: Parlamentārā komiteja @lv
preferred label: Comissão parlamentar @pt
preferred label: Parlamentariskt utskott @sv
preferred label: Komisja parlamentarna @pl

Joint committee procedure - ENVI and LIBE
type: Concept
created: 2023-10-31
deprecated: false
alternative label: ENVI und LIBE @de
alternative label: Commissions conjointes ENVI - LIBE @fr
alternative label: Joint ENVI - LIBE
broader: Joint parliamentary committees
definition: Joint committee procedure - ENVI and LIBE.
in scheme: EP taxonomy on entities.
preferred label: Procédure avec commissions conjointes - ENVI et LIBE @fr
preferred label: Gemeinsames Ausschussverfahren - ENVI und LIBE @de

Joint committee procedure - AGRI and REGI
type: Concept
created: 2025-08-31
deprecated: false
alternative label: AGRI und REGI @de
alternative label: Commissions conjointes AGRI - REGI @fr
alternative label: Joint AGRI - REGI
broader: Joint parliamentary committees
definition: Joint committee procedure - AGRI and REGI.
in scheme: EP taxonomy on entities.
preferred label: Procédure avec commissions conjointes - AGRI et REGI @fr
preferred label: Gemeinsames Ausschussverfahren - AGRI und REGI @de

Subcommittee on Human Rights
type: Concept
created: 2023-10-31
deprecated: false
alternative label: Menneskerettigheder @da
alternative label: Human Rights
alternative label: Derechos Humanos @es
alternative label: Direitos Humanos @pt
alternative label: Cearta an Duine @ga
alternative label: Droits de l'homme @fr
alternative label: Človekove pravice @sl
alternative label: Ljudska prava @hr
alternative label: Žmogaus teisės @lt
alternative label: Ανθρώπινα Δικαιώματα @el
alternative label: Menschenrechte @de
alternative label: Cilvēktiesības @lv
alternative label: Emberi jogok @hu
alternative label: Diritti dell'uomo @it
alternative label: Ľudské práva @sk
alternative label: Drittijiet tal-Bniedem @mt
alternative label: Prawa Człowieka @pl
alternative label: Drepturile omului @ro
alternative label: Inimõigused @et
alternative label: Ihmisoikeudet @fi
alternative label: Mänskliga rättigheter @sv
alternative label: Lidská práva @cs
alternative label: Права на човека @bg
alternative label: Mensenrechten @nl
broader: European parliamentary subcommittee
broader: COMMITTEE PARLIAMENTARY AFET
definition: European parliamentary subcommittee on human rights.
in scheme: EP taxonomy on entities.
preferred label: Podvýbor pro lidská práva @cs
preferred label: Subcommissie mensenrechten @nl
preferred label: Cilvēktiesību apakškomiteja @lv
preferred label: Unterausschuss Menschenrechte @de
preferred label: Ihmisoikeuksien alivaliokunta @fi
preferred label: Podvýbor pre ľudské práva @sk
preferred label: Subcomisia pentru drepturile omului @ro
preferred label: Podkomisja Praw Człowieka @pl
preferred label: Υποεπιτροπή Ανθρωπίνων Δικαιωμάτων @el
preferred label: Emberi Jogi Albizottság @hu
preferred label: Underudvalget om Menneskerettigheder @da
preferred label: Sous-commission "Droits de l'homme" @fr
preferred label: Subcomisión de Derechos Humanos @es
preferred label: Sottokumitat għad-Drittijiet tal-Bniedem @mt
preferred label: Subcomissão dos Direitos Humanos @pt
preferred label: Подкомисия по правата на човека @bg
preferred label: Inimõiguste allkomisjon @et
preferred label: Underutskottet för mänskliga rättigheter @sv
preferred label: Sottocommissione per i diritti dell'uomo @it
preferred label: Žmogaus teisių pakomitetis @lt
preferred label: Pododbor za ljudska prava @hr
preferred label: An Fochoiste um Chearta an Duine @ga
preferred label: Pododbor za človekove pravice @sl

European Fisheries Control Agency
type: Concept
created: 2023-10-31
deprecated: false
broader: EU agency
definition: European Fisheries Control Agency.
in scheme: EP taxonomy on entities.
preferred label: Ευρωπαϊκή Υπηρεσία Ελέγχου της Αλιείας @el
preferred label: Agence européenne de contrôle des pêches @fr
preferred label: Európai Halászati Ellenőrző Hivatal @hu
preferred label: Agencia Europea de Control de la Pesca @es
preferred label: Agenzia europea di controllo della pesca @it
preferred label: Eiropas Zivsaimniecības kontroles aģentūra @lv
preferred label: Европейска агенция за контрол на рибарството @bg
preferred label: Evropská agentura pro kontrolu rybolovu @cs
preferred label: L-Aġenzija Ewropea għall-Kontroll tas-Sajd @mt
preferred label: Evropska agencija za nadzor ribištva @sl
preferred label: Európska agentúra pre kontrolu rybárstva @sk
preferred label: Europska agencija za kontrolu ribarstva @hr
preferred label: Det Europæiske Fiskerikontrolagentur @da
preferred label: Europos žuvininkystės kontrolės agentūra @lt
preferred label: Euroopan kalastuksenvalvontavirasto @fi
preferred label: Europejska Agencja Kontroli Rybołówstwa @pl
preferred label: Europees Bureau voor visserijcontrole @nl
preferred label: Europeiska fiskerikontrollbyrån @sv
preferred label: Euroopa Kalanduskontrolli Amet @et
preferred label: Agenția Europeană pentru Controlul Pescuitului @ro
preferred label: Europäische Fischereiaufsichtsagentur @de
preferred label: An Ghníomhaireacht Eorpach um Rialú ar Iascach @ga
preferred label: Agência Europeia de Controlo das Pescas @pt

Identity and Democracy Group
type: Concept
created: 2023-10-31
deprecated: true
alternative label: Identität und Demokratie @de
alternative label: Identitás és Demokrácia @hu
alternative label: Identitet i demokracija @hr
alternative label: Féiniúlacht agus Daonlathas @ga
alternative label: Identiteet ja Demokraatia @et
alternative label: Identità u Demokrazija @mt
alternative label: Identiteit en Democratie @nl
alternative label: Identité et démocratie @fr
alternative label: Identitate și Democrație @ro
alternative label: Identita a demokracie @cs
alternative label: Identiteetti ja demokratia @fi
alternative label: Tożsamość i Demokracja @pl
alternative label: Identitāte un demokrātija @lv
alternative label: Identidade e Democracia @pt
alternative label: Identita a demokracia @sk
alternative label: Identitet och demokrati @sv
preferred label: Identidad y Democracia @es
alternative label: Identità e Democrazia @it
alternative label: „Идентичност и демокрация“ @bg
alternative label: Identiteta in demokracija @sl
alternative label: Ταυτότητα και Δημοκρατία @el
alternative label: Identitetas ir demokratija @lt
alternative label: Identity and Democracy
alternative label: Identitet og Demokrati @da
broader: POLITICAL GROUP
definition: European political group Identity and Democracy.
in scheme: EP taxonomy on entities.
preferred label: Grupul Identitate și Democrație @ro
preferred label: Fractie Identiteit en Democratie @nl
preferred label: Grupo Identidade e Democracia @pt
preferred label: Gruppo Identità e Democrazia @it
preferred label: Identiteetti ja demokratia -ryhmä @fi
preferred label: Identitātes un demokrātijas grupa @lv
preferred label: Gruppen Identitet och demokrati @sv
preferred label: Grupp Identità u Demokrazija @mt
preferred label: Skupina Identita a demokracia @sk
preferred label: Identiteto ir demokratijos frakcija @lt
preferred label: Grupa Tożsamość i Demokracja @pl
preferred label: Groupe «Identité et démocratie» @fr
preferred label: Ομάδα Ταυτότητας και Δημοκρατίας @el
preferred label: Fraktion Identität und Demokratie @de
preferred label: Skupina Identiteta in demokracija @sl
preferred label: Grúpa na Féiniúlachta agus an Daonlathais @ga
preferred label: Identitás és Demokrácia képviselőcsoport @hu
preferred label: skupina Identita a demokracie @cs
preferred label: Група „Идентичност и демокрация“ @bg
preferred label: Klub zastupnika Identitet i demokracija @hr
preferred label: Gruppen Identitet og Demokrati @da
preferred label: Identiteedi ja Demokraatia fraktsioon @et

Delegation to the EU-Türkiye Joint Parliamentary Committee
type: Concept
created: 2023-10-31
deprecated: false
alternative label: Turkki @fi
alternative label: Turkija @lt
alternative label: Turecko @cs
alternative label: Tyrkiet @da
alternative label: Turquie @fr
alternative label: Türkiye
alternative label: Τουρκία @el
alternative label: Turquía @es
alternative label: Turchia @it
alternative label: Turcija @lv
alternative label: Turcja @pl
alternative label: Turkije @nl
alternative label: Turkiet @sv
alternative label: Turčija @sl
alternative label: Türkei @de
alternative label: Turcia @ro
alternative label: Турция @bg
alternative label: Turquia @pt
alternative label: Türgi @et
alternative label: An Tuirc @ga
alternative label: Törökország @hu
alternative label: Turska @hr
broader: Delegation to Joint Parliamentary Committee
definition: Delegation to the EU-Türkiye Joint Parliamentary Committee.
in scheme: EP taxonomy on entities.
preferred label: Delegazzjoni għall-Kumitat Parlamentari Konġunt UE-Turkija @mt
preferred label: Delegatie in de Gemengde Parlementaire Commissie EU-Turkije @nl
preferred label: Delegacija pri skupnem parlamentarnem odboru EU-Turčija @sl
preferred label: Delegationen till den gemensamma parlamentarikerkommittén EU-Turkiet @sv
preferred label: Αντιπροσωπεία στη Μικτή Κοινοβουλευτική Επιτροπή ΕΕ-Τουρκίας @el
preferred label: Delegationen til Det Blandede Parlamentariske Udvalg EU-Tyrkiet @da
preferred label: Az EU–Törökország Parlamenti Vegyes Bizottságba delegált küldöttség @hu
preferred label: Delegācija ES un Turcijas apvienotajā parlamentārajā komitejā @lv
preferred label: Delegação à Comissão Parlamentar Mista UE-Turquia @pt
preferred label: Délégation à la commission parlementaire mixte UE-Turquie @fr
preferred label: Delegación en la Comisión Parlamentaria Mixta UE-Turquía @es
preferred label: Delegation im Gemischten Parlamentarischen Ausschuss EU-Türkei @de
preferred label: Delegace ve Smíšeném parlamentním výboru EU-Turecko @cs
preferred label: Delegacija ES ir Turkijos jungtiniame parlamentiniame komitete @lt
preferred label: Delegația la Comisia parlamentară mixtă UE-Turcia @ro
preferred label: An Toscaireacht chun an Chomhchoiste Pharlaimintigh idir AE agus an Tuirc @ga
preferred label: Delegacja do wspólnej komisji parlamentarnej UE-Turcja @pl
preferred label: Valtuuskunta EU:n ja Turkin parlamentaarisessa sekavaliokunnassa @fi
preferred label: Делегация в Съвместния парламентарен комитет ЕС-Турция @bg
preferred label: Izaslanstvo u Zajedničkom parlamentarnom odboru EU-a i Turske @hr
preferred label: Delegazione alla commissione parlamentare mista UE-Turchia @it
preferred label: Delegácia pri Spoločnom parlamentnom výbore EÚ – Turecko @sk
preferred label: Delegatsioon ELi–Türgi parlamentaarses ühiskomisjonis @et

Joint committee procedure - LIBE and PETI
type: Concept
created: 2023-10-31
deprecated: false
alternative label: Joint LIBE - PETI
alternative label: Commissions conjointes LIBE - PETI @fr
alternative label: LIBE und PETI @de
broader: Joint parliamentary committees
definition: Joint committee procedure - LIBE and PETI.
in scheme: EP taxonomy on entities.
preferred label: Procédure avec commissions conjointes - LIBE et PETI @fr
preferred label: Gemeinsames Ausschussverfahren - LIBE und PETI @de

Joint committee procedure - ITRE and TRAN
type: Concept
created: 2023-10-31
deprecated: false
alternative label: Joint ITRE - TRAN
alternative label: ITRE und TRAN @de
alternative label: Commissions conjointes ITRE - TRAN @fr
broader: Joint parliamentary committees
definition: Joint committee procedure - ITRE and TRAN.
in scheme: EP taxonomy on entities.
preferred label: Procédure avec commissions conjointes - ITRE et TRAN @fr
preferred label: Gemeinsames Ausschussverfahren - ITRE und TRAN @de

Joint committee procedure - AGRI, EMPL and ENVI
type: Concept
created: 2025-08-31
deprecated: false
alternative label: Joint AGRI - EMPL - ENVI
alternative label: AGRI, EMPL und ENVI @de
alternative label: Commissions conjointes AGRI - EMPL - ENVI @fr
broader: Joint parliamentary committees
definition: Joint committee procedure - AGRI, EMPL and ENVI.
in scheme: EP taxonomy on entities.
preferred label: Gemeinsames Ausschussverfahren - AGRI, EMPL und ENVI @de
preferred label: Procédure avec commissions conjointes - AGRI, EMPL et ENVI @fr

Polish Sejm
type: Concept
created: 2023-10-31
deprecated: false
broader: National chamber
definition: Polish Sejm.
in scheme: EP taxonomy on entities.
preferred label: Сейм на Република Полша @bg
preferred label: polnischer Sejm @de
preferred label: Πολωνική Δίαιτα @el
preferred label: Seimul Poloniei @ro
preferred label: Sejm Rzeczypospolitej Polskiej @pl
preferred label: poljski sejm @sl
preferred label: poľský Sejm @sk
preferred label: Poolse Nationale Vergadering @nl
preferred label: Den polska sejmen @sv
preferred label: Poola Seim @et
preferred label: Dieta polaca @es
preferred label: Polijas Sejms @lv
preferred label: Lenkijos Respublikos Seimas @lt
preferred label: Dieta polacca @it
preferred label: Sejm Pollakk @mt
preferred label: polský Sejm @cs
preferred label: poljski Sejm @hr
preferred label: Câmara Baixa do Parlamento polaco @pt
preferred label: den polske Sejm @da
preferred label: Puolan parlamentin alahuone @fi
preferred label: Sejm na Polainne @ga
preferred label: Diète de la république de Pologne @fr
preferred label: lengyel Szejm @hu

Joint committee procedure - AFET and LIBE
type: Concept
type: CorporateBodyClassification
created: 2025-10-31
deprecated: false
alternative label: Commissions conjointes AFET - LIBE @fr
alternative label: AFET und LIBE @de
alternative label: Joint AFET - LIBE
broader: Joint parliamentary committees
definition: Joint committee procedure - AFET and LIBE.
in scheme: EP taxonomy on entities.
preferred label: Gemeinsames Ausschussverfahren - AFET und LIBE @de
preferred label: Procédure avec commissions conjointes - AFET et LIBE @fr

European Union Agency for Law Enforcement Training
type: Concept
created: 2023-10-31
deprecated: false
broader: Decentralised agency
definition: European Union Agency for Law Enforcement Training.
in scheme: EP taxonomy on entities.
preferred label: Οργανισμός της Ευρωπαϊκής Ένωσης για την Κατάρτιση στον Τομέα της Επιβολής του Νόμου @el
preferred label: Agenția Uniunii Europene pentru Formare în Materie de Aplicare a Legii @ro
preferred label: Agence de l’Union européenne pour la formation des services répressifs @fr
preferred label: Den Europæiske Unions Agentur for Uddannelse inden for Retshåndhævelse @da
preferred label: Eiropas Savienības Tiesībaizsardzības apmācības aģentūra @lv
preferred label: Agência da União Europeia para a Formação Policial @pt
preferred label: Agencija Evropske unije za usposabljanje na področju preprečevanja, odkrivanja in preiskovanja kaznivih dejanj @sl
preferred label: Agentur der Europäischen Union für die Aus- und Fortbildung auf dem Gebiet der Strafverfolgung @de
preferred label: Europeiska unionens byrå för utbildning av tjänstemän inom brottsbekämpning @sv
preferred label: L-Aġenzija tal-Unjoni Ewropea għat-Taħriġ fl-Infurzar tal-Liġi @mt
preferred label: Agentúra Európskej únie pre odbornú prípravu v oblasti presadzovania práva @sk
preferred label: Agentschap van de Europese Unie voor opleiding op het gebied van rechtshandhaving @nl
preferred label: Europos Sąjungos teisėsaugos mokymo agentūra @lt
preferred label: Agentura Evropské unie pro vzdělávání a výcvik v oblasti prosazování práva @cs
preferred label: Агенция на Европейския съюз за обучение в областта на правоприлагането @bg
preferred label: Agencija Europske unije za osposobljavanje u području izvršavanja zakonodavstva @hr
preferred label: Euroopa Liidu Õiguskaitsekoolituse Amet @et
preferred label: Agencia de la Unión Europea para la Formación Policial @es
preferred label: Az Európai Unió Bűnüldözési Képzési Ügynöksége @hu
preferred label: Agencja Unii Europejskiej ds. Szkolenia w Dziedzinie Ścigania @pl
preferred label: Agenzia dell’Unione europea per la formazione delle autorità di contrasto @it
preferred label: Euroopan unionin lainvalvontakoulutusvirasto @fi
preferred label: Gníomhaireacht an Aontais Eorpaigh um Oiliúint i bhForfheidhmiú an Dlí @ga

United Kingdom House of Lords
type: Concept
created: 2023-10-31
deprecated: false
broader: National chamber
definition: United Kingdom House of Lords.
in scheme: EP taxonomy on entities.
preferred label: Sněmovna lordů Spojeného království @cs
preferred label: Βουλή των Λόρδων του Ηνωμένου Βασιλείου @el
preferred label: Yhdistyneen kuningaskunnan parlamentin ylähuone @fi
preferred label: Dom lordova Ujedinjene Kraljevine @hr
preferred label: Câmara dos Lordes do Reino Unido @pt
preferred label: Cámara de los Lores del Reino Unido @es
preferred label: brit lordok háza @hu
preferred label: Ühendkuningriigi Parlamendi Ülemkoda @et
preferred label: zgornji dom parlamenta Združenega kraljestva @sl
preferred label: Apvienotās Karalistes parlamenta Lordu palāta @lv
preferred label: Jungtinės Karalystės Lordų Rūmai @lt
preferred label: Förenade kungarikets överhus @sv
preferred label: Camera Lorzilor din Regatul Unit @ro
preferred label: Chambre des lords du Royaume-Uni @fr
preferred label: Teach Tiarnaí an Ríochta Aontaithe @ga
preferred label: Camera dei Lord del Regno Unito @it
preferred label: Hogerhuis van het Verenigd Koninkrijk @nl
preferred label: Камара на лордовете на Обединеното кралство @bg
preferred label: Oberhaus des Vereinigten Königreichs @de
preferred label: Izba Lordów @pl
preferred label: Det Forenede Kongeriges Overhus @da
preferred label: Snemovňa lordov Spojeného kráľovstva @sk
preferred label: House of Lords tar-Renju Unit @mt

Romanian Chamber of Deputies
type: Concept
created: 2023-10-31
deprecated: false
broader: National chamber
definition: Romanian Chamber of Deputies.
in scheme: EP taxonomy on entities.
preferred label: romunska poslanska zbornica @sl
preferred label: rumänisches Abgeordnetenhaus @de
preferred label: Rumeenia Saadikutekoda @et
preferred label: Cámara de Diputados rumana @es
preferred label: Romanian edustajainhuone @fi
preferred label: Camera Deputaților din România @ro
preferred label: Kamra tad-Deputati Rumena @mt
preferred label: rumunská Poslanecká snemovňa @sk
preferred label: Камара на депутатите на Румъния @bg
preferred label: Ρουμανική Βουλή @el
preferred label: Rumunijos Deputatų Rūmai @lt
preferred label: Den rumänska deputeradekammaren @sv
preferred label: román képviselőház @hu
preferred label: Rumānijas parlamenta Deputātu palāta @lv
preferred label: Izba Deputowanych Rumunii @pl
preferred label: det rumænske Deputeretkammer @da
preferred label: Camera dei deputati romena @it
preferred label: rumunská Poslanecká sněmovna @cs
preferred label: Chambre des députés roumaine @fr
preferred label: Teach Teachtaí na Rómáine @ga
preferred label: Roemeense Kamer van Afgevaardigden @nl
preferred label: Câmara dos Deputados romena @pt
preferred label: rumunjski Zastupnički dom @hr

Special Committee on the Financial, Economic and Social Crisis
type: Concept
created: 2023-10-31
deprecated: true
alternative label: Crisis Financiera, Económica y Social @es
alternative label: Финансова, икономическа и социална криза @bg
alternative label: Finants-, majandus- ja sotsiaalkriis @et
alternative label: Finansų, ekonomikos ir socialinė krizė @lt
alternative label: Finančná, hospodárska a sociálna kríza @sk
alternative label: Finansielle, Økonomiske og Sociale Krise @da
alternative label: Rahoitus-, talous- ja sosiaalikriisi @fi
alternative label: Criza financiară, economică și socială @ro
alternative label: Finanz-, Wirtschafts- und Sozialkrise @de
alternative label: Crisi finanziaria, economica e sociale @it
alternative label: Crise Financeira, Económica e Social @pt
alternative label: Kryzys Finansowy, Gospodarczy i Społeczny @pl
alternative label: Financijska, ekonomska i socijalna kriza @hr
alternative label: Finanční, hospodářská a sociální krize @cs
alternative label: Χρηματοπιστωτική, οικονομική και κοινωνική κρίση @el
alternative label: Finansiella, ekonomiska och sociala krisen @sv
alternative label: Géarchéim Airgeadais, Eacnamaíoch agus Sóisialta @ga
alternative label: Kriżi Finanzjarja, Ekonomika u Soċjali @mt
alternative label: Finanšu, ekonomikas un sociālā krīze @lv
alternative label: Financial, Economic and Social Crisis
alternative label: Crise financière, économique et sociale @fr
alternative label: Financiële, economische en sociale crisis @nl
alternative label: Pénzügyi, Gazdasági és Szociális Válság @hu
alternative label: Finančna, gospodarska in socialna kriza @sl
broader: Special parliamentary committee
definition: The CRIS Committee focuses on analyzing the causes and consequences of the crisis, the costs of inaction, and possible ways to overcome the crisis and to prevent a repeat.
in scheme: EP taxonomy on entities.
preferred label: Sonderausschuss zur Finanz-, Wirtschafts- und Sozialkrise @de
preferred label: Comisia specială privind criza financiară, economică și socială @ro
preferred label: Comissão Especial para a Crise Financeira, Económica e Social @pt
preferred label: Zvláštní výbor pro finanční, hospodářskou a sociální krizi @cs
preferred label: Commission spéciale sur la crise financière, économique et sociale @fr
preferred label: Bijzondere Commissie financiële, economische en sociale crisis @nl
preferred label: Specialusis finansų, ekonomikos ir socialinės krizės komitetas @lt
preferred label: Īpašā finanšu, ekonomikas un sociālās krīzes komiteja @lv
preferred label: Rahoitus-, talous- ja sosiaalikriisiä käsittelevä erityisvaliokunta @fi
preferred label: Särskilda utskottet för den finansiella, ekonomiska och sociala krisen @sv
preferred label: Finants-, majandus- ja sotsiaalkriisi erikomisjon @et
preferred label: Det Særlige Udvalg om den Finansielle, Økonomiske og Sociale Krise @da
preferred label: Commissione speciale sulla crisi finanziaria, economica e sociale @it
preferred label: Kumitat Speċjali dwar il-Kriżi Finanzjarja, Ekonomika u Soċjali @mt
preferred label: Ειδική επιτροπή για την χρηματοπιστωτική, οικονομική και κοινωνική κρίση @el
preferred label: Comisión Especial sobre la Crisis Financiera, Económica y Social @es
preferred label: Osobitný výbor pre finančnú, hospodársku a sociálnu krízu @sk
preferred label: Специална комисия по финансовата, икономическа и социална криза @bg
preferred label: A Pénzügyi, Gazdasági és Szociális Válsággal Foglalkozó Különbizottság @hu
preferred label: Posebni odbor za finančno, gospodarsko in socialno krizo @sl
preferred label: An Coiste Speisialta um an nGéarchéim Airgeadais, Eacnamaíoch agus Sóisialta @ga
preferred label: Poseban odbor za financijsku, ekonomsku i socijalnu krizu @hr
preferred label: Komisja Specjalna ds. Kryzysu Finansowego, Gospodarczego i Społecznego @pl

Translation Centre for the Bodies of the European Union
type: Concept
created: 2023-10-31
deprecated: false
alternative label: Μεταφραστικό Κέντρο @el
alternative label: Prevajalski center @sl
alternative label: Centrul de Traduceri @ro
alternative label: Tulkošanas centrs @lv
alternative label: Translation Centre
alternative label: Prevoditeljski centar @hr
alternative label: Centro di traduzione @it
alternative label: Översättningscentrum @sv
alternative label: Tõlkekeskus @et
alternative label: Centro de Traducción @es
alternative label: Iċ-Ċentru tat-Traduzzjoni @mt
alternative label: Centro de Tradução @pt
alternative label: Prekladateľské stredisko @sk
alternative label: Vertaalbureau @nl
alternative label: Vertimo centras @lt
alternative label: Oversættelsescentret @da
alternative label: An tIonad Aistriúcháin @ga
alternative label: Centre de traduction @fr
alternative label: Център за преводи @bg
alternative label: Fordítóközpont @hu
alternative label: Centrum Tłumaczeń @pl
alternative label: Käännöskeskus @fi
alternative label: Překladatelské středisko @cs
alternative label: Übersetzungszentrum @de
broader: Decentralised agency
definition: Translation Centre for the Bodies of the European Union.
in scheme: EP taxonomy on entities.
preferred label: Centro de Tradução dos Organismos da União Europeia @pt
preferred label: Översättningscentrum för Europeiska unionens organ @sv
preferred label: Euroopa Liidu Asutuste Tõlkekeskus @et
preferred label: Център за преводи за органите на Европейския съюз @bg
preferred label: Ċentru tat-Traduzzjoni għall-Korpi tal-Unjoni Ewropea @mt
preferred label: Prevoditeljski centar za tijela Europske unije @hr
preferred label: Oversættelsescentret for Den Europæiske Unions Organer @da
preferred label: Překladatelské středisko pro instituce Evropské unie @cs
preferred label: Centro di traduzione degli organismi dell’Unione europea @it
preferred label: Centre de traduction des organes de l’Union européenne @fr
preferred label: Centro de Traducción de los Órganos de la Unión Europea @es
preferred label: Prevajalski center za organe Evropske unije @sl
preferred label: Übersetzungszentrum für die Einrichtungen der Europäischen Union @de
preferred label: Prekladateľské stredisko pre orgány Európskej únie @sk
preferred label: Europos Sąjungos įstaigų vertimo centras @lt
preferred label: Eiropas Savienības iestāžu Tulkošanas centrs @lv
preferred label: Az Európai Unió Szerveinek Fordítóközpontja @hu
preferred label: Vertaalbureau voor de organen van de Europese Unie @nl
preferred label: Ionad Aistriúcháin Chomhlachtaí an Aontais Eorpaigh @ga
preferred label: Μεταφραστικό Κέντρο των Οργάνων της Ευρωπαϊκής ’Ενωσης @el
preferred label: Centrul de Traduceri pentru Organismele Uniunii Europene @ro
preferred label: Euroopan unionin elinten käännöskeskus @fi
preferred label: Centrum Tłumaczeń dla Organów Unii Europejskiej @pl

Belgian Senate
type: Concept
created: 2023-10-31
deprecated: false
broader: National chamber
definition: Belgian Senate.
in scheme: EP taxonomy on entities.
preferred label: det belgiske Senat @da
preferred label: Belgian senaatti @fi
preferred label: belgischer Senat @de
preferred label: Seanad na Beilge @ga
preferred label: Den belgiska senaten @sv
preferred label: Belgijos Karalystės Senatas @lt
preferred label: Senat Belgii @pl
preferred label: belgijski Senat @hr
preferred label: Beļģijas parlamenta Senāts @lv
preferred label: Belgia Senat @et
preferred label: Sénat belge @fr
preferred label: belgický Senát @cs
preferred label: Senado belga @es
preferred label: belgijski senat @sl
preferred label: Сенат на Кралство Белгия @bg
preferred label: Senato belga @it
preferred label: Senatul Belgiei @ro
preferred label: Βελγική Γερουσία @el
preferred label: Senat Belġjan @mt
preferred label: Belgische Senaat @nl
preferred label: belga szenátus @hu

European External Action Service
type: Concept
created: 2023-10-31
deprecated: false
broader: EU body
definition: EU's diplomatic service carrying out the EU’s foreign and security policy.
in scheme: EP taxonomy on entities.
preferred label: Europejska Służba Działań Zewnętrznych @pl
preferred label: Európai Külügyi Szolgálat @hu
preferred label: Europska služba za vanjsko djelovanje @hr
preferred label: Evropska služba za zunanje delovanje @sl
preferred label: Is-Servizz Ewropew għall-Azzjoni Esterna @mt
preferred label: Euroopan ulkosuhdehallinto @fi
preferred label: Service européen pour l’action extérieure @fr
preferred label: Európska služba pre vonkajšiu činnosť @sk
preferred label: Servicio Europeo de Acción Exterior @es
preferred label: Europos išorės veiksmų tarnyba @lt
preferred label: Европейска служба за външна дейност @bg
preferred label: Ευρωπαϊκή Υπηρεσία Εξωτερικής Δράσης @el
preferred label: An tSeirbhís Eorpach Gníomhaíochta Seachtraí @ga
preferred label: Europese Dienst voor extern optreden @nl
preferred label: Euroopa välisteenistus @et
preferred label: Serviciul European de Acțiune Externă @ro
preferred label: Europäischer Auswärtiger Dienst @de
preferred label: Servizio europeo per l’azione esterna @it
preferred label: Eiropas Ārējās darbības dienests @lv
preferred label: Europeiska utrikestjänsten @sv
preferred label: Evropská služba pro vnější činnost @cs
preferred label: Serviço Europeu para a Ação Externa @pt
preferred label: Tjenesten for EU’s Optræden Udadtil @da

Joint committee procedure - AGRI and JURI
type: CorporateBodyClassification
type: Concept
created: 2025-11-30
deprecated: false
alternative label: Commissions conjointes AGRI - JURI @fr
alternative label: Joint AGRI - JURI
alternative label: AGRI und JURI @de
broader: Joint parliamentary committees
definition: Joint committee procedure - AGRI and JURI.
in scheme: EP taxonomy on entities.
preferred label: Gemeinsames Ausschussverfahren - AGRI und JURI @de
preferred label: Procédure avec commissions conjointes - AGRI et JURI @fr

Delegation to the EU-Latvia Joint Parliamentary Committee
type: Concept
created: 2023-10-31
deprecated: true
alternative label: EÚ-Lotyšsko @sk
alternative label: EU-Latvia
alternative label: UE-Lotwa @pl
alternative label: EU – Latvija @hr
alternative label: UE-Latvja @mt
alternative label: EU-Lettland @sv
alternative label: UE-Lettonie @fr
alternative label: EU-Letland @nl
alternative label: AE-an Laitvia @ga
alternative label: EU-Lotyšsko @cs
alternative label: EU-Latvija @sl
alternative label: ES-Latvija @lt
alternative label: UE-Lettonia @it
alternative label: UE-Letónia @pt
alternative label: UE-Letonia @es
alternative label: EL-Läti @et
alternative label: ΕΕ-Λεττονία @el
alternative label: EU-Lettország @hu
alternative label: ЕС-Латвия @bg
broader: Delegation to Joint Parliamentary Committee
definition: Delegation to the EU-Latvia Joint Parliamentary Committee.
in scheme: EP taxonomy on entities.
preferred label: Izaslanstvo u Zajedničkom parlamentarnom odboru EU-a i Latvije @hr
preferred label: Valtuuskunta EU:n ja Latvian välisessä parlamentaarisessa sekavaliokunnassa @fi
preferred label: Делегация в Съвместния парламентарен комитет ЕС-Латвия @bg
preferred label: Delegacija pri Skupnem parlamentarnem odboru EU-Latvija @sl
preferred label: Delegação à Comissão Parlamentar Mista UE-Letónia @pt
preferred label: Toscaireacht chun an Chomhchoiste Pharlaimintigh den AE-an Laitvia @ga
preferred label: Delegationen til Det Blandede Parlamentariske Udvalg EU-Letland @da
preferred label: Delegación en la Comisión Parlamentaria Mixta UE-Letonia @es
preferred label: Delegace při smíšeném parlamentním výboru EU-Lotyšsko @cs
preferred label: Delegazione alla commissione parlamentare mista UE-Lettonia @it
preferred label: ES-Latvijas Apvienotās parlamentārās komitejas delegācija @lv
preferred label: Delegacja do wspólnej komisji parlamentarnej UE-Łotwa @pl
preferred label: Délégation à la commission parlementaire mixte UE-Lettonie @fr
preferred label: Delegazzjoni lejn il-Kumitat Parlamentari Mag]qud UE-Latvja @mt
preferred label: Αντιπροσωπεία στη Μικτή Κοινοβουλευτική Επιτροπή ΕΕ-Λεττονίας @el
preferred label: Delegatie in de Gemengde Parlementaire Commissie EU-Letland @nl
preferred label: Delegația la Comisia parlamentară mixtă UE-Letonia @ro
preferred label: Az EU-Lettország Parlamenti Vegyes Bizottságba delegált küldöttség @hu
preferred label: Delegationen till den gemensamma parlamentarikerkommittén EU-Lettland @sv
preferred label: Delegatsioon parlamendi ELi-Läti ühiskomisjonis @et
preferred label: Delegacija ES-Latvijos jungtiniame parlamentiniame komitete @lt
preferred label: Delegácia pri Spoločnom parlamentnom výbore EÚ-Lotyšsko @sk
preferred label: Delegation im gemischten parlamentarischen Ausschuss EU-Lettland @de

Delegation to the Parliamentary Assembly of the Union for the Mediterranean
type: Concept
created: 2023-10-31
deprecated: false
alternative label: Unió a Mediterrán Térségért @hu
alternative label: Union for the Mediterranean
alternative label: Unija za Mediteran @hr
alternative label: Съюз за Средиземноморието @bg
alternative label: Unjoni għall-Mediterran @mt
alternative label: Välimeren unioni @fi
alternative label: Union für den Mittelmeerraum @de
alternative label: Unie voor het Middellandse Zeegebied @nl
alternative label: Union pour la Méditerranée @fr
alternative label: Unión por el Mediterráneo @es
alternative label: Aontas do Réigiún na Meánmhara @ga
alternative label: Unionen för Medelhavsområdet @sv
alternative label: Uniunea pentru Mediterana @ro
alternative label: Unie pro Středomoří @cs
alternative label: Savienība Vidusjūrai @lv
alternative label: Middelhavsunionen @da
alternative label: Vahemere Liit @et
alternative label: Unia dla Śródziemnomorza @pl
alternative label: Unione per il Mediterraneo @it
alternative label: Viduržemio jūros sąjunga @lt
alternative label: União para o Mediterrâneo @pt
alternative label: Ένωση για τη Μεσόγειο @el
alternative label: Únia pre Stredozemie @sk
alternative label: Unija za Sredozemlje @sl
broader: Temporary parliamentary legislative committee
definition: Delegation to the Parliamentary Assembly of the Union for the Mediterranean.
in scheme: EP taxonomy on entities.
preferred label: Delegacija pri parlamentarni skupščini Unije za Sredozemlje @sl
preferred label: Delegația la Adunarea Parlamentară a Uniunii pentru Mediterana @ro
preferred label: Délégation à l'Assemblée parlementaire de l'Union pour la Méditerranée @fr
preferred label: Delegācija Savienības Vidusjūrai parlamentārajā asamblejā @lv
preferred label: Делегация в Парламентарната асамблея на Съюза за Средиземноморието @bg
preferred label: Delegationen til Den Parlamentariske Forsamling for Middelhavsunionen @da
preferred label: Delegacija Viduržemio jūros sąjungos parlamentinėje asamblėjoje @lt
preferred label: Valtuuskunta Välimeren unionin parlamentaarisessa edustajakokouksessa @fi
preferred label: Delegazione all'Assemblea parlamentare dell'Unione per il Mediterraneo @it
preferred label: Delegación en la Asamblea Parlamentaria de la Unión por el Mediterráneo @es
preferred label: Delegatsioon Vahemere Liidu parlamentaarses assamblees @et
preferred label: Delegácia pri Parlamentnom zhromaždení Únie pre Stredozemie @sk
preferred label: An Toscaireacht chun Tionól Parlaiminteach an Aontais don Réigiún Meánmhuirí @ga
preferred label: Izaslanstvo u Parlamentarnoj skupštini Unije za Mediteran @hr
preferred label: Delegatie in de Parlementaire Vergadering van de Unie voor het Middellandse Zeegebied @nl
preferred label: Delegazzjoni għall-Assemblea Parlamentari tal-Unjoni għall-Mediterran @mt
preferred label: Delegationen till den parlamentariska församlingen för unionen för Medelhavsområdet @sv
preferred label: Delegace v Parlamentním shromáždění Unie pro Středomoří @cs
preferred label: Delegacja do Zgromadzenia Parlamentarnego Unii dla Śródziemnomorza @pl
preferred label: Delegation in der Parlamentarischen Versammlung der Union für den Mittelmeerraum @de
preferred label: Αντιπροσωπεία στην Κοινοβουλευτική Συνέλευση της Ένωσης για τη Μεσόγειο @el
preferred label: Delegação à Assembleia Parlamentar da União para o Mediterrâneo @pt
preferred label: Az Unió a Mediterrán Térségért Parlamenti Közgyűlésbe delegált küldöttség @hu

Delegation for relations with the Gulf States and the Gulf Cooperation Council
type: Concept
created: 2023-10-31
deprecated: true
alternative label: Lica valstis un Lica sadarbibas padome @lv
alternative label: Persianlahden maat @fi
alternative label: Stáit na Murascaile agus Comhairle Chomhair na Murascaile @ga
alternative label: L-Istati tal-Golf u l-Kunsill ta’ Kooperazzjoni tal-Golf @mt
alternative label: Štáty Perzského zálivu a Rada Perzského zálivu pre spoluprácu @sk
alternative label: Gulf States and Gulf Cooperation Council
alternative label: Öböl-országok és Öböl Kooperációs Tanács @hu
alternative label: Stati del Golfo e Consiglio di Cooperazione Golfo @it
alternative label: Golfo sr. regiono valst. ir Golfo bendrad. Taryba @lt
alternative label: Κράτη και Συμβούλιο Συνεργασίας του Κόλπου @el
alternative label: Държави от Персийския залив и Съвет за сътрудничество в Персийския залив @bg
alternative label: Države Perzijskega zaliva in Zalivski svet za sodelovanje @sl
alternative label: Etats du Golfe et Conseil de Coopération du Golfe @fr
alternative label: Države Perzijskog zaljeva i Vijeće za suradnju Perzijskog zaljeva @hr
alternative label: Estados do Golfo @pt
alternative label: Panstwa rejonu Zatoki Perskiej i Rada Wspólpracy Zatoki Perskiej @pl
alternative label: Gulfstaterna och Gulfstaternas samarbetsråd @sv
alternative label: Golfstaterne og Golfstaternes Samarbejdsråd @da
alternative label: Státy Perského zálivu a Rada pro spolupráci Perského zálivu @cs
alternative label: Estados del Golfo y Consejo Coop. del Golfo @es
alternative label: Delegatie betrekkingen Golfstaten en Raad Samenw. @nl
alternative label: Golfstaaten und Golfkooperationsrat @de
alternative label: Statele din Golf și Consiliul de Cooperare al Golfului @ro
alternative label: Pärsia lahe äärsed riigid ja Pärsia Lahe Koostöönõukogu @et
broader: Parliamentary delegation
definition: Delegation for relations with the Gulf States and the Gulf Cooperation Council.
in scheme: EP taxonomy on entities.
preferred label: Izaslanstvo za odnose s državama Perzijskog zaljeva i Vijećem za suradnju Perzijskog zaljeva @hr
preferred label: Delegation für die Beziehungen zu den Golfstaaten und dem Golfkooperationsrat @de
preferred label: Delegacija attiecibam ar Lica valstim un Lica sadarbibas padomi @lv
preferred label: Delegationen for Forbindelserne med Golfstaterne og Samarbejdsrådet for Golfstaterne @da
preferred label: Delegação para as relações com os Estados do Golfo e o Conselho de Cooperação do Golfo @pt
preferred label: Delegazione per le relazioni con gli Stati del Golfo e il Consiglio di Cooperazione del Golfo @it
preferred label: Delegación para las relaciones con los Estados del Golfo y el Consejo de Cooperación del Golfo @es
preferred label: Delegacija za odnose z državami Perzijskega zaliva in Zalivski svet za sodelovanje @sl
preferred label: Delegacija ryšiams su Golfo sroves regiono valstybemis ir Golfo bendradarbiavimo Taryba @lt
preferred label: Délégation pour les relations avec les Etats du Golfe et le Conseil de Coopération du Golfe @fr
preferred label: Delegace pro vztahy se státy Perského zálivu a Rada pro spolupráci Perského zálivu @cs
preferred label: Делегация за връзки с държавите от Персийския залив и Съвета за сътрудничество в Персийския залив @bg
preferred label: Delegatie voor de betrekkingen met de Golfstaten en de Raad voor Samenwerking van de Golfstaten @nl
preferred label: Delegacja ds. stosunków z panstwami rejonu Zatoki Perskiej i Rada Wspólpracy Zatoki Perskiej @pl
preferred label: Delegazzjoni ghar-relazzjonijiet ma’ l-Istati tal-Golf u l-Kunsill ta’ Kooperazzjoni tal-Golf @mt
preferred label: Delegationen för förbindelserna med Gulfstaterna och Gulfstaternas samarbetsråd @sv
preferred label: Delegația pentru relațiile cu statele din Golf și Consiliul de Cooperare al Golfului @ro
preferred label: Ühenduse ja Pärsia lahe äärsete riikide ning Pärsia Lahe Koostöönõukogu vaheliste suhetega tegelev delegatsioon @et
preferred label: Αντιπροσωπεία για τις σχέσεις με τα Κράτη του Κόλπου και το Συμβούλιο Συνεργασίας του Κόλπου @el
preferred label: A Öböl-országokkal és az Öböl Kooperációs Tanáccsal való kapcsolatokért felelos küldöttség @hu
preferred label: Delegácia pre vztahy so štátmi Perzského zálivu a Radou Perzského zálivu pre spoluprácu @sk
preferred label: Suhteista Persianlahden maihin ja Persianlahden yhteistyöneuvostoon @fi
preferred label: Toscaireacht don chaidreamh le Stáit na Murascaile agus le Comhairle na Murascaille @ga

Delegation to the EU-Chile Joint Parliamentary Committee
type: Concept
created: 2023-10-31
deprecated: false
alternative label: Čile @hr
alternative label: Čilė @lt
alternative label: Chile
alternative label: Tšiili @et
alternative label: Χιλή @el
alternative label: Čīle @lv
alternative label: Ċilì @mt
alternative label: Chili @fr
alternative label: An tSile @ga
alternative label: Чили @bg
alternative label: Cile @it
broader: Delegation to Joint Parliamentary Committee
definition: Delegation to the EU-Chile Joint Parliamentary Committee.
in scheme: EP taxonomy on entities.
preferred label: Valtuuskunta EU:n ja Chilen parlamentaarisessa sekavaliokunnassa @fi
preferred label: Delegación en la Comisión Parlamentaria Mixta UE-Chile @es
preferred label: Delegace ve Smíšeném parlamentním výboru EU-Chile @cs
preferred label: Delegationen till den gemensamma parlamentarikerkommittén EU-Chile @sv
preferred label: Delegação à Comissão Parlamentar Mista UE-Chile @pt
preferred label: Delegation im Gemischten Parlamentarischen Ausschuss EU-Chile @de
preferred label: Делегация в Съвместния парламентарен комитет ЕС-Чили @bg
preferred label: Αντιπροσωπεία στη Μικτή Κοινοβουλευτική Επιτροπή ΕΕ-Χιλής @el
preferred label: Delegazione alla commissione parlamentare mista UE-Cile @it
preferred label: Delegationen til Det Blandede Parlamentariske Udvalg EU-Chile @da
preferred label: Délégation à la commission parlementaire mixte UE-Chili @fr
preferred label: Delegacja do wspólnej komisji parlamentarnej UE-Chile @pl
preferred label: Delegatie in de Gemengde Parlementaire Commissie EU-Chili @nl
preferred label: An Toscaireacht chun an Chomhchoiste Pharlaimintigh idir AE agus an tSile @ga
preferred label: Az EU–Chile Parlamenti Vegyes Bizottságba delegált küldöttség @hu
preferred label: Delegația la Comisia parlamentară mixtă UE-Chile @ro
preferred label: Delegazzjoni għall-Kumitat Parlamentari Konġunt UE-Ċilì @mt
preferred label: Delegacija pri skupnem parlamentarnem odboru EU-Čile @sl
preferred label: Delegatsioon ELi–Tšiili parlamentaarses ühiskomisjonis @et
preferred label: Izaslanstvo u Zajedničkom parlamentarnom odboru EU-a i Čilea @hr
preferred label: Delegacija ES ir Čilės jungtiniame parlamentiniame komitete @lt
preferred label: Delegācija ES un Čīles apvienotajā parlamentārajā komitejā @lv
preferred label: Delegácia pri Spoločnom parlamentnom výbore EÚ – Čile @sk

Delegation to the EU-Montenegro Stabilisation and Association Parliamentary Committee
type: Concept
created: 2023-10-31
deprecated: false
alternative label: Crna Gora @hr
alternative label: Črna gora @sl
alternative label: Černá Hora @cs
alternative label: Melnkalne @lv
alternative label: Черна гора @bg
alternative label: Čierna Hora @sk
alternative label: Muntenegru @ro
alternative label: Montenegro
alternative label: Montenegró @hu
alternative label: Monténégro @fr
alternative label: Montainéagró @ga
alternative label: Czarnogóra @pl
alternative label: Μαυροβούνιο @el
alternative label: Juodkalnija @lt
broader: Delegation to Joint Parliamentary Committee
definition: Delegation to the EU-Montenegro Stabilisation and Association Parliamentary Committee.
in scheme: EP taxonomy on entities.
preferred label: Délégation à la commission parlementaire de stabilisation et d'association UE-Monténégro @fr
preferred label: Delegação à Comissão Parlamentar de Estabilização e Associação UE-Montenegro @pt
preferred label: Delegacija pri stabilizacijsko-pridružitvenem parlamentarnem odboru EU-Črna gora @sl
preferred label: Delegacija ES ir Juodkalnijos stabilizacijos ir asociacijos parlamentiniame komitete @lt
preferred label: Az EU–Montenegró Stabilizációs és Társulási Parlamenti Bizottságba delegált küldöttség @hu
preferred label: Delegationen till den parlamentariska stabiliserings- och associeringskommittén för EU–Montenegro @sv
preferred label: Delegación en la Comisión Parlamentaria de Estabilización y Asociación UE-Montenegro @es
preferred label: Delegatie in het Parlementair Stabilisatie- en Associatiecomité EU-Montenegro @nl
preferred label: Delegazzjoni għall-Kumitat Parlamentari ta' Stabbilizzazzjoni u Assoċjazzjoni UE-Montenegro @mt
preferred label: Izaslanstvo u Parlamentarnom odboru za stabilizaciju i pridruživanje EU-a i Crne Gore @hr
preferred label: Delegation im Parlamentarischen Stabilitäts- und Assoziationsausschuss EU-Montenegro @de
preferred label: Delegācija ES un Melnkalnes stabilizācijas un asociācijas parlamentārajā komitejā @lv
preferred label: Delegationen til Det Parlamentariske Stabiliserings- og Associeringsudvalg EU-Montenegro @da
preferred label: Делегация в Парламентарния комитет по стабилизиране и асоцииране ЕС – Черна гора @bg
preferred label: Delegatsioon ELi–Montenegro parlamentaarses stabiliseerimis- ja assotsieerimiskomitees @et
preferred label: Delegácia pri Parlamentnom výbore pre stabilizáciu a pridruženie EÚ – Čierna Hora @sk
preferred label: Αντιπροσωπεία στην Κοινοβουλευτική Επιτροπή Σταθεροποίησης και Σύνδεσης ΕΕ-Μαυροβουνίου @el
preferred label: Delegace v Parlamentním výboru pro stabilizaci a přidružení EU-Černá Hora @cs
preferred label: An Toscaireacht chun an Choiste Pharlaimintigh Cobhsaíochta agus Comhlachais idir AE agus Montainéagró @ga
preferred label: Delegacja do Parlamentarnego Komitetu Stabilizacji i Stowarzyszenia UE-Czarnogóra @pl
preferred label: Valtuuskunta EU:n ja Montenegron parlamentaarisessa vakautus- ja assosiaatiovaliokunnassa @fi
preferred label: Delegazione al comitato parlamentare di stabilizzazione e di associazione UE-Montenegro @it
preferred label: Delegația la Comisia parlamentară de stabilizare și de asociere UE-Muntenegru @ro

Temporary committee on improving safety at sea
type: Concept
created: 2023-10-31
deprecated: true
alternative label: Rafforzamento della sicurezza marittima @it
preferred label: Saugumo jūroje gerinimo Laikinasis komitetas @lt
alternative label: Tymczasowa Komisja ds. bezpieczeństwa na morzu @pl
alternative label: Verbesserung der Sicherheit auf See @de
alternative label: Improving safety at sea
alternative label: Ökad sjösäkerhet @sv
preferred label: Dočasný výbor pre zvýšenie bezpečnosti na mori @sk
alternative label: Sábháilteacht ar muir a fheabhsú @ga
alternative label: Tengeri Közlekedés Biztonságának Javításáért Fel. @hu
alternative label: Sikkerhed til Søs @da
alternative label: Il-Kumitat Temporanju għat-Titjib tas-Sigurtà fuq @mt
alternative label: Βελτίωση της ασφάλειας στη θάλασσα @el
alternative label: Poboljšanje sigurnosti na moru @hr
alternative label: Reforço da Segurança Marítima @pt
preferred label: Dočasný výbor pro zlepšení námořní bezpečnosti @cs
alternative label: Refuerzo de la Seguridad Marítima @es
preferred label: Začasni odbor za izboljšanje varnosti na morju @sl
alternative label: Meriturvallisuuden parantaminen @fi
preferred label: Mereohutuse parandamise ajutine komisjon @et
alternative label: Повишаване на морската безопасност @bg
alternative label: Verbetering van de veiligheid op zee @nl
alternative label: Renforcement de la sécurité maritime @fr
preferred label: Drošības jūrā pilnveidošanas pagaidu komiteja @lv
alternative label: Creșterea siguranței maritime @ro
broader: Temporary parliamentary committee
definition: European temporary parliamentary committee on improving safety at sea.
in scheme: EP taxonomy on entities.
preferred label: Det Midlertidige Udvalg om Øget Sikkerhed til Søs @da
preferred label: Coiste sealadach um an tsábháilteacht ar muir a fheabhsú @ga
preferred label: Временна комисия по повишаване на морската безопасност @bg
preferred label: A tengeri közlekedés biztonságának javításáért felelős ideiglenes bizottság @hu
preferred label: Tymczasowa Komisja do Spraw Zwiększenia Bezpieczeństwa na Morzu @pl
preferred label: Nichtständiger Ausschuss für die Verbesserung der Sicherheit auf See @de
preferred label: Comisia temporară privind creșterea siguranței maritime @ro
preferred label: Tillfälligt utskott för ökad sjösäkerhet @sv
preferred label: Προσωρινή επιτροπή για τη βελτίωση της ασφάλειας στη θάλασσα @el
preferred label: Comisión Temporal sobre el Refuerzo de la Seguridad Marítima @es
preferred label: Commissione temporanea sul rafforzamento della sicurezza marittima @it
preferred label: Meriturvallisuuden parantamista käsittelevä väliaikainen valiokunta @fi
preferred label: Tijdelijke commissie voor de verbetering van de veiligheid op zee @nl
preferred label: Il-Kumitat Temporanju għat-Titjib tas-Sigurtà fuq il-Baħar @mt
preferred label: Commission temporaire sur le renforcement de la sécurité maritime @fr
preferred label: Privremeni odbor za poboljšanje sigurnosti na moru @hr
preferred label: Comissão Temporária para o Reforço da Segurança Marítima @pt

Delegation to the EU-Romania Joint Parliamentary Committee
type: Concept
created: 2023-10-31
deprecated: true
alternative label: EU – Rumunjska @hr
alternative label: UE-Rumunia @pl
alternative label: UE-Roumanie @fr
alternative label: EÚ – Rumunsko @sk
alternative label: ΕΕ-Ρουμανία @el
alternative label: UE-Romania @it
alternative label: UE-Roménia @pt
alternative label: UE-România @ro
alternative label: ЕС-Румъния @bg
alternative label: EU-Romanía @es
alternative label: ES un Rumānija @lv
alternative label: AE-an Rómáin @ga
alternative label: EU-Romunija @sl
alternative label: EU-Románia @hu
alternative label: EL-Rumeenia @et
alternative label: EU-Rumänien @sv
alternative label: EU-Rumunsko @cs
alternative label: ES-Rumunija @lt
alternative label: EU-Romania
alternative label: EU-Rumænien @da
alternative label: UE-Rumanija @mt
alternative label: EU-Roemenië @nl
broader: Delegation to Joint Parliamentary Committee
definition: Delegation to the EU-Romania Joint Parliamentary Committee.
in scheme: EP taxonomy on entities.
preferred label: Izaslanstvo u Zajedničkom parlamentarnom odboru EU-a i Rumunjske @hr
preferred label: Delegacija ES ir Rumunijos jungtiniame parlamentiniame komitete @lt
preferred label: Valtuuskunta EU:n ja Romanian parlamentaarisessa sekavaliokunnassa @fi
preferred label: Delegación en la Comisión Parlamentaria Mixta UE-Rumanía @es
preferred label: Delegationen til Det Blandede Parlamentariske Udvalg EU-Rumænien @da
preferred label: Delegationen till den gemensamma parlamentarikerkommittén EU-Rumänien @sv
preferred label: Αντιπροσωπεία στη Μικτή Κοινοβουλευτική Επιτροπή ΕΕ-Ρουμανίας @el
preferred label: Delegation im Gemischten Parlamentarischen Ausschuss EU-Rumänien @de
preferred label: Délégation à la commission parlementaire mixte UE-Roumanie @fr
preferred label: Az EU-Románia Parlamenti Vegyes Bizottságba delegált küldöttség @hu
preferred label: Delegacja do wspólnej komisji parlamentarnej UE-Rumunia @pl
preferred label: Delegácia pri Spoločnom parlamentnom výbore EÚ – Rumunsko @sk
preferred label: Delegația la Comisia parlamentară mixtă UE-România @ro
preferred label: Delegace ve Smíšeném parlamentním výboru EU-Rumunsko @cs
preferred label: Delegatie in de Gemengde Parlementaire Commissie EU-Roemenië @nl
preferred label: Delegācija ES un Rumānijas Apvienotajā parlamentārajā komitejā @lv
preferred label: Delegazione alla commissione parlamentare mista UE-Romania @it
preferred label: Delegação à Comissão Parlamentar Mista UE-Roménia @pt
preferred label: Делегация в Съвместния парламентарен комитет ЕС-Румъния @bg
preferred label: Delegacija pri Skupnem parlamentarnem odboru EU-Romunija @sl
preferred label: Delegatsioon ELi-Rumeenia parlamentaarses ühiskomisjonis @et
preferred label: Delegazzjoni għall-Kumitat Parlamentari Konġunt UE-Rumanija @mt
preferred label: Toscaireacht chun an Chomhchoiste Pharlaimintigh den AE agus den Rómáin @ga

Delegation to the Cariforum-EU Parliamentary Committee
type: Concept
created: 2023-10-31
deprecated: false
alternative label: Cariforum @sv
alternative label: CARIFORUM @el
alternative label: Карифорум @bg
broader: Delegation to Joint Parliamentary Committee
definition: Delegation to the Cariforum-EU Parliamentary Committee.
in scheme: EP taxonomy on entities.
preferred label: Delegationen til Det Parlamentariske Udvalg Cariforum-EU @da
preferred label: Delegazzjoni għall-Kumitat Parlamentari Cariforum-UE @mt
preferred label: Delegacija v parlamentarnem odboru Cariforum-EU @sl
preferred label: Delegatsioon Cariforumi–ELi parlamentaarses komisjonis @et
preferred label: Delegace v Parlamentním výboru EU-Cariforum @cs
preferred label: An Toscaireacht chun an Choiste Pharlaimintigh idir Cariforum agus AE @ga
preferred label: Valtuuskunta Cariforum–EU- parlamentaarisessa valiokunnassa @fi
preferred label: Αντιπροσωπεία στην Κοινοβουλευτική Επιτροπή CARIFORUM-EΕ @el
preferred label: Delegação à Comissão Parlamentar CARIFORUM-UE @pt
preferred label: Delegationen till parlamentarikerkommittén Cariforum–EU @sv
preferred label: Delegación en la Comisión Parlamentaria Cariforum-UE @es
preferred label: Delegacja do Komisji Parlamentarnej CARIFORUM–UE @pl
preferred label: Delegácia pri Parlamentnom výbore Cariforum – EÚ @sk
preferred label: Délégation à la commission parlementaire Cariforum-UE @fr
preferred label: Delegazione alla commissione parlamentare Cariforum-UE @it
preferred label: Izaslanstvo u Zajedničkom parlamentarnom odboru Cariforuma i EU-a @hr
preferred label: Delegation im Parlamentarischen Ausschuss Cariforum-EU @de
preferred label: Delegacija CARIFORUM ir ES parlamentiniame komitete @lt
preferred label: Delegația la Comisia parlamentară Cariforum-UE @ro
preferred label: Delegācija Cariforum valstu un ES parlamentārajā komitejā @lv
preferred label: Делегация в Парламентарния комитет Карифорум - ЕС @bg
preferred label: A CARIFORUM–EU Parlamenti Bizottságba delegált küldöttség @hu
preferred label: Delegatie in de parlementaire commissie Cariforum-EU @nl

Joint committee procedure - BUDG and ECON
type: Concept
created: 2023-10-31
deprecated: false
alternative label: Commissions conjointes BUDG - ECON @fr
alternative label: BUDG und ECON @de
alternative label: Joint BUDG - ECON
broader: Joint parliamentary committees
definition: Joint committee procedure - BUDG and ECON.
in scheme: EP taxonomy on entities.
preferred label: Procédure avec commissions conjointes - BUDG et ECON @fr
preferred label: Gemeinsames Ausschussverfahren - BUDG und ECON @de

European Union Institute for Security Studies
type: Concept
created: 2023-10-31
deprecated: false
definition: European Union Institute for Security Studies.
in scheme: EP taxonomy on entities.
preferred label: Institut d’études de sécurité de l’Union européenne @fr
preferred label: L-Istitut tal-Unjoni Ewropea għall-Istudji fuq is-Sigurtà @mt
preferred label: Inštitut Evropske unije za varnostne študije @sl
preferred label: Eiropas Savienības Drošības izpētes institūts @lv
preferred label: Instituut voor veiligheidsstudies van de Europese Unie @nl
preferred label: Institut der Europäischen Union für Sicherheitsstudien @de
preferred label: Europeiska unionens institut för säkerhetsstudier @sv
preferred label: Институт на Европейския съюз за изследване на сигурността @bg
preferred label: Instytut Unii Europejskiej Studiów nad Bezpieczeństwem @pl
preferred label: Instituto de Estudos de Segurança da União Europeia @pt
preferred label: Ινστιτούτο Μελετών της Ευρωπαϊκής Ένωσης για Θέματα Ασφάλειας @el
preferred label: Euroopa Liidu Julgeoleku-uuringute Instituut @et
preferred label: Ústav Evropské unie pro studium bezpečnosti @cs
preferred label: Az Európai Unió Biztonságpolitikai Kutatóintézete @hu
preferred label: Europos Sąjungos saugumo studijų institutas @lt
preferred label: Den Europæiske Unions Institut for Sikkerhedsstudier @da
preferred label: Institiúid an Aontais Eorpaigh um Staidéar Slándála @ga
preferred label: Inštitút Európskej únie pre bezpečnostné štúdie @sk
preferred label: Institutul pentru Studii de Securitate al Uniunii Europene @ro
preferred label: Institut Europske unije za sigurnosne studije @hr
preferred label: Instituto de Estudios de Seguridad de la Unión Europea @es
preferred label: Euroopan unionin turvallisuusalan tutkimuslaitos @fi
preferred label: Istituto dell’Unione europea per gli studi sulla sicurezza @it

Clean Aviation Joint Undertaking
type: Concept
created: 2023-10-31
deprecated: false
broader: EU joint undertaking
definition: Clean Aviation Joint Undertaking.
in scheme: EP taxonomy on entities.
preferred label: Fællesforetagendet for ren luftfart @da
preferred label: Puhtaan ilmailun yhteisyritys @fi
preferred label: Společný podnik pro čisté letectví @cs
preferred label: Tiszta Légi Közlekedés Közös Vállalkozás @hu
preferred label: Gemeinsames Unternehmen für saubere Luftfahrt @de
preferred label: Wspólne Przedsięwzięcie na rzecz Ekologicznego Lotnictwa @pl
preferred label: Empresa Comum de Aviação Limpa @pt
preferred label: Κοινή επιχείρηση «Καθαρές αερομεταφορές» @el
preferred label: Întreprinderea comună pentru o aviație curată @ro
preferred label: L-Impriża Konġunta Avjazzjoni Nadifa @mt
preferred label: Zajedničko poduzeće za čisto zrakoplovstvo @hr
preferred label: Entreprise commune «Aviation propre» @fr
preferred label: Empresa Común para una Aviación Limpia @es
preferred label: Kopuzņēmums “Tīra aviācija” @lv
preferred label: Det gemensamma företaget för ren luftfart @sv
preferred label: Gemeenschappelijke Onderneming “Schone luchtvaart” @nl
preferred label: Impresa comune «Aviazione pulita» @it
preferred label: Keskkonnahoidliku lennunduse ühisettevõte @et
preferred label: Spoločný podnik pre čisté letectvo @sk
preferred label: Cъвместно предприятие „Чисто въздухоплаване“ @bg
preferred label: Skupno podjetje za čisto letalstvo @sl
preferred label: An Comhghnóthas um Eitlíocht Ghlan @ga
preferred label: Netaršios aviacijos bendroji įmonė @lt

Joint committee procedure - ITRE and REGI
type: CorporateBodyClassification
type: Concept
created: 2026-01-31
deprecated: false
alternative label: Joint ITRE - REGI
alternative label: ITRE und REGI @de
alternative label: Commissions conjointes ITRE - REGI @fr
broader: Joint parliamentary committees
definition: Joint committee procedure - ITRE and REGI.
in scheme: EP taxonomy on entities.
preferred label: Gemeinsames Ausschussverfahren - ITRE und REGI @de
preferred label: Procédure avec commissions conjointes - ITRE et REGI @fr

EU Ethics body
type: Concept
created: 2024-02-22
deprecated: false
broader: EU body
definition: The European Union Ethics body.
in scheme: EP taxonomy on entities.
preferred label: Uniós etikai szerv @hu
preferred label: ELi eetikaorgan @et
preferred label: Organ EU za etiko @sl
preferred label: Orgán EU pro etiku @cs
preferred label: Орган на ЕС по етика @bg
preferred label: Organ UE ds. etyki @pl
preferred label: Organismul european de etică @ro
preferred label: Organismo etico dell'UE @it
preferred label: Korp tal-Etika tal-UE @mt
preferred label: Comhlacht Eitice an Aontais Eorpaigh @ga
preferred label: Organisme européen chargé des questions d’éthique @fr
preferred label: EU:n eettinen elin @fi
preferred label: Órgano de ética de la UE @es
preferred label: Ethikgremium der EU @de
preferred label: EU:s etikorgan @sv
preferred label: Etický orgán EÚ @sk
preferred label: Organismo de Ética da UE @pt
preferred label: ES ētikas struktūra @lv
preferred label: Etičko tijelo EU-a @hr
preferred label: ES etikos organas @lt
preferred label: Φορέας δεοντολογίας της ΕΕ @el
preferred label: Ethisch orgaan van de EU @nl
preferred label: Etisk organ i EU @da

Key Digital Technologies Joint Undertaking
type: Concept
created: 2023-10-31
deprecated: false
broader: EU joint undertaking
definition: Key Digital Technologies Joint Undertaking.
in scheme: EP taxonomy on entities.
preferred label: An Comhghnóthas Eochairtheicneolaíochtaí Digiteacha @ga
preferred label: Spoločný podnik pre kľúčové digitálne technológie @sk
preferred label: Wspólne Przedsięwzięcie na rzecz Kluczowych Technologii Cyfrowych @pl
preferred label: Skupno podjetje za ključne digitalne tehnologije @sl
preferred label: Keskeiset digitaaliteknologiat -yhteisyritys @fi
preferred label: Entreprise commune «Technologies numériques clés» @fr
preferred label: Empresa Comum das Tecnologias Digitais Essenciais @pt
preferred label: Fællesforetagendet for centrale digitale teknologier @da
preferred label: Det gemensamma företaget för viktig digital teknik @sv
preferred label: Zajedničko poduzeće za ključne digitalne tehnologije @hr
preferred label: L-Impriża Konġunta Teknoloġiji Diġitali Ewlenin @mt
preferred label: Peamiste digitehnoloogiate ühisettevõte @et
preferred label: Společný podnik pro klíčové digitální technologie @cs
preferred label: Gemeenschappelijke Onderneming “Digitale sleuteltechnologieën” @nl
preferred label: Întreprinderea comună „Tehnologii digitale esențiale” @ro
preferred label: Gemeinsames Unternehmen für digitale Schlüsseltechnologien @de
preferred label: Bazinių skaitmeninių technologijų bendroji įmonė @lt
preferred label: Impresa comune «Tecnologie digitali fondamentali» @it
preferred label: Kulcsfontosságú Digitális Technológiák Közös Vállalkozás @hu
preferred label: Kopuzņēmums “Svarīgas digitālās tehnoloģijas” @lv
preferred label: Empresa Común para las Tecnologías Digitales Clave @es
preferred label: Κοινή επιχείρηση «Βασικές ψηφιακές τεχνολογίες» @el
preferred label: Съвместно предприятие „Ключови цифрови технологии“ @bg

EU joint undertaking
type: Concept
created: 2023-10-31
deprecated: false
definition: European Joint undertaking.
in scheme: EP taxonomy on entities.
preferred label: Skupno podjetje EU @sl
preferred label: ES kopuzņēmums @lv
preferred label: Entreprise commune de l’UE @fr
preferred label: Gemensamt företag under EU @sv
preferred label: Κοινή επιχείρηση της ΕΕ @el
preferred label: EU’s fællesforetagende @da
preferred label: Impriża konġunta tal-UE @mt
preferred label: Zajedničko poduzeće EU-a @hr
preferred label: Съвместно предприятие на ЕС @bg
preferred label: Společný podnik EU @cs
preferred label: ES bendroji įmonė @lt
preferred label: Impresa comune dell’UE @it
preferred label: Empresa común de la UE @es
preferred label: Gemeinsames Unternehmen der EU @de
preferred label: ELi ühisettevõte @et
preferred label: Empresa comum da UE @pt
preferred label: Gemeenschappelijke onderneming van de EU @nl
preferred label: Întreprinderea comună a UE @ro
preferred label: EU:n yhteisyritys @fi
preferred label: EU közös vállalkozás @hu
preferred label: Wspólne przedsięwzięcie UE @pl
preferred label: Comhghnóthas an AE @ga
preferred label: Spoločný podnik EÚ @sk
top concept of: EP taxonomy on entities.

Osobitný výbor pre zahraničné zasahovanie do všetkých demokratických procesov v Európskej únii vrátane dezinformácií a pre posilnenie integrity, transparentnosti a zodpovednosti v Európskom parlamente
type: Concept
created: 2023-10-31
deprecated: true
alternative label: a külföldi beavatkozással, dezinformációval és az EP feddhetetlenségével foglalkozó különbizottság @hu
alternative label: Special Committee on foreign interference and disinformation, and on strengthening integrity in the EP
alternative label: Ulkomaista sekaantumista ja disinformaatiota ja lahjomattomuutta EP:ssä käsittelevä erityisvaliokunta @fi
alternative label: Posebni odbor o tujem vmešavanju in dezinformacijah ter za večjo integriteto v EP @sl
alternative label: Det Særlige Udvalg om Udenlandsk Indblanding og Desinformation og om Styrkelse af Integritet i EP @da
alternative label: Specialusis užsienio šalių kišimosi ir dezinformacijos klausimų bei EP sąžiningumo stiprinimo komitetas @lt
alternative label: Īpašā komiteja attiecībā uz ārvalstu iejaukšanos un dezinformāciju un EP integritātes stiprināšanu @lv
alternative label: Comissão Especial sobre a Ingerência Estrangeira, a Desinformação, e o Reforço da Integridade no PE @pt
alternative label: Zvláštní výbor pro zahraniční vměšování a dezinformaci a pro posílení bezúhonnosti EP @cs
alternative label: Специална комисия за външната намеса и дезинформацията и за укрепването на почтеността в ЕП @bg
alternative label: Commissione speciale su ingerenze straniere e disinformazione, e rafforzamento dell'integrità al PE @it
alternative label: Comisia specială privind ingerințele externe, dezinformarea și consolidarea integrității în PE @ro
alternative label: Comisión Especial sobre Injerencias Extranjeras y Desinformación, y Refuerzo de la Integridad en el PE @es
alternative label: Komisja Specjalna ds. Obcych Ingerencji i Dezinformacji oraz Wzmocnienia Uczciwości w PE @pl
alternative label: Commission spéciale sur l’ingérence et la désinformation et sur le renforcement de l’intégrité du PE @fr
alternative label: Posebni odbor za vanjsko upletanje i dezinformiranje te za jačanje integriteta u Europskom parlamentu @hr
alternative label: Εξωτερικές παρεμβάσεις, παραπληροφόρηση και ενίσχυση της ακεραιότητας στο ΕΚ @el
alternative label: Osobitný výbor pre zahraničné zasahovanie a dezinformácie a pre posilnenie integrity v EP @sk
alternative label: Välissekkumist ja desinformatsiooni käsitlev ning EPs usaldusväärsuse suurendamisega tegelev erikomisjon @et
alternative label: Sonderausschuss zu Einflussnahme aus dem Ausland und Desinformation und für mehr Integrität im EP @de
alternative label: Särskilt utskott angående utländsk inblandning och desinformation samt stärkande av integriteten i EP @sv
alternative label: Kumitat Speċjali dwar l-Indħil Barrani u d-Diżinformazzjoni u dwar it-Tisħiħ tal-Integrità fil-PE @mt
alternative label: Bijzondere Commissie buitenlandse inmenging, desinformatie en versterking van de integriteit in het EP @nl
alternative label: An Coiste Speisialta um an trasnaíocht eachtrach agus bréagaisnéis, agus um neartú an ionracais in PE @ga
broader: Special parliamentary committee
definition: The creation of the Special Committee for foreign interference in all democratic processes in the EU, including disinformation (INGE) is a message, a very clear alert message sent to all foreign powers trying to interfere in the democratic institutions and processes of the EU and its Members States.
in scheme: EP taxonomy on entities.
preferred label: Bijzondere Commissie buitenlandse inmenging in alle democratische processen in de Europese Unie, met inbegrip van desinformatie, en ter versterking van de integriteit, transparantie en verantwoordingsplicht in het Europees Parlement @nl
preferred label: Specialusis komitetas užsienio šalių kišimosi į visus demokratinius procesus Europos Sąjungoje, įskaitant dezinformaciją, ir Europos Parlamento sąžiningumo, skaidrumo ir atskaitomybės stiprinimo klausimais @lt
preferred label: Comissão Especial sobre a Ingerência Estrangeira em Todos os Processos Democráticos na União Europeia, incluindo a Desinformação, e o Reforço da Integridade, da Transparência e da Responsabilização no Parlamento Europeu @pt
preferred label: Komisja Specjalna ds. Obcych Ingerencji we Wszystkie Procesy Demokratyczne w Unii Europejskiej, w tym Dezinformacji, oraz ds. Wzmocnienia Uczciwości, Przejrzystości i Odpowiedzialności w Parlamencie Europejskim @pl
preferred label: Välissekkumist kõigisse Euroopa Liidu demokraatlikesse protsessidesse, sealhulgas desinformatsiooni käsitlev ning Euroopa Parlamendis usaldusväärsuse, läbipaistvuse ja vastutuse suurendamisega tegelev erikomisjon @et
preferred label: An Coiste Speisialta um an trasnaíocht eachtrach ar na próisis dhaonlathacha uile san Aontas Eorpach, lena n-áirítear an bhréagaisnéis, agus um neartú an ionracais, na trédhearcachta agus na cuntasachta i bParlaimint na hEorpa @ga
preferred label: Commission spéciale sur l’ingérence étrangère dans l’ensemble des processus démocratiques de l’Union européenne, y compris la désinformation, et sur le renforcement de l’intégrité, de la transparence et de la responsabilité au Parlement européen @fr
preferred label: Eιδική Eπιτροπή για τις εξωτερικές παρεμβάσεις συμπεριλαμβανομένης της παραπληροφόρησης, σε όλες τις δημοκρατικές διαδικασίες στην Ευρωπαϊκή Ένωση και την ενίσχυση της ακεραιότητας, της διαφάνειας και της λογοδοσίας στο Ευρωπαϊκό Κοινοβούλιο @el
preferred label: Zvláštní výbor pro zahraniční vměšování do všech demokratických procesů v Evropské unii včetně dezinformací a pro posílení bezúhonnosti, transparentnosti a odpovědnosti v Evropském parlamentu @cs
preferred label: Sonderausschuss zu Einflussnahme aus dem Ausland auf alle demokratischen Prozesse in der Europäischen Union, einschließlich Desinformation, und zur Stärkung der Integrität, Transparenz und Rechenschaftspflicht im Europäischen Parlament @de
preferred label: Comisia specială privind ingerințele externe în toate procesele democratice din Uniunea Europeană, inclusiv dezinformarea, și privind consolidarea integrității, transparenței și responsabilității în Parlamentul European @ro
preferred label: Posebni odbor o tujem vmešavanju v vse demokratične procese v Evropski uniji, tudi o dezinformacijah, ter za večjo integriteto, preglednost in odgovornost v Evropskem parlamentu @sl
preferred label: Īpašā komiteja attiecībā uz ārvalstu iejaukšanos visos demokrātiskajos procesos Eiropas Savienībā, tostarp dezinformāciju, un integritātes, pārredzamības un pārskatatbildības stiprināšanu Eiropas Parlamentā @lv
preferred label: Det Særlige Udvalg om Udenlandsk Indblanding i alle Demokratiske Processer i Den Europæiske Union, herunder Desinformation, og Styrkelse af Integritet, Gennemsigtighed og Ansvarlighed i Europa-Parlamentet @da
preferred label: Särskilt utskott för frågor om utländsk inblandning i alla demokratiska processer i Europeiska unionen, inbegripet desinformation, och om att stärka integriteten, transparensen och ansvarsskyldigheten i Europaparlamentet @sv
preferred label: Kumitat Speċjali dwar l-Indħil Barrani fil-Proċessi Demokratiċi kollha fl-Unjoni Ewropea, inkluża d-Diżinformazzjoni, u t-Tisħiħ tal-Integrità, tat-Trasparenza u tar-Responsabbiltà fil-Parlament Ewropew @mt
preferred label: Специална комисия по въпросите на външната намеса, включително дезинформацията, във всички демократични процеси в Европейския съюз и укрепването на почтеността, прозрачността и отчетността в Европейския парламент @bg
preferred label: Special Committee on foreign interference in all democratic processes in the European Union, including disinformation, and the strengthening of integrity, transparency and accountability in the European Parliament
preferred label: Ulkomaista sekaantumista kaikkiin Euroopan unionin demokraattisiin prosesseihin ja siihen sisältyvää disinformaatiota sekä lahjomattomuuden, avoimuuden ja vastuuvelvollisuuden vahvistamista Euroopan parlamentissa käsittelevä erityisvaliokunta @fi
preferred label: az Európai Unió valamennyi demokratikus folyamatába történő külföldi beavatkozással, többek között a dezinformációval, valamint a feddhetetlenség, az átláthatóság és az elszámoltathatóság Európai Parlamenten belüli megerősítésével foglalkozó különbizottság @hu
preferred label: Commissione speciale sulle ingerenze straniere in tutti i processi democratici nell'Unione europea, inclusa la disinformazione, e sul rafforzamento dell'integrità, della trasparenza e della responsabilità al Parlamento europeo @it
preferred label: Comisión Especial sobre Injerencias Extranjeras en Todos los Procesos Democráticos de la Unión Europea, en particular la Desinformación, y sobre el Refuerzo de la Integridad, la Transparencia y la Rendición de Cuentas en el Parlamento Europeo @es
preferred label: Posebni odbor za vanjsko upletanje u sve demokratske procese u Europskoj uniji, uključujući dezinformiranje, te za jačanje integriteta, transparentnosti i odgovornosti u Europskom parlamentu @hr

European Conservatives and Reformists Group
type: Concept
created: 2023-10-31
deprecated: false
alternative label: Ευρωπαίοι Συντηρητικοί και Μεταρρυθμιστές @el
alternative label: Conservadores y Reformistas Europeos @es
alternative label: Euroopa Konservatiivid ja Reformistid @et
alternative label: Conservadores e Reformistas Europeus @pt
alternative label: Europäische Konservative und Reformer @de
preferred label: Európski konzervatívci a reformisti @sk
preferred label: Eiropas Konservatīvo un reformistu grupa @lv
preferred label: Европейски консерватори и реформисти @bg
alternative label: Evropski konzervativci in reformisti @sl
alternative label: Conservateurs et Réformistes européens @fr
alternative label: Europos konservatoriai ir reformistai @lt
alternative label: Conservatori e Riformisti europei @it
alternative label: Coimeádaithe agus Leasaitheoirí na hEorpa @ga
alternative label: Evropská konzervativní a reformní skupina @cs
alternative label: Europese Conservatieven en Hervormers @nl
alternative label: European Conservatives and Reformists
alternative label: Conservatorii și Reformiștii Europeni @ro
alternative label: Europeiska konservativa och reformister @sv
alternative label: Európai Konzervatívok és Reformerek @hu
preferred label: De Europæiske Konservative og Reformister @da
preferred label: Euroopan konservatiivit ja reformistit @fi
alternative label: Konservattivi u Riformisti Ewropej @mt
preferred label: Europski konzervativci i reformisti @hr
preferred label: Europejscy Konserwatyści i Reformatorzy @pl
broader: POLITICAL GROUP
definition: European political group of the Conservatives and Reformists.
in scheme: EP taxonomy on entities.
preferred label: Grupp tal-Konservattivi u r-Riformisti Ewropej @mt
preferred label: Fraktion der Europäischen Konservativen und Reformer @de
preferred label: Európai Konzervatívok és Reformerek képviselőcsoport @hu
preferred label: Gruppo dei Conservatori e Riformisti europei @it
preferred label: skupina Evropských konzervativců a reformistů @cs
preferred label: Grupo dos Conservadores e Reformistas Europeus @pt
preferred label: Groupe des Conservateurs et Réformistes européens @fr
preferred label: Euroopa Konservatiivide ja Reformistide fraktsioon @et
preferred label: Ομάδα των Ευρωπαίων Συντηρητικών και Μεταρρυθμιστών @el
preferred label: Grupo de los Conservadores y Reformistas Europeos @es
preferred label: Skupina Evropskih konservativcev in reformistov @sl
preferred label: Europos konservatorių ir reformuotojų frakcija @lt
preferred label: Fractie Europese Conservatieven en Hervormers @nl
preferred label: An Grúpa do Choimeádaigh agus Leasaitheoirí na hEorpa @ga
preferred label: Gruppen Europeiska konservativa och reformister @sv
preferred label: Grupul Conservatorilor și Reformiștilor Europeni @ro

Innovative Health Initiative Joint Undertaking
type: Concept
created: 2023-10-31
deprecated: false
broader: EU joint undertaking
definition: Innovative Health Initiative Joint Undertaking.
in scheme: EP taxonomy on entities.
preferred label: Cъвместно предприятие „Инициатива за иновативно здравеопазване“ @bg
preferred label: Impresa comune «Iniziativa per l’innovazione nel settore della salute» @it
preferred label: Empresa Comum da Iniciativa Saúde Inovadora @pt
preferred label: Fællesforetagendet for initiativet om innovativ sundhed @da
preferred label: Întreprinderea comună „Inițiativa pentru inovare în domeniul sănătății” @ro
preferred label: Det gemensamma företaget för initiativet för innovativ hälsa @sv
preferred label: Skupno podjetje za pobudo za inovativno zdravje @sl
preferred label: Kopuzņēmums “Inovatīvas veselības aprūpes iniciatīva” @lv
preferred label: Innovatiivisen terveydenhuollon aloitteen yhteisyritys @fi
preferred label: Wspólne Przedsięwzięcie na rzecz Inicjatywy w dziedzinie Innowacji w Ochronie Zdrowia @pl
preferred label: Innovatív Egészségügy Közös Vállalkozás @hu
preferred label: Spoločný podnik pre iniciatívu Inovatívne zdravotníctvo @sk
preferred label: Κοινή επιχείρηση «Πρωτοβουλία για την Καινοτομία στην Υγεία» @el
preferred label: Společný podnik iniciativy pro inovativní zdravotnictví @cs
preferred label: Zajedničko poduzeće za inicijativu za inovativno zdravlje @hr
preferred label: Entreprise commune «Initiative en matière de santé innovante» @fr
preferred label: Novatoriškų sveikatos sprendimų iniciatyvos bendroji įmonė @lt
preferred label: Gemeenschappelijke Onderneming “Initiatief voor innovatieve gezondheidszorg” @nl
preferred label: Comhghnóthas an Tionscnaimh um Shláinte Nuálach @ga
preferred label: Innovatiivse tervishoiu algatuse ühisettevõte @et
preferred label: Empresa Común para la Iniciativa de Salud Innovadora @es
preferred label: L-Impriża Konġunta Inizjattiva għal Saħħa Innovattiva @mt
preferred label: Gemeinsames Unternehmen „Initiative zu Innovation im Gesundheitswesen“ @de

Delegation for relations with the Arab Peninsula
type: Concept
created: 2023-10-31
deprecated: true
alternative label: Arabische Halbinsel @de
alternative label: Arabisch schiereiland @nl
alternative label: Półwysep Arabski @pl
alternative label: Arab Peninsula
alternative label: Αραβική Χερσόνησος @el
alternative label: Arabský poloostrov @cs
alternative label: Arabský polostrov @sk
alternative label: Arapski poluotok @hr
alternative label: Péninsule arabique @fr
alternative label: Peniżola Għarbija @mt
alternative label: Península Arábiga @es
alternative label: Арабски полуостров @bg
alternative label: Araabia poolsaare riigid @et
alternative label: Leithinis na hAraibe @ga
alternative label: Arābijas pussalas valstis @lv
alternative label: Arabski polotok @sl
alternative label: Arabiska halvön @sv
alternative label: Penisola arabica @it
alternative label: Arabian niemimaa @fi
alternative label: Arabijos pusiasalis @lt
alternative label: Arab-félsziget @hu
alternative label: Peninsula Arabică @ro
alternative label: Arabiske Halvø @da
alternative label: Península Arábica @pt
broader: Parliamentary delegation
definition: Delegation for relations with the Arab Peninsula.
in scheme: EP taxonomy on entities.
preferred label: Delegação para as Relações com a Península Arábica @pt
preferred label: Delegazione per le relazioni con la penisola arabica @it
preferred label: Delegación para las Relaciones con la Península Arábiga @es
preferred label: Delegationen för förbindelserna med Arabiska halvön @sv
preferred label: Delegazzjoni għar-relazzjonijiet mal-Peniżola Għarbija @mt
preferred label: Delegation für die Beziehungen zur Arabischen Halbinsel @de
preferred label: Az Arab-félszigettel fenntartott kapcsolatokért felelős küldöttség @hu
preferred label: Délégation pour les relations avec la péninsule arabique @fr
preferred label: Delegacija ryšiams su Arabijos pusiasaliu @lt
preferred label: Suhteista Arabian niemimaahan vastaava valtuuskunta @fi
preferred label: Delegacja do spraw stosunków z państwami Półwyspu Arabskiego @pl
preferred label: Αντιπροσωπεία για τις σχέσεις με την Αραβική Χερσόνησο @el
preferred label: Delegacija za odnose z Arabskim polotokom @sl
preferred label: Delegationen for Forbindelserne med Den Arabiske Halvø @da
preferred label: Delegația pentru relațiile cu Peninsula Arabică @ro
preferred label: Delegace pro vztahy s Arabským poloostrovem @cs
preferred label: Delegācija attiecībām ar Arābijas pussalas valstīm @lv
preferred label: Делегация за връзки с Арабския полуостров @bg
preferred label: Toscaireacht um chaidreamh le Leithinis na hAraibe @ga
preferred label: Delegácia pre vzťahy s Arabským polostrovom @sk
preferred label: Delegatie voor de betrekkingen met het Arabisch schiereiland @nl
preferred label: Izaslanstvo za odnose s Arapskim poluotokom @hr
preferred label: Delegatsioon Araabia poolsaare riikidega suhtlemiseks @et

European Commission
type: Concept
created: 2023-10-31
deprecated: false
broader: EU institution
definition: European Commission.
in scheme: EP taxonomy on entities.
preferred label: De Europese Commissie @nl
preferred label: Euroopan komissio @fi
preferred label: Comisia europeană @ro
preferred label: Evropská komise @cs
preferred label: Commission Européenne @fr
preferred label: Kummissjoni Ewropea @mt
preferred label: Europakommissionen @sv
preferred label: Európska komisia @sk
preferred label: Euroopa Ühenduste Komisjon @et
preferred label: Eiropas Komisija @lv
preferred label: An Coimisiún Eorpach @ga
preferred label: Europos Komisija @lt
preferred label: Európai Bizottság @hu
preferred label: Evropska komisija @sl
preferred label: Europa-Kommissionen @da
preferred label: Europäische Kommission @de
preferred label: Commissione Europea @it
preferred label: Europska komisija @hr
preferred label: Comisión Europea @es
preferred label: Comissão Europeia @pt
preferred label: Европейска комисия @bg
preferred label: Ευρωπαίκή Επιτροπή @el
preferred label: Komisja Europejska @pl

Delegation to the OACPS-EU Joint Parliamentary Assembly
type: Concept
created: 2023-10-31
deprecated: false
alternative label: OSAKP-UE @mt
alternative label: OAKPD-EU @sl
alternative label: OEACP-UE @fr
alternative label: AKVRO-ELi @et
alternative label: ОДАКТБ – ЕС @bg
alternative label: ESACC-AE @ga
alternative label: OAKPS-EU @de
alternative label: Osaks–EU @sv
alternative label: AKT–EU @fi
alternative label: AKRVO ir ES asamblėjoje @lt
alternative label: ΟΚΑΚΕ-ΕΕ @el
alternative label: OACPS un ES @lv
alternative label: OACPS-EU
alternative label: OASCSS-EU @da
alternative label: OAKTŠ – EÚ @sk
alternative label: OAKTS–EU @cs
alternative label: OACPS–UE @pl
alternative label: AKCSÁSZ–EU @hu
alternative label: OSACP-UE @ro
broader: Temporary parliamentary legislative committee
definition: Delegation to the OACPS-EU Joint Parliamentary Assembly.
in scheme: EP taxonomy on entities.
preferred label: Delegatsioon AKVRO-ELi parlamentaarses ühisassamblees @et
preferred label: az AKCSÁSZ–EU Közös Parlamenti Közgyűlésbe delegált küldöttség @hu
preferred label: Izaslanstvo u Zajedničkoj parlamentarnoj skupštini OAKPD-EU @hr
preferred label: Делегация в Съвместната парламентарна асамблея ОДАКТБ – ЕС @bg
preferred label: Delegacja do Wspólnego Zgromadzenia Parlamentarnego OACPS–UE @pl
preferred label: Delegação à Assembleia Parlamentar Paritária OEACP-UE @pt
preferred label: Valtuuskunta AKT-järjestön ja EU:n yhteisessä parlamentaarisessa edustajakokouksessa @fi
preferred label: Delegation in der Paritätischen Parlamentarischen Versammlung OAKPS-EU @de
preferred label: Delegația la Adunarea Parlamentară Paritară Organizația Statelor ACP-UE @ro
preferred label: Délégation à l'Assemblée parlementaire paritaire OEACP-UE @fr
preferred label: Delegacija pri Skupni parlamentarni skupščini OAKPD-EU @sl
preferred label: Toscaireacht chuig Comhthionól Parlaiminteach ESACC-AE @ga
preferred label: Delegācija OACPS un ES Apvienotajā parlamentārajā asamblejā @lv
preferred label: Αντιπροσωπεία στην Κοινοβουλευτική Συνέλευση Ίσης Εκπροσώπησης ΟΚΑΚΕ-ΕΕ @el
preferred label: Delegazione all'Assemblea parlamentare paritetica OSACP-UE @it
preferred label: Delegationen till den gemensamma parlamentariska församlingen Osaks–EU @sv
preferred label: Delegace ve Smíšeném parlamentním shromáždění OAKTS–EU @cs
preferred label: Delegatie in de Paritaire Parlementaire Vergadering OACPS-EU @nl
preferred label: Delegacija AKRVO ir ES jungtinėje parlamentinėje asamblėjoje @lt
preferred label: Delegazzjoni għall-Assemblea Parlamentari Konġunta OSAKP-UE @mt
preferred label: Delegación en la Asamblea Parlamentaria Paritaria OEACP-UE @es
preferred label: Delegationen til Den Blandede Parlamentariske Forsamling OACSS-EU @da
preferred label: Delegácia pri Spoločnom parlamentnom zhromaždení OAKTŠ – EÚ @sk

Executive agency
type: Concept
created: 2023-10-31
deprecated: false
broader: EU agency
definition: European executive agency.
in scheme: EP taxonomy on entities.
preferred label: Vykdomoji įstaiga @lt
preferred label: Εκτελεστικός οργανισμός @el
preferred label: Výkonná agentúra @sk
preferred label: Agencia ejecutiva @es
preferred label: Exekutivagentur @de
preferred label: Aġenzija eżekuttiva @mt
preferred label: Izvršna agencija @hr
preferred label: Agencja wykonawcza @pl
preferred label: Gníomhaireacht feidhmiúcháin @ga
preferred label: Izpildaģentūra @lv
preferred label: Uitvoerend agentschap @nl
preferred label: Agência de execução @pt
preferred label: Végrehajtó ügynökség @hu
preferred label: Výkonná agentura @cs
preferred label: Forvaltningsorgan @da
preferred label: Изпълнителна агенция @bg
preferred label: Izvajalska agencija @sl
preferred label: Agence exécutive @fr
preferred label: Genomförandeorgan @sv
preferred label: Agenție executivă @ro
preferred label: Toimeenpanovirasto @fi
preferred label: Agenzia esecutiva @it
preferred label: Rakendusamet @et

Temporary committee on the Echelon interception system
type: Concept
created: 2023-10-31
deprecated: true
preferred label: Začasni odbor za Sistem nadzora Echelon @sl
alternative label: Comisión temporal "ECHELON" @es
alternative label: Tymczasowa Komisja ds. systemu nasłuchow. ECHELON @pl
alternative label: Προσωρινή επιτροπή "ECHELON" @el
alternative label: Privremeni odbor „Echelon” @hr
alternative label: Comissão Temporária "ECHELON" @pt
alternative label: Tijdelijke commissie "ECHELON" @nl
alternative label: Commission temporaire "ECHELON" @fr
alternative label: Nichtständiger Ausschuss "ECHELON" @de
preferred label: Pealtkuulamissüsteemi Echeloni ajutine komisjon @et
alternative label: Tillfälligt utskott "ECHELON" @sv
alternative label: Commissione temporanea "ECHELON" @it
alternative label: Kumitat temporanju “ECHELON’ @mt
preferred label: Echelon pārtveršanas sistēmas pagaidu komiteja @lv
alternative label: Coiste sealadach "ECHELON" @ga
preferred label: Dočasný výbor pre odpočúvací systém Echelon @sk
preferred label: Laikinasis komitetas dėl „Echelon“ sekimo sistemos @lt
alternative label: Az Echelon Megfigyelőrendszer Ideiglenes Bizottság @hu
alternative label: Comisia temporară „ECHELON” @ro
alternative label: Temporary committee "ECHELON"
alternative label: Väliaikainen valiokunta "ECHELON" @fi
alternative label: Временна комисия "ECHELON" @bg
alternative label: Midlertidigt Udvalg "Echelon" @da
alternative label: Dočasný výbor „ECHELON“ @cs
broader: Temporary parliamentary committee
definition: European temporary parliamentary committee on the Echelon interception system.
in scheme: EP taxonomy on entities.
preferred label: Privremeni odbor za sustav za presretanje „Echelon” @hr
preferred label: Προσωρινή επιτροπή για το θέμα Echelon @el
preferred label: Kumitat Temporanju dwar is-sistema ta’ intercezzjoni Echelon @mt
preferred label: Commission temporaire sur le système d'interception Echelon @fr
preferred label: Coiste sealadach um an gcóras idircheaptha Echelon @ga
preferred label: Dočasný výbor pro otázky odposlechového systému Echelon @cs
preferred label: Tillfälligt utskott angående övervakningssystemet Echelon @sv
preferred label: Временна комисия по системата за прихващане Echelon @bg
preferred label: Nichtständiger Ausschuss über das Abhörsystem Echelon @de
preferred label: Az Echelon Megfigyelőrendszer Ideiglenes Bizottsága @hu
preferred label: Midlertidigt Udvalg om Echelon-aflytningssystemet @da
preferred label: Tymczasowa Komisja ds. systemu nasłuchowego ECHELON @pl
preferred label: Commissione temporanea sul sistema d'intercettazione Echelon @it
preferred label: Comissão Temporária Sobre o Sistema de Intercepção Echelon @pt
preferred label: Comisia temporară privind sistemul de intercepție ECHELON @ro
preferred label: Comisión temporal sobre el sistema de interceptación Echelon @es
preferred label: Echelon-sieppausjärjestelmää käsittelevä väliaikainen valiokunta @fi
preferred label: Tijdelijke commissie Echelon-interceptiesysteem @nl

Delegation to the EU-UK Parliamentary Partnership Assembly
type: Concept
created: 2023-10-23
deprecated: false
alternative label: Обединено кралство @bg
alternative label: Reino Unido @pt
alternative label: Yhdistynyt kuningaskunta @fi
alternative label: Regno Unito @it
alternative label: Spojené království @cs
alternative label: Zjednoczone Królestwo @pl
alternative label: Regatul Unit @ro
alternative label: Egyesült Királyság @hu
alternative label: Ühendkuningriik @et
alternative label: Vereinigtes Königreich @de
alternative label: Renju Unit @mt
alternative label: Jungtinė Karalystė @lt
alternative label: An Ríocht Aontaithe @ga
alternative label: Ηνωμένο Βασίλειο @el
alternative label: Spojené kráľovstvo @sk
alternative label: Det Forenede Kongerige @da
alternative label: Royaume-Uni @fr
alternative label: Apvienotā Karaliste @lv
alternative label: Verenigd Koninkrijk @nl
alternative label: Förenade kungariket @sv
alternative label: Združeno kraljestvo @sl
alternative label: United Kingdom
alternative label: Ujedinjena Kraljevina @hr
broader: Delegation to Joint Parliamentary Committee
definition: Delegation to the EU-UK Parliamentary Partnership Assembly.
in scheme: EP taxonomy on entities.
preferred label: Delegacija ES ir JK parlamentinėje partnerystės asamblėjoje @lt
preferred label: Delegace v Parlamentním shromáždění pro partnerství EU–Spojené království @cs
preferred label: Делегация в Парламентарната асамблея за партньорство между ЕС и Обединеното кралство @bg
preferred label: Delegácia pri Parlamentnom zhromaždení pre partnerstvo EÚ – Spojené kráľovstvo @sk
preferred label: EU–Egyesült Királyság Parlamenti Partnerségi Közgyűlésbe delegált küldöttség @hu
preferred label: Delegationen til Den Parlamentariske Partnerskabsforsamling EU-Det Forenede Kongerige @da
preferred label: Delegatie in de Parlementaire Partnerschapsassemblee EU-VK @nl
preferred label: Delegación en la Asamblea Parlamentaria de Asociación UE-Reino Unido @es
preferred label: Delegazione all'Assemblea parlamentare di partenariato UE-Regno Unito @it
preferred label: Delegatsioon ELi-Ühendkuningriigi parlamentaarses partnerlusassamblees @et
preferred label: Délégation à l’Assemblée parlementaire de partenariat UE-Royaume-Uni @fr
preferred label: Delegācija ES un Apvienotās Karalistes parlamentāro partnerattiecību asamblejā @lv
preferred label: Valtuuskunta EU:n ja Yhdistyneen kuningaskunnan parlamentaarisessa kumppanuuskokouksessa @fi
preferred label: Toscaireacht chuig Tionól Parlaiminteach Comhpháirtíochta AE-na Ríochta Aontaithe @ga
preferred label: Delegação à Assembleia Parlamentar da Parceria UE-Reino Unido @pt
preferred label: Delegation till den parlamentariska partnerskapsförsamlingen EU‒Förenade kungariket @sv
preferred label: Delegația la Adunarea parlamentară a parteneriatului UE-Regatul Unit @ro
preferred label: Αντιπροσωπεία στην Κοινοβουλευτική Συνέλευση Εταιρικής Σχέσης ΕΕ-Ηνωμένου Βασιλείου @el
preferred label: Izaslanstvo u Parlamentarnoj skupštini za partnerstvo EU-a i Ujedinjene Kraljevine @hr
preferred label: Delegation in der Parlamentarischen Partnerschaftsversammlung EU-Vereinigtes Königreich @de
preferred label: Delegacija pri Parlamentarni skupščini za partnerstvo med EU in Združenim kraljestvom @sl
preferred label: Delegazzjoni għall-Assemblea Parlamentari ta' Sħubija UE-Renju Unit @mt
preferred label: Delegacja do Zgromadzenia Parlamentarnego Partnerstwa UE–Zjednoczone Królestwo @pl

European Training Foundation
type: Concept
created: 2023-10-31
deprecated: false
broader: Decentralised agency
definition: European Training Foundation.
in scheme: EP taxonomy on entities.
preferred label: Evropská nadace odborného vzdělávání @cs
preferred label: Fundația Europeană de Formare @ro
preferred label: Europäische Stiftung für Berufsbildung @de
preferred label: Eiropas Izglītības fonds @lv
preferred label: Fondation européenne pour la formation @fr
preferred label: Il-Fondazzjoni Ewropea għat-Taħriġ @mt
preferred label: Europska zaklada za osposobljavanje @hr
preferred label: Fundação Europeia para a Formação @pt
preferred label: Ευρωπαϊκό Ίδρυμα Επαγγελματικής Εκπαίδευσης @el
preferred label: Europejska Fundacja Kształcenia @pl
preferred label: An Foras Eorpach Oiliúna @ga
preferred label: Evropska fundacija za usposabljanje @sl
preferred label: Fundación Europea de Formación @es
preferred label: Fondazione europea per la formazione @it
preferred label: Európai Képzési Alapítvány @hu
preferred label: Euroopan koulutussäätiö @fi
preferred label: Det Europæiske Erhvervsuddannelsesinstitut @da
preferred label: Euroopa Koolitusfond @et
preferred label: Europos mokymo fondas @lt
preferred label: Európska nadácia pre odborné vzdelávanie @sk
preferred label: Europeiska yrkesutbildningsstiftelsen @sv
preferred label: Европейска фондация за обучение @bg
preferred label: Europese Stichting voor opleiding @nl

Global Health EDCTP Joint Undertaking
type: Concept
created: 2023-10-31
deprecated: false
broader: EU joint undertaking
definition: Global Health EDCTP Joint Undertaking.
in scheme: EP taxonomy on entities.
preferred label: Κοινή επιχείρηση «Παγκόσμιο πρόγραμμα για την υγεία EDCTP» @el
preferred label: Gemeinsames Unternehmen „Global Health EDCPT“ @de
preferred label: Empresa Comum da Saúde Mundial EDCTP @pt
preferred label: Comhghnóthas Shláinte Dhomhanda EDCTP @ga
preferred label: Fællesforetagendet Global Health EDCTP @da
preferred label: Visuotinės sveikatos EDCTP bendroji įmonė @lt
preferred label: Spoločný podnik Globálne zdravie EDCTP @sk
preferred label: Det gemensamma företaget för global hälsa EDCTP @sv
preferred label: Ülemaailmse tervisealgatuse EDCTP ühisettevõte @et
preferred label: Wspólne Przedsięwzięcie na rzecz Programu EDCTP w dziedzinie Globalnego Zdrowia @pl
preferred label: Empresa Común para la Salud Mundial EDCTP @es
preferred label: Globális Egészségügy EDCTP Közös Vállalkozás @hu
preferred label: Kopuzņēmums “Global Health EDCTP” @lv
preferred label: Entreprise commune «EDCTP pour la santé mondiale» @fr
preferred label: Impriża Konġunta Saħħa Globali EDCTP @mt
preferred label: Impresa comune «Salute globale EDCTP» @it
preferred label: Zajedničko poduzeće za globalno zdravlje EDCTP @hr
preferred label: Společný podnik pro partnerství evropských a rozvojových zemí při klinických hodnoceních (EDCTP) v oblasti globálního zdraví @cs
preferred label: Съвместно предприятие „Глобално здравеопазване EDCTP“ @bg
preferred label: Întreprinderea comună EDCTP „Sănătatea la nivel mondial” @ro
preferred label: Skupno podjetje za svetovno zdravje EDCTP @sl
preferred label: Globaalin terveyden EDCTP-yhteisyritys @fi
preferred label: Gemeenschappelijke Onderneming “Mondiale gezondheid EDCTP” @nl

French Senate
type: Concept
created: 2023-10-31
deprecated: false
broader: National chamber
definition: French Senate.
in scheme: EP taxonomy on entities.
preferred label: Сенат на Френската република @bg
preferred label: Franse Senaat @nl
preferred label: det franske Senat @da
preferred label: Seanad na Fraince @ga
preferred label: Senat Francji @pl
preferred label: francouzský Senát @cs
preferred label: Prantsusmaa Senat @et
preferred label: französischer Senat @de
preferred label: francuski Senat @hr
preferred label: Senato francese @it
preferred label: Prancūzijos Respublikos Senatas @lt
preferred label: Senado francés @es
preferred label: francia szenátus @hu
preferred label: Senado francês @pt
preferred label: francúzsky Senát @sk
preferred label: Den franska senaten @sv
preferred label: francoski senat @sl
preferred label: Francijas parlamenta Senāts @lv
preferred label: Ranskan senaatti @fi
preferred label: Sénat français @fr
preferred label: Γαλλική Γερουσία @el
preferred label: Senat Franċiż @mt
preferred label: Senatul Franței @ro

European Defence Agency
type: Concept
created: 2023-10-31
deprecated: false
broader: Common foreign and security policy agency
definition: European Defence Agency.
in scheme: EP taxonomy on entities.
preferred label: Agencia Europea de Defensa @es
preferred label: Evropska obrambna agencija @sl
preferred label: Европейска агенция по отбрана @bg
preferred label: Europeiska försvarsbyrån @sv
preferred label: L-Aġenzija Ewropea għad-Difiża @mt
preferred label: Agência Europeia de Defesa @pt
preferred label: Agence européenne de défense @fr
preferred label: Det Europæiske Forsvarsagentur @da
preferred label: Europejska Agencja Obrony @pl
preferred label: Európai Védelmi Ügynökség @hu
preferred label: Euroopan puolustusvirasto @fi
preferred label: An Ghníomhaireacht Eorpach um Chosaint @ga
preferred label: Europska obrambena agencija @hr
preferred label: Agenzia europea per la difesa @it
preferred label: Európska obranná agentúra @sk
preferred label: Euroopa Kaitseagentuur @et
preferred label: Evropská obranná agentura @cs
preferred label: Europos gynybos agentūra @lt
preferred label: Ευρωπαϊκός Οργανισμός Άμυνας @el
preferred label: Europees Defensieagentschap @nl
preferred label: Agenția Europeană de Apărare @ro
preferred label: Avrupa Savunma Ajansı @tr
preferred label: Eiropas Aizsardzības aģentūra @lv
preferred label: Europäische Verteidigungsagentur @de

Bulgarian Parliament
type: Concept
created: 2023-10-31
deprecated: false
broader: National chamber
definition: Bulgarian Parliament.
in scheme: EP taxonomy on entities.
preferred label: Bulgaaria Rahvuskogu @et
preferred label: bolgár országgyűlés @hu
preferred label: Народно събрание на Република България @bg
preferred label: Parlement bulgare @fr
preferred label: Bulgārijas parlaments @lv
preferred label: Bulgaars parlement @nl
preferred label: bulharské Národní shromáždění @cs
preferred label: bulgarische Volksversammlung @de
preferred label: Parlament Bulgaru @mt
preferred label: bulharské Národné zhromaždenie @sk
preferred label: Zgromadzenie Narodowe Bułgarii @pl
preferred label: bugarska Nacionalna skupština @hr
preferred label: Parlaimint na Bulgáire @ga
preferred label: Det bulgariska parlamentet @sv
preferred label: bolgarska državna skupščina @sl
preferred label: Bulgarijos Respublikos Nacionalinis Susirinkimas @lt
preferred label: Bulgarian parlamentti @fi
preferred label: Parlamento búlgaro @pt
preferred label: Parlamento bulgaro @it
preferred label: den bulgarske Nationalforsamling @da
preferred label: Parlamentul Bulgariei @ro
preferred label: Asamblea Nacional búlgara @es
preferred label: Βουλγαρική Εθνοσυνέλευση @el

Delegation for relations with the Gulf States
type: Concept
created: 2023-10-31
deprecated: true
alternative label: Κράτη του Κόλπου @el
alternative label: Golfstaaten @de
alternative label: Statele din Golf @ro
alternative label: Stati del Golfo @it
alternative label: Estados del Golfo @es
alternative label: Lica valstis @lv
alternative label: Golfo sroves regiono valstybes @lt
alternative label: Gulf States
alternative label: Etats du Golfe @fr
alternative label: Države Perzijskog zaljeva @hr
alternative label: Panstwa Zatoki Perskiej @pl
alternative label: Države Perzijskega zaliva @sl
alternative label: Golfstaterne @da
alternative label: Stáit na Murascaile @ga
alternative label: Státy Perského zálivu @cs
alternative label: Stati tal-Golf @mt
alternative label: Gulfstaterna @sv
alternative label: Държави от Персийския залив @bg
preferred label: Delegatie voor de betrekkingen met de Golfstaten @nl
alternative label: Estados do Golfo @pt
alternative label: Pärsia lahe äärsed riigid @et
alternative label: Štáty Perzského zálivu @sk
alternative label: Persianlahden maat @fi
alternative label: Öböl-országok @hu
broader: Parliamentary delegation
definition: Delegation for relations with the Gulf States.
in scheme: EP taxonomy on entities.
preferred label: Suhteista Persianlahden maihin vastaava valtuuskunta @fi
preferred label: Delegacija za odnose z državami Perzijskega zaliva @sl
preferred label: Делегация за връзки с държавите от Персийския залив @bg
preferred label: Delegacija attiecibam ar Lica valstim @lv
preferred label: Delegationen for Forbindelserne med Golfstaterne @da
preferred label: Delegácia pre vztahy so štátmi Perzského zálivu @sk
preferred label: Delegazzjoni ghar-relazzjonijiet ma’ l-Istati tal-Golf @mt
preferred label: Delegația pentru relațiile cu statele din Golf @ro
preferred label: Az Öböl-országokkal való kapcsolatokért felelos küldöttség @hu
preferred label: Delegation für die Beziehungen zu den Golfstaaten @de
preferred label: Delegacja ds. stosunków z panstwami rejonu Zatoki Perskiej @pl
preferred label: Delegationen för förbindelserna med Gulfstaterna @sv
preferred label: Toscaireacht don chaidreamh le Stáit na Murascaile @ga
preferred label: Délégation pour les relations avec les Etats du Golfe @fr
preferred label: Ühenduse ja Pärsia lahe äärsete riikide vaheliste suhetega tegelev delegatsioon @et
preferred label: Delegace pro vztahy se státy Perského zálivu @cs
preferred label: Delegacija ryšiams su Golfo sroves regiono valstybemis @lt
preferred label: Delegación para las relaciones con los Estados del Golfo @es
preferred label: Αντιπροσωπεία για τις σχέσεις με τα Κράτη του Κόλπου @el
preferred label: Izaslanstvo za odnose s državama Perzijskog zaljeva @hr
preferred label: Delegazione per le relazioni con gli Stati del Golfo @it
preferred label: Delegação para as relações com os Estados do Golfo @pt

Budgetary Conciliation Committee
type: Concept
created: 2025-04-30
deprecated: false
alternative label: Delegación del Parlamento Europeo en el Comité de Conciliación presupuestaria @es
alternative label: Delegacija Evropskega parlamenta v spravnem odboru v proračunskem postopku @sl
alternative label: Delegation des Europäischen Parlaments im Vermittlungsausschuss für Haushaltsfragen @de
alternative label: Αντιπροσωπεία του Ευρωπαϊκού Κοινοβουλίου στην επιτροπή συνδιαλλαγής για τον προϋπολογισμό @el
alternative label: Toscaireacht Pharlaimint na hEorpa chun an Choiste um Idir-réiteach Buiséadach @ga
alternative label: European Parliament delegation to the Budgetary Conciliation Committee
alternative label: Delegação do Parlamento Europeu ao Comité de Conciliação Orçamental @pt
alternative label: Europa-Parlamentets Delegation til Budgetforligsudvalget @da
alternative label: Delegacja Parlamentu Europejskiego do budżetowego komitetu pojednawczego @pl
alternative label: Delegatie van het Europees Parlement in het bemiddelingscomité in het kader van de begrotingsprocedure @nl
alternative label: Europaparlamentets delegation till budgetförlikningskommittén @sv
alternative label: Europos Parlamento delegacija Taikinimo komitete biudžeto klausimais @lt
alternative label: Délégation du Parlement européen au comité budgétaire de conciliation @fr
alternative label: Eiropas Parlamenta delegācija Samierināšanas komitejā budžeta jautājumos @lv
alternative label: Delegația Parlamentului European la Comitetul de conciliere bugetară @ro
alternative label: Izaslanstvo Europskog parlamenta u Odboru za mirenje u proračunskom postupku @hr
alternative label: Delegazzjoni tal-Parlament Ewropew għall-Kumitat ta' Konċiljazzjoni Baġitarja @mt
alternative label: Az Európai Parlament költségvetési egyeztetőbizottságba delegált küldöttsége @hu
alternative label: Delegace Evropského parlamentu v dohodovacím výboru pro rozpočet @cs
alternative label: Delegácia Európskeho parlamentu v rozpočtovom zmierovacom výbore @sk
alternative label: Euroopa Parlamendi delegatsioon eelarve lepituskomitees @et
alternative label: Делегация на Европейския парламент в Помирителния комитет за бюджета @bg
alternative label: Euroopan parlamentin valtuuskunta talousarviomenettelyn sovittelukomiteassa @fi
alternative label: Delegazione del Parlamento europeo al comitato di conciliazione di bilancio @it
broader: Parliamentary committee
definition: European Parliament Budgetary Conciliation Committee.
in scheme: EP taxonomy on entities.
preferred label: Rozpočtový zmierovací výbor @sk
preferred label: Comité de Conciliación presupuestaria @es
preferred label: Dohodovací výbor pro rozpočet @cs
preferred label: Budgetforligsudvalget @da
preferred label: Samierināšanas komiteja budžeta jautājumos @lv
preferred label: Budżetowy komitet pojednawczy @pl
preferred label: Επιτροπή συνδιαλλαγής για τον προϋπολογισμό @el
preferred label: Vermittlungsausschuss für Haushaltsfragen @de
preferred label: Talousarviomenettelyn sovittelukomitea @fi
preferred label: Comitato di conciliazione di bilancio @it
preferred label: Помирителен комитет за бюджета @bg
preferred label: Biudžeto derinimo komitetas @lt
preferred label: Comité de conciliation budgétaire @fr
preferred label: Comité de Conciliação Orçamental @pt
preferred label: Kumitat ta' Konċiljazzjoni Baġitarja @mt
preferred label: Odbor za mirenje u proračunskom postupku @hr
preferred label: Comitetul de conciliere bugetară @ro
preferred label: An Coiste um Idir-réiteach Buiséadach @ga
preferred label: Bemiddelingscomité begroting @nl
preferred label: Eelarve lepituskomitee @et
preferred label: Spravni odbor v proračunskem postopku @sl
preferred label: Költségvetési egyeztetőbizottság @hu
preferred label: Budgetförlikningskommittén @sv

Netherlands House of Representatives
type: Concept
created: 2023-10-31
deprecated: false
broader: National chamber
definition: Netherlands House of Representatives.
in scheme: EP taxonomy on entities.
preferred label: Seconda camera dei Paesi Bassi @it
preferred label: nizozemska poslanska zbornica @sl
preferred label: Nederlandse Tweede Kamer @nl
preferred label: Ολλανδική Κάτω Βουλή @el
preferred label: Den nederländska andra kammaren @sv
preferred label: Nyderlandų Karalystės Antrieji Rūmai @lt
preferred label: niederländische Zweite Kammer @de
preferred label: holandská Druhá komora @sk
preferred label: Alankomaiden parlamentin alahuone @fi
preferred label: Druga Izba parlamentu Niderlandów @pl
preferred label: nizozemská Druhá komora @cs
preferred label: It-Tieni Kamra tan-Netherlands @mt
preferred label: nizozemski Zastupnički dom @hr
preferred label: det nederlandske Andetkammer @da
preferred label: holland alsóház @hu
preferred label: Втора камара на Кралство Нидерландия @bg
preferred label: Congreso de los Diputados neerlandés @es
preferred label: Camera Inferioară a Parlamentului Țărilor de Jos @ro
preferred label: Madalmaade Parlamendi Teine Koda @et
preferred label: Câmara Baixa dos Estados Gerais @pt
preferred label: Seconde Chambre néerlandaiseves @fr
preferred label: Nīderlandes parlamenta Otrā palāta @lv
preferred label: Teach Ionadaithe na hÍsiltíre @ga

Joint committee procedure - AGRI and FEMM
type: Concept
created: 2023-10-31
deprecated: false
alternative label: Commissions conjointes AGRI - FEMM @fr
alternative label: Joint AGRI - FEMM
alternative label: AGRI und FEMM @de
broader: Joint parliamentary committees
definition: Joint committee procedure - AGRI and FEMM.
in scheme: EP taxonomy on entities.
preferred label: Procédure avec commissions conjointes - AGRI et FEMM @fr
preferred label: Gemeinsames Ausschussverfahren - AGRI und FEMM @de

Committee on Civil Liberties, Justice and Home Affairs
type: Concept
created: 2023-10-31
deprecated: false
alternative label: Libertà civili, giustizia e affari interni @it
alternative label: Libertades Civiles, Justicia y Asuntos de Interior @es
alternative label: Bürgerliche Freiheiten, Justiz und Inneres @de
alternative label: Pilsoņu brīvības, tieslietas un iekšlietas @lv
alternative label: Wolności Obywatelskie, Sprawiedliwość i Sprawy Wewnętrzne @pl
alternative label: Državljanske svoboščine, pravosodje in notranje zadeve @sl
alternative label: Občianske slobody, spravodlivosť a vnútorné veci @sk
alternative label: Libertajiet Ċivili, Ġustizzja u Intern @mt
alternative label: Граждански свободи, правосъдие и вътрешни работи @bg
alternative label: Medborgerliga fri- och rättigheter samt rättsliga och inrikes frågor @sv
alternative label: Kodanikuvabadused ning justiits- ja siseasjad @et
alternative label: Állampolgári jogok, bel- és igazságügy @hu
alternative label: Piliečių laisvės, teisingumas ir vidaus reikalai @lt
alternative label: Kansalaisvapaudet sekä oikeus- ja sisäasiat @fi
alternative label: Burgerlijke vrijheden, justitie en binnenlandse zaken @nl
alternative label: Libertés civiles, justice et affaires intérieures @fr
alternative label: Πολιτικές Ελευθερίες, Δικαιοσύνη και Εσωτερικές Υποθέσεις @el
alternative label: Civil Liberties, Justice and Home Affairs
alternative label: Občanské svobody, spravedlnost a vnitřní věci @cs
alternative label: Borgernes Rettigheder og Retlige og Indre Anliggender @da
alternative label: Libertăți civile, justiție și afaceri interne @ro
alternative label: Liberdades Cívicas, Justiça e Assuntos Internos @pt
alternative label: Saoirsí Sibhialta, an Ceartas agus Gnóthaí Baile @ga
alternative label: Građanske slobode, pravosuđe i unutarnji poslovi @hr
broader: Standing parliamentary committee
definition: European parliamentary committee on civil liberties, justice and home affairs.
in scheme: EP taxonomy on entities.
preferred label: Állampolgári Jogi, Bel- és Igazságügyi Bizottság @hu
preferred label: Comisia pentru libertăți civile, justiție și afaceri interne @ro
preferred label: An Coiste um Shaoirsí Sibhialta, um Cheartas agus um Ghnóthaí Baile @ga
preferred label: Commissione per le libertà civili, la giustizia e gli affari interni @it
preferred label: Comisión de Libertades Civiles, Justicia y Asuntos de Interior @es
preferred label: Kansalaisvapauksien sekä oikeus- ja sisäasioiden valiokunta @fi
preferred label: Utskottet för medborgerliga fri- och rättigheter samt rättsliga och inrikes frågor @sv
preferred label: Pilsoņu brīvību, tieslietu un iekšlietu komiteja @lv
preferred label: Odbor za državljanske svoboščine, pravosodje in notranje zadeve @sl
preferred label: Výbor pre občianske slobody, spravodlivosť a vnútorné veci @sk
preferred label: Piliečių laisvių, teisingumo ir vidaus reikalų komitetas @lt
preferred label: Výbor pro občanské svobody, spravedlnost a vnitřní věci @cs
preferred label: Komisja Wolności Obywatelskich, Sprawiedliwości i Spraw Wewnętrznych @pl
preferred label: Odbor za građanske slobode, pravosuđe i unutarnje poslove @hr
preferred label: Udvalget om Borgernes Rettigheder og Retlige og Indre Anliggender @da
preferred label: Ausschuss für bürgerliche Freiheiten, Justiz und Inneres @de
preferred label: Kodanikuvabaduste, justiits- ja siseasjade komisjon @et
preferred label: Комисия по граждански свободи, правосъдие и вътрешни работи @bg
preferred label: Επιτροπή Πολιτικών Ελευθεριών, Δικαιοσύνης και Εσωτερικών Υποθέσεων @el
preferred label: Commissie burgerlijke vrijheden, justitie en binnenlandse zaken @nl
preferred label: Commission des libertés civiles, de la justice et des affaires intérieures @fr
preferred label: Comissão das Liberdades Cívicas, da Justiça e dos Assuntos Internos @pt
preferred label: Kumitat għal-Libertajiet Ċivili, il-Ġustizzja u l-Intern @mt

Joint committee procedure - AFET and CULT
type: Concept
created: 2023-10-31
deprecated: false
alternative label: AFET und CULT @de
alternative label: Joint AFET - CULT
alternative label: Commissions conjointes AFET - CULT @fr
broader: Joint parliamentary committees
definition: Joint committee procedure - AFET and CULT.
in scheme: EP taxonomy on entities.
preferred label: Procédure avec commissions conjointes - AFET et CULT @fr
preferred label: Gemeinsames Ausschussverfahren - AFET und CULT @de

Joint committee procedure - INTA and FEMM
type: Concept
created: 2023-10-31
deprecated: false
alternative label: Joint INTA - FEMM
alternative label: Commissions conjointes INTA - FEMM @fr
broader: Joint parliamentary committees
definition: Joint committee procedure - INTA and FEMM.
in scheme: EP taxonomy on entities.
preferred label: Gemeinsames Ausschussverfahren - INTA und FEMM @de
preferred label: Procédure avec commissions conjointes - INTA et FEMM @fr

Joint committee procedure - JURI - LIBE - AFCO
type: Concept
created: 2023-10-31
deprecated: false
alternative label: Joint JURI - LIBE - AFCO
alternative label: JURI - LIBE - AFCO @de
alternative label: Commissions conjointes JURI - LIBE - AFCO @fr
broader: Joint parliamentary committees
definition: Joint committee procedure - JURI - LIBE - AFCO.
in scheme: EP taxonomy on entities.
preferred label: Gemeinsames Ausschussverfahren - JURI - LIBE - AFCO @de
preferred label: Procédure avec commissions conjointes - JURI - LIBE - AFCO @fr

European Research Executive Agency
type: Concept
created: 2023-10-31
deprecated: false
broader: Executive agency
definition: European Research Executive Agency.
in scheme: EP taxonomy on entities.
preferred label: Европейска изпълнителна агенция за научни изследвания @bg
preferred label: Agence exécutive européenne pour la recherche @fr
preferred label: Europeiska genomförandeorganet för forskning @sv
preferred label: Ευρωπαϊκός Εκτελεστικός Οργανισμός Έρευνας @el
preferred label: Agenzia esecutiva europea per la ricerca @it
preferred label: Európska výkonná agentúra pre výskum @sk
preferred label: Euroopan tutkimuksen toimeenpanovirasto @fi
preferred label: Evropská výkonná agentura pro výzkum @cs
preferred label: An Ghníomhaireacht Feidhmiúcháin Eorpach um Thaighde @ga
preferred label: Agência de Execução Europeia da Investigação @pt
preferred label: Europees Uitvoerend Agentschap onderzoek @nl
preferred label: Europäische Exekutivagentur für die Forschung @de
preferred label: Euroopa Teadusuuringute Rakendusamet @et
preferred label: Evropska izvajalska agencija za raziskave @sl
preferred label: Agenția Executivă Europeană pentru Cercetare @ro
preferred label: Europska izvršna agencija za istraživanje @hr
preferred label: Europos mokslinių tyrimų vykdomoji įstaiga @lt
preferred label: Eiropas Pētniecības izpildaģentūra @lv
preferred label: Europejska Agencja Wykonawcza ds. Badań Naukowych @pl
preferred label: Európai Kutatási Végrehajtó Ügynökség @hu
preferred label: L-Aġenzija Eżekuttiva Ewropea għar-Riċerka @mt
preferred label: Agencia Ejecutiva Europea de Investigación @es
preferred label: Det Europæiske Forvaltningsorgan for Forskning @da

Patriots for Europe Group
type: Concept
created: 2025-01-31
deprecated: false
alternative label: Patriotten @nl
alternative label: Πατριώτες @el
alternative label: Patrioterne @da
alternative label: Patrioți @ro
alternative label: Patrioti @it
alternative label: Domoljubi @sl
alternative label: Patriotas @pt
alternative label: Patrijotti @mt
alternative label: Tírghráthóirí @ga
alternative label: Patriotes @fr
alternative label: Patrioci @pl
alternative label: Patriootit @fi
alternative label: Patrioten @de
alternative label: Patriotai @lt
alternative label: Patrioodid @et
alternative label: Patriots
alternative label: Patrioter @sv
alternative label: Патриоти @bg
alternative label: Patrióták @hu
broader: POLITICAL GROUP
definition: European political group Patriots for Europe.
in scheme: EP taxonomy on entities.
preferred label: Grupo «Patriotas pela Europa» @pt
preferred label: Gruppo "Patrioti per l'Europa" @it
preferred label: Fractie Patriotten voor Europa @nl
preferred label: Euroopa Patriootide fraktsioon @et
preferred label: An Grúpa 'Tírghráthóirí don Eoraip' @ga
preferred label: Grupa “Eiropas patrioti” @lv
preferred label: Euroopan patriootit -ryhmä @fi
preferred label: Groupe Patriotes pour l’Europe @fr
preferred label: Skupina Domoljubi za Evropo @sl
preferred label: Skupina Patrioti pro Evropu @cs
preferred label: Ομάδα «Πατριώτες για την Ευρώπη» @el
preferred label: Grupp Patrijotti għall-Ewropa @mt
preferred label: Frakcija „Patriotai už Europą“ @lt
preferred label: Gruppen Patrioter for Europa @da
preferred label: Grupa Patrioci za Europą @pl
preferred label: Gruppen Patrioter för Europa @sv
preferred label: Fraktion Patrioten für Europa @de
preferred label: Grupo Patriotas por Europa @es
preferred label: Skupina Patrioti pre Európu @sk
preferred label: Grupul „Patrioți pentru Europa” @ro
preferred label: Patrióták Európáért képviselőcsoport @hu
preferred label: Група „Патриоти за Европа“ @bg
preferred label: Klub zastupnika Patrioti za Europu @hr