Standard legislative act
type: Concept
deprecated: false
broader: Procedure nature
created: 2024-07-01
definition: Procedure nature used for standard legislative proposal.
in scheme: EP taxonomy on procedure types.
preferred label: Acte législatif standard @fr

Procedure nature
type: Concept
deprecated: false
definition: European Parliament procedures' natures.
top concept of: EP taxonomy on procedure types.
created: 2024-07-01
preferred label: Nature de la procédure @fr
in scheme: EP taxonomy on procedure types.

EP taxonomy on procedure types.
type: ConceptScheme
created: 2023-10-31
creator: EP
version info: 20250930_1
modified: 2025-09-30
description: Taxonomy of the European Parliament on procedure types.

Written declaration
type: ProcessType
preferred label: Писмена декларация @bg
preferred label: Declaración por escrito @es
preferred label: Γραπτή δήλωση @el
preferred label: Oświadczenie pisemne @pl
preferred label: Dikjarazzjoni bil-miktub @mt
in scheme: EP taxonomy on procedure types.
preferred label: Declaração escrita @pt
preferred label: Rakstiska deklarācija @lv
preferred label: Skriftlig förklaring @sv
preferred label: Schriftliche Erklärung @de
preferred label: Írásbeli nyilatkozat @hu
preferred label: Pisna izjava @sl
preferred label: Pisana izjava @hr
broader: Internal procedure
preferred label: Rašytinis pareiškimas @lt
created: 2023-10-31
preferred label: Schriftelijke verklaring @nl
preferred label: Písemné prohlášení @cs
definition: Procedure used when the European Parliament submit a statement in the form of a written declaration.
preferred label: Kirjalik deklaratsioon @et
preferred label: Kirjallinen kannanotto @fi
preferred label: Skriftlig erklæring @da
preferred label: Déclaration écrite @fr
deprecated: true
preferred label: Písomné vyhlásenie @sk
preferred label: Dearbhú i scríbhinn @ga
type: Concept
preferred label: Declarație scrisă @ro
preferred label: Dichiarazione scritta @it

Internal procedure
type: Concept
deprecated: false
definition: European Parliament procedures.
in scheme: EP taxonomy on procedure types.
top concept of: EP taxonomy on procedure types.
created: 2023-10-31
preferred label: Procédure interne @fr

Legislative initiative procedure
type: ProcessType
preferred label: Postupak zakonodavne inicijative @hr
preferred label: Διαδικασία νομοθετικής πρωτοβουλίας @el
preferred label: Procedura di iniziativa legislativa @it
preferred label: Lagstiftningsinitiativförfarande @sv
preferred label: Teisėkūros iniciatyvos procedūra @lt
created: 2023-10-31
preferred label: Processo de iniciativa legislativa @pt
preferred label: Seadusandliku algatuse menetlus @et
preferred label: Процедура по законодателна инициатива @bg
in scheme: EP taxonomy on procedure types.
preferred label: Procedura de inițiativă legislativă @ro
deprecated: false
preferred label: Likumdošanas iniciatīvas procedūra @lv
preferred label: Proċedura ta' inizjattiva leġiżlattiva @mt
narrow match: INL
type: Concept
preferred label: Nós imeachta tionscnaimh reachtaigh @ga
preferred label: Jogalkotást kezdeményező eljárás @hu
preferred label: Procedura inicjatywy ustawodawczej @pl
preferred label: Procédure d’initiative législative @fr
definition: Procedure used when European Parliament uses its right for own initiative around a legislative matter, under TFUE Art 225.
preferred label: Postup pro legislativní podnět @cs
preferred label: Procedimiento de iniciativa legislativa @es
preferred label: Wetgevingsinitiatiefprocedure @nl
preferred label: Verfahren der Rechtsetzungsinitiative @de
broader: Internal procedure
preferred label: Postup legislatívnej iniciatívy @sk
preferred label: Lainsäädäntöaloitteisiin sovellettava menettely @fi
preferred label: Postopek zakonodajne pobude @sl
preferred label: Procedure for lovgivningsmæssige initiativer @da

Non-legislative enactments
type: Concept
preferred label: Nezakonodavni akti @hr
created: 2023-10-31
broader: Interinstitutional procedure
preferred label: Lois non législatives @fr
preferred label: Neleģislatīvie akti @lv
preferred label: Nelegislativní předpisy @cs
preferred label: Nem jogalkotási aktusok @hu
preferred label: Disposiciones no legislativas @es
preferred label: Niet-wetgevende besluiten @nl
preferred label: Promulgações não legislativas @pt
preferred label: Μη νομοθετικές πράξεις @el
preferred label: Promulgazzjonijiet mhux leġiżlattivi @mt
preferred label: Nezakonodajni akti @sl
definition: Procedure used to adopt legal acts of general nature for which the execution details will be dealt with through secondary legislation.
deprecated: false
preferred label: Rättsakter som inte avser lagstiftning @sv
preferred label: Nelegislatívne akty @sk
preferred label: Akty nieustawodawcze @pl
preferred label: Su teisėkūra nesusiję teisės aktai @lt
preferred label: Ikke-lovgivningsmæssige retsakter @da
preferred label: Незаконодателни актове @bg
in scheme: EP taxonomy on procedure types.
preferred label: Muut kuin lainsäädäntösäädökset @fi
preferred label: Disposizioni non legislative @it
preferred label: Nichtlegislative Rechtsakte @de
preferred label: Muud kui seadusandlikud aktid @et
type: ProcessType
preferred label: Acte legislative fără caracter legislativ @ro
preferred label: Achtacháin neamhreachtacha @ga

Interinstitutional procedure
type: Concept
deprecated: false
in scheme: EP taxonomy on procedure types.
top concept of: EP taxonomy on procedure types.
created: 2023-10-31
definition: Procedure involving two or more institutions.
preferred label: Procédure interinstitutionnelle @fr

Waiver of immunity
type: Concept
deprecated: false
broader: Procedure nature
definition: Procedure nature used to request waiver of immunity.
in scheme: EP taxonomy on procedure types.
created: 2024-07-01
preferred label: Levée d'immunité @fr

Assent procedure
type: Concept
definition: Procedure introduced by the Single European Act used for several very important decisions, as well as for matters where the member states wish to retain a larger degree of control.
preferred label: Procédure d’avis conforme du PE @fr
preferred label: EP piekrišanas procedūra @lv
created: 2023-10-31
preferred label: Procedure med EP’s samstemmende udtalelse @da
preferred label: Instemmingsprocedure van het EP @nl
preferred label: Procedimiento de dictamen conforme @es
broader: Interinstitutional procedure
preferred label: Nõusolekumenetlus @et
preferred label: Postopek privolitve EP @sl
preferred label: Procedura zgody @pl
preferred label: Postupak pristanka @hr
preferred label: Proċedura ta' kunsens @mt
preferred label: Procedura avizului conform @ro
type: ProcessType
preferred label: Zustimmungsverfahren @de
preferred label: Процедура на одобрение @bg
preferred label: Procedura di parere conforme @it
preferred label: Samtyckesförfarandet @sv
preferred label: Postup súhlasu EP @sk
preferred label: Postup souhlasu EP @cs
in scheme: EP taxonomy on procedure types.
preferred label: Nós imeachta an aontaithe @ga
preferred label: Hozzájárulási eljárás @hu
preferred label: EP pritarimo procedūra @lt
preferred label: EP:n hyväksyntämenettely @fi
deprecated: true
preferred label: Διαδικασία σύμφωνης γνώμης @el
preferred label: Procedimento de parecer favorável PE @pt

Debate or resolution on oral question
type: Concept
deprecated: false
broader: Procedure nature
in scheme: EP taxonomy on procedure types.
created: 2024-07-01
definition: Procedure nature used to submit a resolution or a debate on oral question.
preferred label: Débat ou résolution sur question orale @fr

Delegated acts
type: ProcessType
preferred label: Atti delegati @it
preferred label: Πράξεις κατ’ εξουσιοδότηση @el
preferred label: Delegované akty @sk
preferred label: Делегирани актове @bg
preferred label: Akty v přenesené pravomoci @cs
preferred label: Delegeeritud õigusaktid @et
broader: Internal procedure
deprecated: false
preferred label: Delegirani akti @sl
preferred label: Delegerade akter @sv
preferred label: Felhatalmazáson alapuló jogi aktusok @hu
preferred label: Delegierte Rechtsakte @de
preferred label: Deleguotieji aktai @lt
preferred label: Actos delegados @es
preferred label: Akty delegowane @pl
preferred label: Gedelegeerde handelingen @nl
preferred label: Acte delegate @ro
narrow match: DEA
created: 2023-10-31
preferred label: Deleģētie akti @lv
preferred label: Delegerede retsakter @da
preferred label: Gníomhartha tarmligthe @ga
in scheme: EP taxonomy on procedure types.
preferred label: Delegoidut säädökset @fi
type: Concept
preferred label: Atti ddelegati @mt
preferred label: Atos delegados @pt
definition: Procedure used when establishing the secondary legislation to grant European Commission the mandate to establish delegated acts, but only if primary legislation allows for it and only within the boundaries set by the primary legislation.
preferred label: Actes délégués @fr

Discharge
type: Concept
deprecated: false
broader: Procedure nature
preferred label: Décharge @fr
definition: Procedure nature used for procedure on budget discharge.
created: 2024-07-01
in scheme: EP taxonomy on procedure types.

International agreement
type: Concept
deprecated: true
broader: Procedure nature
created: 2024-07-01
definition: Procedure nature used for international agreements.
in scheme: EP taxonomy on procedure types.
preferred label: Accord international @fr

Urgent debate or resolution
type: Concept
deprecated: false
broader: Procedure nature
created: 2024-07-01
definition: Procedure nature used to request urgent debate or resolution.
in scheme: EP taxonomy on procedure types.
preferred label: Débat ou résolution d'urgence @fr

Defense of immunity
type: Concept
deprecated: false
broader: Procedure nature
in scheme: EP taxonomy on procedure types.
created: 2024-07-01
definition: Procedure nature used for procedure on immunity defense.
preferred label: Défense d'immunité @fr

Parliament's Rules of Procedure
type: Concept
preferred label: Regolamento del Parlamento @it
preferred label: Parlamenta Reglaments @lv
preferred label: Euroopa Parlamendi kodukord @et
preferred label: Reglement van het Parlement @nl
preferred label: Rialacha Nós Imeachta na Parlaiminte @ga
preferred label: Regimento do Parlamento @pt
preferred label: Parlamentin työjärjestys @fi
in scheme: EP taxonomy on procedure types.
preferred label: Правилник за дейността на Европейския парламент @bg
created: 2023-10-31
preferred label: Poslovnik Parlamenta @hr
preferred label: Κανονισμός του Κοινοβουλίου @el
deprecated: false
preferred label: Regoli ta’ proċedura tal-Parlament @mt
broader: Internal procedure
preferred label: Jednací řád Parlamentu @cs
preferred label: Parlamentets forretningsorden @da
preferred label: EP darbo tvarkos taisyklės @lt
preferred label: Rokovací poriadok Parlamentu @sk
preferred label: Geschäftsordnung des Parlaments @de
preferred label: Règlement du Parlement @fr
preferred label: Reglamento del Parlamento @es
definition: Procedure used for changes related to the Rules of Procedure of the European Parliament.
preferred label: Regulamin Parlamentu @pl
preferred label: Regulamentul de procedură al Parlamentului @ro
preferred label: A Parlament eljárási szabályzata @hu
type: ProcessType
preferred label: Europaparlamentets arbetsordning @sv

Request to the Commission to submit a legislative proposal
type: Concept
deprecated: false
broader: Procedure nature
in scheme: EP taxonomy on procedure types.
created: 2024-07-01
definition: Procedure nature used to request Commission to submit a legislative proposal.
preferred label: Demande à la Commission de soumettre une proposition législative @fr

Consent by Parliament
type: Concept
deprecated: false
broader: Procedure nature
definition: Procedure nature used for request for consent of the European Parliament.
created: 2024-07-01
preferred label: Approbation du Parlement @fr
in scheme: EP taxonomy on procedure types.

Suspension of consent procedure
type: Concept
deprecated: false
broader: Procedure nature
created: 2024-07-01
definition: Procedure nature used to suspend consent procedure.
preferred label: Suspension de la procédure d'approbation @fr
in scheme: EP taxonomy on procedure types.

Annual report
type: Concept
deprecated: false
broader: Procedure nature
definition: Procedure nature used to submit annual report.
in scheme: EP taxonomy on procedure types.
created: 2024-07-01
preferred label: Rapport annuel @fr

Consent procedure
type: ProcessType
preferred label: Hyväksyntämenettely @fi
preferred label: Hozzájárulási eljárás @hu
broader: Interinstitutional procedure
preferred label: Procédure de consentement @fr
preferred label: Nós imeachta an toilithe @ga
preferred label: Procedimento de aprovação @pt
preferred label: Zustimmungsverfahren @de
preferred label: Samtykkeprocedure @da
preferred label: Nõusolekumenetlus @et
preferred label: Godkännandeförfarande @sv
definition: Procedure used for adopting most international agreements as stated in TFEU Art 289(2).
deprecated: false
preferred label: Procedura zgody @pl
preferred label: Procedura de aprobare @ro
preferred label: Postopek odobritve @sl
preferred label: Sutikimo procedūra @lt
preferred label: Postupak suglasnosti @hr
preferred label: Piekrišanas procedūra @lv
in scheme: EP taxonomy on procedure types.
preferred label: Процедура за одобрение @bg
preferred label: Proċedura ta’ kunsens @mt
preferred label: Διαδικασία έγκρισης @el
created: 2023-10-31
type: Concept
preferred label: Postup souhlasu @cs
preferred label: Toestemmingsprocedure @nl
preferred label: Postup súhlasu @sk
preferred label: Procedimiento de autorización @es
preferred label: Procedura di approvazione @it

Examination of a delegated act
type: Concept
deprecated: false
broader: Procedure nature
created: 2024-07-01
definition: Procedure nature used for procedure on the examination of a delegated act.
in scheme: EP taxonomy on procedure types.
preferred label: Examen d'un acte délégué @fr

Special committee / Committee of inquiry
type: Concept
deprecated: false
broader: Procedure nature
in scheme: EP taxonomy on procedure types.
created: 2024-07-01
definition: Procedure nature used for special committee / committee of inquiry.
preferred label: Commission spéciale / d'enquête @fr

Recast
type: Concept
deprecated: false
broader: Procedure nature
definition: Procedure nature used for recast procedure.
created: 2024-07-01
preferred label: Refonte @fr
in scheme: EP taxonomy on procedure types.

Motion of censure
type: Concept
deprecated: false
broader: Procedure nature
created: 2024-07-01
definition: Procedure nature used to request motion of censure.
in scheme: EP taxonomy on procedure types.
preferred label: Motion de censure @fr

Organisation of Parliament
type: Concept
preferred label: Parlamentin organisaatio @fi
preferred label: Organisation du Parlement @fr
preferred label: Организация на Парламента @bg
preferred label: Οργάνωση του Κοινοβουλίου @el
preferred label: Organização do Parlamento @pt
preferred label: Organizzazzjoni tal-Parlament @mt
preferred label: Organizacija Parlamenta @sl
definition: Procedure used to deal organisational matters of the European Parliament.
created: 2023-10-31
preferred label: Organisation des Parlaments @de
preferred label: Organización del Parlamento @es
preferred label: Euroopa Parlamendi ülesehitus @et
deprecated: false
preferred label: Organizarea Parlamentului @ro
type: ProcessType
broader: Internal procedure
preferred label: A Parlament szervezeti felépítése @hu
preferred label: Organisatie van het Parlement @nl
preferred label: Parlamentets interne organisation @da
preferred label: Organizácia Parlamentu @sk
preferred label: Eagrú na Parlaiminte @ga
in scheme: EP taxonomy on procedure types.
preferred label: Parlamento vidaus organizavimas @lt
preferred label: Organizzazione del Parlamento @it
preferred label: Organizace Parlamentu @cs
preferred label: Parlamenta iekšējā organizācija @lv
preferred label: Europaparlamentets organisation @sv
preferred label: Organizacja Parlamentu @pl

Interim report
type: Concept
deprecated: false
broader: Procedure nature
definition: Procedure nature used to submit an interim report.
created: 2024-07-01
in scheme: EP taxonomy on procedure types.
preferred label: Rapport d'interim @fr

Procedure on a strategy paper
type: Concept
preferred label: Procedure voor een strategiedocument @nl
preferred label: Proċedura dwar dokument ta’ strateġija @mt
preferred label: Strateegiadokumendi menetlus @et
preferred label: Postup na strategickom dokumente @sk
preferred label: Procedura privind un document de strategie @ro
in scheme: EP taxonomy on procedure types.
deprecated: true
type: ProcessType
preferred label: A stratégiai dokumentumra vonatkozó eljárás @hu
created: 2023-10-31
preferred label: Procedūra dėl strategijos dokumento @lt
definition: Procedure used to answer EU strategies documents proposed by European Commission.
preferred label: Procedura relativa a un documento di strategia @it
preferred label: Verfahren zu einem Strategiepapier @de
preferred label: Procedimiento relativo a un documento de estrategia @es
preferred label: Procedimento relativo a um documento de estratégia @pt
preferred label: Nós imeachta maidir le páipéar straitéise @ga
preferred label: Postupak izrade strateškog dokumenta @hr
preferred label: Stratēģijas dokumenta procedūra @lv
preferred label: ΔΙΑΔΙΚΑΣΙΑ ΕΓΓΡΑΦΟΥ ΣΤΡΑΤΗΓΙΚΗΣ @el
broader: Internal procedure
preferred label: Postup na strategickém dokumentu @cs
preferred label: Procedure på et strategidokument @da
preferred label: Процедура по стратегически документ @bg
preferred label: Strategia-asiakirjaa koskeva menettely @fi
preferred label: Postopek v zvezi s strateškim dokumentom @sl
preferred label: Procedura dotycząca dokumentu strategicznego @pl
preferred label: Procédure sur un document de stratégie @fr
preferred label: Förfarande för strategidokument @sv

Other
type: Concept
deprecated: false
broader: Procedure nature
preferred label: Autre @fr
in scheme: EP taxonomy on procedure types.
created: 2024-07-01
definition: Procedure nature used for other matters.

Revocation of delegation
type: Concept
deprecated: false
broader: Procedure nature
created: 2024-07-01
definition: Procedure nature used to submit revocation of delegation.
in scheme: EP taxonomy on procedure types.
preferred label: Révocation de la délégation @fr

Right of initiative confered on Parliament by the Treaties
type: Concept
deprecated: false
broader: Procedure nature
definition: Procedure nature used for procedure about some right of initiative confered on Parliament by the Treaties.
in scheme: EP taxonomy on procedure types.
created: 2024-07-01
preferred label: Droit d'initiative conféré au Parlement par les Traités @fr

Institutional
type: Concept
deprecated: false
broader: Procedure nature
created: 2024-07-01
definition: Procedure nature used for institutional matters.
in scheme: EP taxonomy on procedure types.
preferred label: Institutionnel @fr

Budgetary Initiative
type: ProcessType
preferred label: Biudžeto iniciatyva @lt
preferred label: Inizjattiva tal-Baġit @mt
preferred label: Iniziativa di bilancio @it
preferred label: Eelarvealgatus @et
preferred label: Haushaltsinitiative @de
preferred label: Бюджетна инициатива @bg
type: Concept
preferred label: Πρωτοβουλία για τον προϋπολογισμό @el
preferred label: Inicjatywa budżetowa @pl
preferred label: Proračunska inicijativa @hr
preferred label: Initiative budgétaire @fr
preferred label: Proračunska pobuda @sl
created: 2023-10-31
in scheme: EP taxonomy on procedure types.
preferred label: Inițiativa bugetară @ro
definition: Procedure used for European Parliament budgetary initiative.
preferred label: Tionscnamh Buiséadach @ga
preferred label: Rozpočtová iniciatíva @sk
preferred label: Iniciativa presupuestaria @es
preferred label: Talousarvioaloite @fi
preferred label: Begrotingsinitiatief @nl
preferred label: Budžeta iniciatīva @lv
preferred label: Iniciativa orçamental @pt
preferred label: Rozpočtová iniciativa @cs
broader: Internal procedure
preferred label: Költségvetési kezdeményezés @hu
preferred label: Budgetinitiativ @da
deprecated: false

Commission strategy paper
type: Concept
deprecated: true
broader: Procedure nature
definition: Procedure nature used for procedure on Commission strategy paper.
created: 2024-07-01
preferred label: Document stratégique de la Commission @fr
in scheme: EP taxonomy on procedure types.

Budget preparation
type: Concept
deprecated: false
broader: Procedure nature
preferred label: Préparation du budget @fr
definition: Procedure nature used to prepare budget.
created: 2024-07-01
in scheme: EP taxonomy on procedure types.

Institutional procedure
type: Concept
preferred label: Institucionální postup @cs
preferred label: Proċedura istituzzjonali @mt
broader: Internal procedure
preferred label: Institutionellt förfarande @sv
preferred label: Институционална процедура @bg
preferred label: Institucionalni postupak @hr
deprecated: false
preferred label: Procedura instytucjonalna @pl
preferred label: Institutionaalinen menettely @fi
created: 2023-10-31
preferred label: Procedimento institucional @pt
preferred label: Procédure institutionnelle @fr
preferred label: Nós imeachta institiúideach @ga
preferred label: Institucinė procedūra @lt
preferred label: Institucionalni postopek @sl
preferred label: Institutionel procedure @da
in scheme: EP taxonomy on procedure types.
preferred label: Institutionelles Verfahren @de
preferred label: Inštitucionálny postup @sk
preferred label: Procedura istituzionale @it
preferred label: Procedura instituțională @ro
type: ProcessType
definition: Procedure used for matters related to internal procedural matters of the European Parliament.
preferred label: Institucionālā procedūra @lv
preferred label: Procedimiento institucional @es
preferred label: Θεσμική διαδικασία @el
preferred label: Intézményi eljárás @hu
preferred label: Institutionele procedure @nl
preferred label: Institutsiooniline menetlus @et

Members' immunity
type: Concept
created: 2023-10-31
broader: Internal procedure
definition: Procedure used for matters relating European Parliament's Members immunity.
preferred label: EP narių imunitetas @lt
type: ProcessType
preferred label: Jäsenen koskemattomuus @fi
preferred label: Imunitet zastupnika @hr
preferred label: Díolúine na bhFeisirí @ga
preferred label: Neaizskaramība @lv
preferred label: Ασυλία των βουλευτών @el
preferred label: Immunità parlamentare @it
deprecated: false
preferred label: Poslanecká imunita @cs
preferred label: Immunitet för ledamöter @sv
preferred label: Депутатски имунитет @bg
preferred label: Imunitatea deputaților @ro
preferred label: Parlamendiliikme puutumatus @et
preferred label: Immunità tal-membri @mt
preferred label: Immunité des députés @fr
preferred label: Poslanska imuniteta @sl
preferred label: Medlemmers immunitet @da
preferred label: Immunität der Mitglieder @de
preferred label: Immuniteit van de leden @nl
in scheme: EP taxonomy on procedure types.
preferred label: Inmunidad de los diputados @es
preferred label: Képviselői mentelmi jog @hu
preferred label: Immunitet poselski @pl
preferred label: Imunidade dos deputados @pt

Interinstitutional agreement procedure
type: ProcessType
preferred label: Postup interinstitucionální dohody @cs
preferred label: Institutsioonidevaheline kokkuleppemenetlus @et
preferred label: Processo de acordo interinstitucional @pt
preferred label: Procedura di accordo interistituzionale @it
preferred label: Iestāžu nolīguma procedūra @lv
preferred label: Procédure d’accord interinstitutionnel @fr
preferred label: Toimielinten välinen sopimusmenettely @fi
preferred label: Proċedura ta’ ftehim interistituzzjonali @mt
preferred label: Postupak međuinstitucijskog sporazuma @hr
preferred label: Interinstitutionellt avtalsförfarande @sv
created: 2023-10-31
definition: Procedure seeking to organise and facilitate cooperation between the EU institutions, following TFEU Art 295.
preferred label: Procedimiento de acuerdo interinstitucional @es
preferred label: Intézményközi megállapodási eljárás @hu
preferred label: Procedure for interinstitutionel aftale @da
broader: Interinstitutional procedure
preferred label: Nós imeachta um chomhaontú idirinstitiúideach @ga
deprecated: false
preferred label: Procedura porozumienia międzyinstytucjonalnego @pl
preferred label: Tarpinstitucinio susitarimo procedūra @lt
preferred label: Postopek medinstitucionalnega sporazuma @sl
preferred label: Διαδικασία διοργανικής συμφωνίας @el
in scheme: EP taxonomy on procedure types.
preferred label: Interinstitutionelle Vereinbarungsverfahren @de
preferred label: Procedura acordului interinstituțional @ro
type: Concept
preferred label: Procedure voor interinstitutioneel akkoord @nl
preferred label: Postup medziinštitucionálnej dohody @sk
preferred label: Процедура за междуинституционално споразумение @bg

Written declaration
type: Concept
deprecated: true
broader: Procedure nature
created: 2024-07-01
definition: Procedure nature used for procedure with written declarations.
in scheme: EP taxonomy on procedure types.
preferred label: Déclaration écrite @fr

Elections/Decisions on organisation of Parliament
type: Concept
deprecated: false
broader: Procedure nature
created: 2024-07-01
definition: Procedure nature used to handle internal organisation of the European Parliament.
in scheme: EP taxonomy on procedure types.
preferred label: Elections/Décisions sur l'organisation du Parlement @fr

Discharge procedure
type: Concept
preferred label: Entlastungsverfahren @de
preferred label: Nós imeachta urscaoilte @ga
definition: Procedure used to approve the discharge of the EU budget under TFEU Art 319.
preferred label: Eelarve täitmisele heakskiidu andmise menetlus @et
preferred label: Procedura di discarico @it
preferred label: Kwijtingsprocedure @nl
preferred label: Procedura de descărcare de gestiune @ro
preferred label: Procedura udzielania absolutorium @pl
preferred label: Postup udělování absolutoria @cs
broader: Interinstitutional procedure
preferred label: Vastuuvapausmenettely @fi
preferred label: Postopek razrešnice @sl
preferred label: Processo de quitação @pt
preferred label: Διαδικασία απαλλαγής @el
preferred label: Dechargeprocedure @da
preferred label: Procédure de décharge @fr
preferred label: Postup udelenia absolutória @sk
preferred label: Процедура по освобождаване от отговорност във връзка с изпълнението @bg
deprecated: false
created: 2023-10-31
preferred label: Procedimiento de aprobación de la gestión @es
preferred label: Postupak davanja razrješnice @hr
preferred label: Proċedura ta’ kwittanza @mt
preferred label: Ansvarsfrihetsförfarande @sv
type: ProcessType
preferred label: Mentesítési eljárás @hu
preferred label: Budžeta izpildes apstiprinājuma procedūra @lv
preferred label: Biudžeto įvykdymo patvirtinimo procedūra @lt
in scheme: EP taxonomy on procedure types.

Cooperation procedure
type: Concept
preferred label: Postopek sodelovanja @sl
preferred label: Bendradarbiavimo procedūra @lt
preferred label: Διαδικασία συνεργασίας @el
deprecated: true
preferred label: Samenwerkingsprocedure @nl
preferred label: Процедура на сътрудничество @bg
preferred label: Koostöömenetlus @et
top concept of: EP taxonomy on procedure types.
preferred label: Procedura współpracy @pl
created: 2023-10-31
in scheme: EP taxonomy on procedure types.
preferred label: Postup spolupráce @cs
preferred label: Proċedura ta' kooperazzjoni @mt
preferred label: Verfahren der Zusammenarbeit @de
preferred label: Procedură de cooperare @ro
preferred label: Procedura di cooperazione @it
preferred label: Procedimiento de cooperación @es
preferred label: Procedimento de cooperação @pt
preferred label: Együttműködési eljárás @hu
definition: Procedure under TFEU 252 used primarily in the field of economic and monetary policy.
preferred label: Sadarbības procedūra @lv
preferred label: Nós imeachta comhair @ga
preferred label: Postupak suradnje @hr
type: ProcessType
preferred label: Procédure de coopération @fr
preferred label: Yhteistoimintamenettely @fi
preferred label: Samarbetsförfarandet @sv
scope note: Procedure under TFEU 252 used primarily in the field of economic and monetary policy.
preferred label: Samarbejdsprocedure @da

Resolution on statement
type: Concept
deprecated: false
broader: Procedure nature
definition: Procedure nature used to submit a motion on statement.
created: 2024-07-01
preferred label: Résolution sur déclaration @fr
in scheme: EP taxonomy on procedure types.

Implementation assesment
type: Concept
deprecated: false
broader: Procedure nature
in scheme: EP taxonomy on procedure types.
created: 2024-07-01
definition: Procedure nature used for assessing implementation.
preferred label: Evaluation de mise en oeuvre @fr

Interinstitutional agreement
type: Concept
deprecated: false
broader: Procedure nature
created: 2024-07-01
definition: Procedure nature used for Interinstitutional agreements.
in scheme: EP taxonomy on procedure types.
preferred label: Accord interinstitutionel @fr

Consultation of the Parliament
type: Concept
deprecated: false
broader: Procedure nature
definition: Procedure nature used for consultation of the Parliament.
created: 2024-07-01
in scheme: EP taxonomy on procedure types.
preferred label: Consultation du Parlement @fr

Interpretation of the Rules
type: Concept
deprecated: false
broader: Procedure nature
in scheme: EP taxonomy on procedure types.
created: 2024-07-01
definition: Procedure nature used for European Parliament's rules of procedure interpretation matters.
preferred label: Interprétation du Règlement @fr

Implementing acts
type: Concept
preferred label: Acte de punere în aplicare @ro
preferred label: Végrehajtási jogi aktusok @hu
preferred label: Vykonávacie akty @sk
preferred label: Actos de ejecución @es
preferred label: Gennemførelsesretsakter @da
deprecated: true
preferred label: Rakendusaktid @et
preferred label: Akty wykonawcze @pl
preferred label: Gníomhartha cur chun feidhme @ga
preferred label: Izvedbeni akti @sl
definition: Procedure used when establishing the secondary legislation to grant European Commission the mandate to establish implementing acts, but only if primary legislation allows for it and only within the boundaries set by the primary legislation.
preferred label: Atos de execução @pt
preferred label: Uitvoeringshandelingen @nl
preferred label: Durchführungsrechtsakte @de
created: 2023-10-31
preferred label: Atti ta’ implimentazzjoni @mt
preferred label: Īstenošanas akti @lv
preferred label: Prováděcí akty @cs
preferred label: Actes d’exécution @fr
preferred label: Актове за изпълнение @bg
in scheme: EP taxonomy on procedure types.
preferred label: Genomförandeakter @sv
preferred label: Provedbeni akti @hr
preferred label: Įgyvendinimo aktai @lt
preferred label: Täytäntöönpanosäädökset @fi
preferred label: Atti di esecuzione @it
type: ProcessType
broader: Internal procedure
preferred label: Εκτελεστικές πράξεις @el

Appointment
type: Concept
deprecated: false
broader: Procedure nature
created: 2024-07-01
definition: Procedure nature used for appointments.
in scheme: EP taxonomy on procedure types.
preferred label: Nomination @fr

Budgetary procedure
type: ProcessType
preferred label: Haushaltsverfahren @de
preferred label: Eelarvemenetlus @et
preferred label: Procédure budgétaire @fr
preferred label: Бюджетна процедура @bg
preferred label: Processo orçamental @pt
preferred label: Budgetförfarande @sv
preferred label: Begrotingsprocedure @nl
broader: Interinstitutional procedure
preferred label: Rozpočtový proces @cs
preferred label: Budgetprocedure @da
preferred label: Biudžeto procedūra @lt
created: 2023-10-31
preferred label: Διαδικασία του προϋπολογισμού @el
definition: Procedure used to approve the EU budget under TFEU Art 310.
preferred label: Nós imeachta buiséadach @ga
preferred label: Proċedura baġitarja @mt
preferred label: Procedimiento presupuestario @es
preferred label: Procedura di bilancio @it
preferred label: Rozpočtový postup @sk
preferred label: Proračunski postupak @hr
preferred label: Procedura budżetowa @pl
preferred label: Procedura bugetară @ro
scope note: Procedure used to approve the EU budget under TFEU Art 310.
type: Concept
deprecated: false
preferred label: Talousarviomenettely @fi
preferred label: Proračunski postopek @sl
preferred label: Költségvetési eljárás @hu
preferred label: Budžeta procedūra @lv
in scheme: EP taxonomy on procedure types.

Resolution on implementing act or power
type: Concept
deprecated: false
broader: Procedure nature
definition: Procedure nature used to submit a resolution on implementing act or power.
created: 2024-07-01
preferred label: Résolution sur acte ou compétences d'éxécution @fr
in scheme: EP taxonomy on procedure types.

Amendment of the Rules
type: Concept
deprecated: false
broader: Procedure nature
definition: Procedure nature used to submit amendment(s) to the Rules of Procedure.
in scheme: EP taxonomy on procedure types.
created: 2024-07-01
preferred label: Modification du Règlement @fr

Budget management procedure
type: ProcessType
preferred label: Nós imeachta bainistithe buiséid @ga
preferred label: Budžeta pārvaldības procedūra @lv
definition: Procedure used when European Parliament manages with budgetary agreements.
preferred label: Procedimento de gestão orçamental @pt
preferred label: Διαδικασία διαχείρισης του προϋπολογισμού @el
preferred label: Budgetforvaltningsprocedure @da
preferred label: Procedura zarządzania budżetem @pl
preferred label: Postopek upravljanja proračuna @sl
preferred label: Eelarve haldamise menetlus @et
preferred label: Procédure de gestion budgétaire @fr
preferred label: Budgetförvaltningsförfarande @sv
created: 2023-10-31
preferred label: Procedure voor begrotingsbeheer @nl
preferred label: Procedura di gestione del bilancio @it
preferred label: Процедура за управление на бюджета @bg
broader: Internal procedure
preferred label: Procedimiento de gestión presupuestaria @es
preferred label: Talousarvion hallinnointimenettely @fi
preferred label: Biudžeto valdymo procedūra @lt
preferred label: Proċedura ta’ ġestjoni tal-baġit @mt
in scheme: EP taxonomy on procedure types.
preferred label: Postup rozpočtového hospodárenia @sk
preferred label: Költségvetés-irányítási eljárás @hu
preferred label: Haushaltsverwaltungsverfahren @de
type: Concept
preferred label: Postup řízení rozpočtu @cs
preferred label: Postupak upravljanja proračunom @hr
preferred label: Procedura de gestiune bugetară @ro
deprecated: false

Consultation procedure
type: Concept
preferred label: Διαδικασία διαβούλευσης @el
preferred label: Procedimiento de consulta @es
preferred label: Konsultavimosi procedūra @lt
preferred label: Proċedura ta' konsultazzjoni @mt
preferred label: Konzultációs eljárás @hu
deprecated: false
preferred label: Procedura di consultazione @it
preferred label: Kuulemismenettely @fi
broader: Interinstitutional procedure
preferred label: Konsultationsverfahren @de
preferred label: Postup konzultácie @sk
preferred label: Høringsprocedure @da
preferred label: Samrådsförfarandet @sv
preferred label: Procédure de consultation @fr
definition: Procedure used for politically sensitive issues under TFEU Art 289, where the member states bear responsibility for policy making and where the member states make decisions based on unanimity.
preferred label: Apspriešanās procedūra @lv
preferred label: Procedură de consultare @ro
preferred label: Postup konzultace @cs
in scheme: EP taxonomy on procedure types.
preferred label: Postupak savjetovanja @hr
preferred label: Процедура на консултация @bg
preferred label: Procedura konsultacji @pl
preferred label: Nós imeachta comhairliúcháin @ga
narrow match: SLP
type: ProcessType
preferred label: Procedimento de consulta @pt
scope note: Procedure used for politically sensitive issues under TFEU Art 289, where the member states bear responsibility for policy making and where the member states make decisions based on unanimity.
preferred label: Raadplegingsprocedure @nl
preferred label: Postopek posvetovanja @sl
preferred label: Nõuandemenetlus @et
created: 2023-10-31

Transfert of appropriations
type: Concept
deprecated: false
broader: Procedure nature
definition: Procedure nature used for procedure about transfert of appropriations.
created: 2024-07-01
preferred label: Virements de crédits @fr
in scheme: EP taxonomy on procedure types.

Own-initiative procedure
type: Concept
preferred label: Procedura z inicjatywy własnej @pl
preferred label: Samoiniciativni postopek @sl
preferred label: Процедура по собствена инициатива @bg
preferred label: Procedure for initiativer @da
preferred label: Proċedura ta' inizjattiva @mt
preferred label: Processo de iniciativa @pt
preferred label: Iniciatívny postup @sk
preferred label: Saját kezdeményezésű eljárás @hu
created: 2023-10-31
definition: Procedure used when European Parliament uses its right for own initiative.
preferred label: Procédure d’initiative @fr
preferred label: Förfarande för initiativbetänkande @sv
preferred label: Διαδικασία πρωτοβουλίας @el
preferred label: Patstāvīgā ziņojuma procedūra @lv
preferred label: Procedura di iniziativa @it
preferred label: Initiatiefprocedure @nl
deprecated: false
preferred label: Procedūra savo iniciatyva @lt
preferred label: Valiokunta-aloitteinen menettely @fi
preferred label: Initiativverfahren @de
preferred label: Omaalgatuslik menetlus @et
preferred label: Postupak na vlastitu inicijativu @hr
preferred label: Postup ke zprávě z vlastního podnětu @cs
in scheme: EP taxonomy on procedure types.
broader: Internal procedure
preferred label: Procedimiento de propia iniciativa @es
preferred label: Procedura de inițiativă @ro
preferred label: Nós imeachta féintionscnaimh @ga
type: ProcessType

Mobilisation of funds
type: Concept
deprecated: false
broader: Procedure nature
created: 2024-07-01
definition: Procedure nature used for funds mobilisation.
in scheme: EP taxonomy on procedure types.
preferred label: Mobilisation de fonds @fr

Opposition to tacit extension of delegation
type: Concept
deprecated: false
broader: Procedure nature
definition: Procedure nature used to submit an opposition to tacit extension of delegation.
created: 2024-07-01
preferred label: Proposition de résolution non-législative pour procédure d'approbation @fr
in scheme: EP taxonomy on procedure types.

Motion for non-legislative resolution on consent procedure
type: Concept
deprecated: false
broader: Procedure nature
definition: Procedure nature used to submit a motion for non-legislative resolution on consent procedure.
created: 2024-07-01
preferred label: Proposition de résolution non-législative pour procédure d'approbation @fr
in scheme: EP taxonomy on procedure types.

Initiative
type: Concept
deprecated: false
broader: Procedure nature
in scheme: EP taxonomy on procedure types.
created: 2024-07-01
definition: Procedure nature used for proposing initiative.

Strategic initiative
type: Concept
deprecated: false
broader: Procedure nature
in scheme: EP taxonomy on procedure types.
created: 2024-07-01
definition: Procedure nature used for strategic initiative.
preferred label: Initiative stratégique @fr

Ordinary legislative procedure
type: ProcessType
preferred label: Proċedura leġiżlattiva ordinarja @mt
preferred label: Gnáthnós imeachta reachtach @ga
in scheme: EP taxonomy on procedure types.
type: Concept
preferred label: Обикновена законодателна процедура @bg
preferred label: Tavallinen lainsäätämisjärjestys @fi
definition: Standard decision-making procedure defined used in the European Union, unless treaties specifically state one of the special legislative procedures is to be applied to a particular subject.
preferred label: Zwykła procedura prawodawcza @pl
preferred label: Parastā likumdošanas procedūra @lv
preferred label: Řádný legislativní postup @cs
created: 2023-10-31
deprecated: false
preferred label: Procédure législative ordinaire @fr
preferred label: Almindelig lovgivningsprocedure @da
preferred label: Procedimiento legislativo ordinario @es
broader: Interinstitutional procedure
preferred label: Συνήθης νομοθετική διαδικασία @el
preferred label: Gewone wetgevingsprocedure @nl
preferred label: Įprasta teisėkūros procedūra @lt
preferred label: Redovni zakonodavni postupak @hr
preferred label: Processo legislativo ordinário @pt
preferred label: Procedură legislativă ordinară @ro
preferred label: Rendes jogalkotási eljárás @hu
preferred label: Riadny legislatívny postup @sk
preferred label: Ordentliches Gesetzgebungsverfahren @de
preferred label: Seadusandlik tavamenetlus @et
preferred label: Redni zakonodajni postopek @sl
preferred label: Ordinarie lagstiftningsförfarande @sv
narrow match: OLP
preferred label: Procedura legislativa ordinaria @it

Codification
type: Concept
deprecated: false
broader: Procedure nature
created: 2024-07-01
definition: Procedure nature used for codification procedures.
in scheme: EP taxonomy on procedure types.

Community with scrutiny
type: Concept
deprecated: false
broader: Procedure nature
in scheme: EP taxonomy on procedure types.
created: 2024-07-01
definition: Procedure nature used for community with scrutiny procedures.
preferred label: Commitologie avec contrôle @fr

Budget
type: Concept
deprecated: false
broader: Procedure nature
created: 2024-07-01
definition: Procedure nature used for budget.
in scheme: EP taxonomy on procedure types.

Resolution on topical subjects
type: Concept
preferred label: Entschließung zu aktuellen Themen @de
preferred label: Rezolucija o aktualnim događanjima @hr
preferred label: Actualiteitenresolutie @nl
preferred label: Uznesenie k aktuálnym témam @sk
in scheme: EP taxonomy on procedure types.
broader: Internal procedure
preferred label: Usnesení k aktuálním tématům @cs
preferred label: Ψήφισμα επί επικαίρων θεμάτων @el
created: 2023-10-31
preferred label: Rezolucja w sprawie bieżących zagadnień @pl
preferred label: Rezoluție de actualitate @ro
preferred label: Resolution om aktuella frågor @sv
preferred label: Résolutions d’actualité @fr
preferred label: Riżoluzzjoni t’attwalità @mt
definition: Procedure used to submit resolution on topics in relation with the actuality.
preferred label: Beslutninger om aktuelle spørgsmål @da
preferred label: Resolução sobre assuntos de atualidade @pt
preferred label: Resolucija o aktualnih dogodkih @sl
preferred label: Rezoliucija dėl aktualių įvykių @lt
preferred label: Steidzami izskatāmi rezolūciju priekšlikumi @lv
type: ProcessType
preferred label: Risoluzione su argomenti di attualità @it
preferred label: Állásfoglalások aktuális kérdésekről @hu
deprecated: false
preferred label: Резолюция по актуален въпрос @bg
preferred label: Rún maidir le hábhair tráthúla @ga
preferred label: Resolutsioon aktuaalsel teemal @et
preferred label: Resolución sobre temas de actualidad @es
preferred label: Päätöslauselma ajankohtaisesta aiheesta @fi