Head of government
type: Concept
preferred label: Chefe de governo @pt
alternative label: Prima ministra @it
alternative label: Primera Ministra @es
alternative label: Prim Ministru @mt
preferred label: Regeringschef @da
alternative label: Première ministre @fr
alternative label: Predsjednica vlade @hr
definition: Leader of the government in a country.
alternative label: Predsedníčka vlády @sk
alternative label: Szefowa rządu @pl
alternative label: Předsedkyně vlády @cs
alternative label: Šefica vlade @hr
alternative label: Premier ministre @fr
alternative label: Peaminister @et
alternative label: Министър-председател @bg
alternative label: Statsminister @sv
preferred label: Predseda vlády @sk
alternative label: Primeiro-ministro @pt
alternative label: Premiér @sk
alternative label: Premier @pl
alternative label: Prime Minister
alternative label: Presidente del Consiglio dei ministri @it
alternative label: Pääministeri @fi
alternative label: Premjerministrs @lv
alternative label: Ministras pirmininkas @lt
alternative label: Miniszterelnök @hu
alternative label: Regierungschefin @de
preferred label: Szef rządu @pl
preferred label: Regeringsleider @nl
alternative label: Primeira-ministra @pt
preferred label: Valitsusjuht @et
alternative label: Premiärminister @sv
preferred label: Capo del governo @it
preferred label: Předseda vlády @cs
preferred label: Šef vlade @hr
preferred label: Правителствен ръководител @bg
preferred label: Predsednik vlade @sl
alternative label: Primo ministro @it
preferred label: Valdības vadītājs @lv
alternative label: Jefa del Gobierno @es
alternative label: Primer Ministro @es
alternative label: Πρωθυπουργός @el
preferred label: Jefe del Gobierno @es
alternative label: Ministrski predsednik @sl
preferred label: Kap tal-gvern @mt
preferred label: Șef de guvern @ro
preferred label: Αρχηγός κυβέρνησης @el
alternative label: Premiérka @cs
alternative label: Minister-president @nl
alternative label: Vyriausybės vadovė @lt
top concept of: EP taxonomy on roles.
alternative label: Eerste minister @nl
alternative label: Predsjednik vlade @hr
preferred label: Vyriausybės vadovas @lt
created: 2023-10-31
alternative label: Premjerministre @lv
preferred label: Hallituksen päämies @fi
in scheme: EP taxonomy on roles.
preferred label: Ceann rialtais @ga
alternative label: Ministrė pirmininkė @lt
preferred label: Kormányfő @hu
deprecated: false
alternative label: Premierministerin @de
alternative label: Valdības vadītāja @lv
alternative label: Prim-ministru @ro
alternative label: Predsednica vlade @sl
alternative label: Premierminister @da
alternative label: Ministrska predsednica @sl
alternative label: Príomh-Aire @ga
preferred label: Regierungschef @de
preferred label: Chef du gouvernement @fr
alternative label: Cheffe du gouvernement @fr

EP taxonomy on roles.
type: ConceptScheme
version info: 20250930_1
modified: 2025-09-30
description: Taxonomy of the European Parliament on roles.
created: 2023-10-31
creator: EP

Member of Parliament
type: Role
preferred label: Parlamendi liige @et
preferred label: Mitglied des Parlaments @de
in scheme: EP taxonomy on roles.
preferred label: Poslanec Európskeho parlamentu @sk
alternative label: Poslankyňa Európskeho parlamentu @sk
preferred label: Euroopan parlamentin jäsen @fi
deprecated: false
alternative label: Eurodeputata @it
preferred label: Eurodeputato @it
alternative label: Poslanka Evropskega parlamenta @sl
preferred label: Poseł do Parlamentu Europejskiego @pl
preferred label: Eurodeputado @pt
created: 2023-10-31
alternative label: Poslanec Evropskega parlamenta @sl
alternative label: Európai parlamenti képviselő @hu
alternative label: Europos Parlamento narė @lt
preferred label: Diputado al Parlamento Europeo @es
preferred label: Parlamentsledamot @sv
alternative label: Member of the European Parliament
preferred label: Membru al Parlamentului @ro
preferred label: Il-Membru tal-Parlament @mt
preferred label: Europaparlamentsmedlem @da
alternative label: Parlamento narė @lt
alternative label: Parlamenta deputāte @lv
preferred label: Parlamenta deputāts @lv
preferred label: Parlementslid @nl
broader: Member
alternative label: Deputato al Parlamento europeo @it
alternative label: Europos Parlamento narys @lt
alternative label: Euroopa Parlamendi liige @et
alternative label: Βουλευτής του Ευρωπαϊκού Κοινοβουλίου @el
alternative label: Deputata al Parlamento europeo @it
alternative label: Diputada al Parlamento Europeo @es
alternative label: Deputată în Parlamentul European @ro
alternative label: Deputada ao Parlamento Europeu @pt
preferred label: Evroposlanec @sl
alternative label: Eiropas Parlamenta deputāte @lv
alternative label: Член на Европейския парламент @bg
alternative label: Medlem af Europa-Parlamentet @da
alternative label: Feisire de Pharlaimint na hEorpa @ga
preferred label: A Parlament tagja @hu
definition: Elected member of the European Parliament.
alternative label: Eurodéputé @fr
alternative label: Ledamot av Europaparlamentet @sv
alternative label: Zastupnica Europskog parlamenta @hr
alternative label: Eiropas Parlamenta deputāts @lv
alternative label: Eurodeputada @pt
alternative label: Deputado ao Parlamento Europeu @pt
alternative label: Membru tal-Parlament Ewropew @mt
preferred label: Ευρωβουλευτής @el
alternative label: Député au Parlement européen @fr
alternative label: Deputat în Parlamentul European @ro
type: Concept
alternative label: Eurodéputée @fr
alternative label: Lid van het Europees Parlement @nl
alternative label: Mitglied des Europäischen Parlaments @de
alternative label: Evroposlanka @sl
preferred label: Zastupnik Parlamenta @hr
alternative label: Poslankyně Evropského parlamentu @cs
preferred label: Parlamento narys @lt
alternative label: Membră a Parlamentului @ro
preferred label: Député européen @fr
preferred label: Feisire den Pharlaimint @ga
preferred label: Poslanec Evropského parlamentu @cs
alternative label: Zastupnica Parlamenta @hr
alternative label: Zastupnik Europskog parlamenta @hr
preferred label: Член на Парламента @bg

Member
type: Concept
preferred label: Medlem @da
preferred label: Membru @ro
preferred label: Ledamot @sv
preferred label: Član @sl
preferred label: Membre @fr
preferred label: Μέλος @el
alternative label: Locekle @lv
definition: Appointed member of an entity.
preferred label: Jäsen @fi
preferred label: Tag @hu
alternative label: Tagok @hu
deprecated: false
alternative label: Membră @ro
preferred label: Mitglied @de
preferred label: Comhalta @ga
alternative label: Członkini @pl
created: 2023-10-31
preferred label: Członek @pl
preferred label: Член @bg
top concept of: EP taxonomy on roles.
preferred label: Loceklis @lv
alternative label: Članica @hr
preferred label: Miembro @es
type: Role
preferred label: Lid @nl
alternative label: Narė @lt
preferred label: Liige @et
preferred label: Membro @it
alternative label: Członkowie @pl
preferred label: Člen @cs
preferred label: Narys @lt
alternative label: Členka @sk
in scheme: EP taxonomy on roles.

Parliamentary committee member
type: Concept
preferred label: Parlamendikomisjoni liige @et
preferred label: Parlamenti bizottsági tag @hu
preferred label: Μέλος της κοινοβουλευτικής επιτροπής @el
preferred label: Membru tal-kumitat parlamentari @mt
preferred label: Mitglied des Parlamentsausschusses @de
alternative label: Participante en la comisión parlamentaria @es
alternative label: Uczestnik komisji parlamentarnej @pl
preferred label: Membru al comisiei parlamentare @ro
preferred label: Член на парламентарната комисия @bg
preferred label: Lid parlementaire commissie @nl
preferred label: Parlamentārās komitejas loceklis @lv
in scheme: EP taxonomy on roles.
alternative label: Participant la comisiile parlamentare @ro
created: 2025-03-31
alternative label: Parlamentin valiokunnan jäsen @fi
alternative label: Участник в парламентарната комисия @bg
preferred label: Medlem af Europa-Parlamentets udvalg @da
alternative label: Parlamenti bizottsági résztvevő @hu
alternative label: Účastník parlamentního výboru @cs
alternative label: Sudionik u parlamentarnom odboru @hr
alternative label: Parteċipant tal-kumitat parlamentari @mt
preferred label: Membre de la commission parlementaire @fr
alternative label: Rannpháirtí sa choiste parlaiminteach @ga
alternative label: Deltagare i parlamentsutskott @sv
preferred label: Ledamot av det parlamentariska utskottet @sv
preferred label: Parlamento komiteto narys @lt
definition: Member of a parliamentary committee.
alternative label: Účastník parlamentného výboru @sk
broader: Member
alternative label: Parliamentary committee participant
preferred label: člen parlamentného výboru @sk
preferred label: Članica parlamentarnog odbora @hr
deprecated: false
preferred label: Miembro de la comisión parlamentaria @es
preferred label: Członek komisji parlamentarnej @pl
preferred label: Comhalta den choiste parlaiminteach @ga
alternative label: Participante na comissão parlamentar @pt
preferred label: Membro della commissione parlamentare @it
preferred label: Člen parlamentního výboru @cs
alternative label: Participant à la commission parlementaire @fr
preferred label: Parlamentaarisen valiokunnan jäsen @fi
alternative label: Sodelujoči v parlamentarnem odboru @sl
alternative label: Partecipante alla commissione parlamentare @it
alternative label: Συμμετέχων σε κοινοβουλευτική επιτροπή @el
preferred label: član parlamentarnega odbora @sl
alternative label: Deltager i parlamentsudvalg @da
alternative label: Parlamentārās komitejas dalībnieks @lv
preferred label: Membro da comissão parlamentar @pt
alternative label: Deelnemer parlementaire commissie @nl

First Vice-Chair
type: Role
preferred label: Pirmasis pirmininko pavaduotojas @lt
preferred label: Premier vice-président @fr
preferred label: Prvý podpredseda @sk
preferred label: Erster stellvertretender Vorsitzender @de
alternative label: Erste stellvertretende Vorsitzend @de
preferred label: první místopředseda @cs
alternative label: Vicepresidenta primera @es
preferred label: primo vicepresidente @it
preferred label: vicepresidente primero @es
alternative label: Prvá podpredsedníčka @sk
alternative label: Prima vicepresidente @it
alternative label: Priekšsēdētāja pirmā vietniece @lv
preferred label: prvi potpredsjednik @hr
preferred label: Første næstformand @da
alternative label: Prim-vicepreședintă @ro
definition: The first vice-chair replaces the chair when absent.
preferred label: eerste ondervoorzitter @nl
alternative label: Prva podpredsednica @sl
preferred label: priekšsēdētāja pirmais vietnieks @lv
alternative label: Pierwsza wiceprzewodnicząca @pl
in scheme: EP taxonomy on roles.
alternative label: Πρώτη αντιπρόεδρος @el
alternative label: Première vice-présidente @fr
type: Concept
preferred label: Πρώτος αντιπρόεδρος @el
preferred label: első alelnök @hu
preferred label: prvi podpredsednik @sl
preferred label: Ensimmäinen varapuheenjohtaja @fi
preferred label: L-Ewwel Viċi President @mt
preferred label: Esimene aseesimees @et
preferred label: pierwszy wiceprzewodniczący @pl
preferred label: Första vice ordförande @sv
preferred label: Prim-vicepreședinte @ro
alternative label: První místopředsedkyně @cs
broader: Chairman
alternative label: Pirmoji pirmininko pavaduotoja @lt
alternative label: Prva potpredsjednica @hr
alternative label: Primeira Vice-Presidente @pt
preferred label: Първи заместник-председател @bg
preferred label: Primeiro Vice-Presidente @pt
created: 2023-10-31
deprecated: false
preferred label: An Chéad Leas-Chathaoirleach @ga

Chairman
type: Concept
preferred label: Presidente @it
preferred label: Elnök @hu
alternative label: Esimees @et
preferred label: Priekšsēdētājs @lv
preferred label: Pirmininkas @lt
alternative label: Predsjednik @hr
preferred label: Eesistuja @et
preferred label: Predsjedatelj @hr
alternative label: Președintă @ro
preferred label: Președinte @ro
preferred label: Cathaoirleach @ga
preferred label: Président @fr
preferred label: Vorsitzender @de
preferred label: Ordförande @sv
alternative label: Presidenta @es
alternative label: Przewodnicząca @pl
top concept of: EP taxonomy on roles.
in scheme: EP taxonomy on roles.
alternative label: Priekšsēdētāja @lv
deprecated: false
preferred label: Przewodniczący @pl
preferred label: President @mt
alternative label: Predsednica @sl
alternative label: Présidente @fr
alternative label: Předsedkyně @cs
preferred label: Voorzitter @nl
alternative label: Predsedníčka @sk
preferred label: Predsednik @sl
alternative label: Predsjedateljica @hr
preferred label: Predseda @sk
alternative label: Predsjednica @hr
definition: A chairman is someone who presides over an entity.
alternative label: Pirmininkė @lt
preferred label: Puheenjohtaja @fi
preferred label: Formand @da
preferred label: Πρόεδρος @el
preferred label: Председател @bg
alternative label: Chair
type: Role
preferred label: Předseda @cs
created: 2023-10-31
alternative label: Vorsitzende @de

European Ombudsman
type: Concept
alternative label: Eiropas ombude @lv
preferred label: Euroopan oikeusasiamies @fi
preferred label: Provedor de Justiça Europeu @pt
preferred label: Ombudsman Ewropew @mt
preferred label: Mediatore europeo @it
alternative label: Mediatrice europea @it
preferred label: Európsky ombudsman @sk
alternative label: Ευρωπαία Διαμεσολαβήτρια @el
preferred label: Europos ombudsmenas @lt
definition: The European Ombudsman investigates complaints about maladministration in the institutions and bodies of the European Union. The Ombudsman is completely independent and impartial.
preferred label: Evropski varuh človekovih pravic @sl
preferred label: Defensor del Pueblo Europeo @es
alternative label: Europäische Bürgerbeauftragte @de
preferred label: Ευρωπαίος Διαμεσολαβητής @el
preferred label: Den Europæiske Ombudsmand @da
in scheme: EP taxonomy on roles.
alternative label: Europos ombudsmenė @lt
preferred label: Europejski Rzecznik Praw Obywatelskich @pl
created: 2023-10-31
preferred label: Ombudsmanul European @ro
top concept of: EP taxonomy on roles.
preferred label: Europese Ombudsman @nl
preferred label: Eiropas ombuds @lv
preferred label: Европейски омбудсман @bg
alternative label: Evropska varuhinja človekovih pravic @sl
alternative label: Európska ombudsmanka @sk
preferred label: An tOmbudsman Eorpach @ga
deprecated: false
preferred label: Europeiska ombudsmannen @sv
preferred label: Evropský veřejný ochránce práv @cs
preferred label: Europski ombudsman @hr
alternative label: Evropská veřejná ochránkyně práv @cs
alternative label: Provedora de Justiça Europeia @pt
alternative label: Defensora del Pueblo Europeo @es
preferred label: Médiateur européen @fr
preferred label: Euroopa Ombudsman @et
preferred label: Európai ombudsman @hu
preferred label: Europäischer Bürgerbeauftragter @de
alternative label: Médiatrice européenne @fr
alternative label: Europejska Rzecznik Praw Obywatelskich @pl

Co-rapporteur
type: ParticipationRole
alternative label: Bendroji pranešėja @lt
preferred label: Coponente @es
alternative label: Līdzziņotāja @lv
alternative label: Korelatriċi @mt
preferred label: Współsprawozdawca @pl
preferred label: Corapporteur @fr
preferred label: Spoluzpravodaj @cs
preferred label: Suizvjestitelj @hr
preferred label: Συνεισηγητής @el
preferred label: Coraportor @ro
broader: Rapporteur
preferred label: Līdzziņotājs @lv
preferred label: Medföredragande @sv
alternative label: Corapporteure @fr
preferred label: Társelőadó @hu
alternative label: Correlatrice @it
definition: A person who reports in case of multiple rapporteurs on a same dossier.
preferred label: Medordfører @da
preferred label: Съдокладчик @bg
deprecated: false
type: Concept
preferred label: Korelatur @mt
alternative label: Suizvjestiteljica @hr
preferred label: Kaasraportöör @et
preferred label: Soporočevalec @sl
alternative label: Pomocná spravodajkyňa @sk
alternative label: Współsprawozdawczyni @pl
preferred label: Toinen esittelijä @fi
preferred label: Comhrapóirtéir @ga
alternative label: Συνεισηγήτρια @el
alternative label: Mitberichterstatterin @de
in scheme: EP taxonomy on roles.
alternative label: Coraportoare @ro
alternative label: Correlatora @pt
preferred label: Mitberichterstatter @de
created: 2023-10-31
preferred label: Pomocný spravodajca @sk
preferred label: Bendrapranešėjis @lt
preferred label: Correlatore @it
preferred label: Correlator @pt
alternative label: Spoluzpravodajka @cs
alternative label: Soporočevalka @sl

Rapporteur
type: ParticipationRole
preferred label: Raportöör @et
alternative label: Raportoare @ro
preferred label: Εισηγητής @el
alternative label: Relatora @pt
preferred label: Zpravodaj @cs
preferred label: Pranešėjas @lt
preferred label: Relatore @it
preferred label: Sprawozdawca @pl
alternative label: Referente @lv
preferred label: Poročevalec @sl
preferred label: Relator @pt
preferred label: Ponente @es
alternative label: Rapporteure @fr
preferred label: Ordfører @da
deprecated: false
preferred label: Föredragande @sv
in scheme: EP taxonomy on roles.
alternative label: Zpravodajka @cs
preferred label: Izvjestitelj @hr
preferred label: Referents @lv
alternative label: Izvjestiteljica @hr
preferred label: Докладчик @bg
alternative label: Εισηγήτρια @el
preferred label: Esittelijä @fi
top concept of: EP taxonomy on roles.
preferred label: Spravodajca @sk
alternative label: Spravodajkyňa @sk
definition: A person who reports.
alternative label: Sprawozdawczyni @pl
preferred label: Előadó @hu
alternative label: Relatur @mt
alternative label: Berichterstatterin @de
alternative label: Relatrice @it
type: Concept
created: 2023-10-31
alternative label: Poročevalka @sl
alternative label: Pranešėja @lt
preferred label: Berichterstatter @de
preferred label: Raportor @ro
type: CapacityRole

Committee Chair
type: CapacityRole
in scheme: EP taxonomy on roles.
alternative label: Presidente del Comitato @it
broader: Chairman
preferred label: Valiokunnan puheenjohtaja @fi
alternative label: Przewodnicząca Komitetu @pl
alternative label: President of the Committee
alternative label: Presidente del Comité @es
preferred label: Predsednik odbora @sl
preferred label: Predseda výboru @sk
preferred label: Udvalgsformand @da
preferred label: Predsjednik odbora @hr
alternative label: Komitejas priekšsēdētāja @lv
created: 2023-10-31
alternative label: Président du Comité @fr
deprecated: false
preferred label: Ausschussvorsitzender @de
alternative label: Präsident des Ausschusses @de
alternative label: Președintele Comitetului @ro
preferred label: Utskottsordförande @sv
alternative label: Présidente de commission @fr
preferred label: Komiteto pirmininkas @lt
preferred label: Presidente della commissione @it
alternative label: Πρόεδρος της επιτροπής @el
preferred label: President tal-Kumitat @mt
preferred label: Předseda výboru @cs
alternative label: Komiteto pirmininkė @lt
alternative label: Președintă a Comitetului @ro
preferred label: Presidente de la comisión @es
preferred label: Πρόεδρος επιτροπής @el
alternative label: Predsjednica odbora @hr
alternative label: Președintă a unei comisii @ro
preferred label: Cathaoirleach coiste @ga
alternative label: Kommitténs ordförande @sv
alternative label: Présidente du Comité @fr
alternative label: Predsedníčka výboru @sk
preferred label: Bizottsági elnök @hu
alternative label: Uachtarán an Choiste @ga
definition: The chair of a parliamentary committee is the person who presides over a parliamentary committee.
preferred label: Przewodniczący komisji @pl
alternative label: Presidente do Comité @pt
alternative label: Il-President tal-Kumitat @mt
preferred label: Presidente de comissão @pt
preferred label: Председател на комисия @bg
alternative label: Председател на Комитета @bg
alternative label: Predsednica odbora @sl
alternative label: Voorzitter van het Comité @nl
type: Concept
alternative label: Przewodnicząca komisji @pl
preferred label: Komitejas priekšsēdētājs @lv
alternative label: Formand for Udvalget @da
preferred label: Président de commission @fr
alternative label: Presidenta de la comisión @es
alternative label: Präsidentin des Ausschusses @de
alternative label: Presidenta del Comité @es
preferred label: Komisjoni esimees @et
preferred label: Commissievoorzitter @nl
preferred label: Președinte al unei comisii @ro
alternative label: Komitean puheenjohtaja @fi
alternative label: Předsedkyně výboru @cs
alternative label: Przewodniczący Komitetu @pl

Acting President
type: Concept
alternative label: Président f.f. @fr
preferred label: Fungerende formand @da
alternative label: Présidente faisant fonction @fr
alternative label: L. e. p. Parlamento pirmininkė @lt
preferred label: p.o. Przewodniczący @pl
alternative label: Presidenta en funciones @es
preferred label: Priekšsēdētāja v. i. @lv
preferred label: Vršilec dolžnosti predsednika @sl
alternative label: Ασκούσα χρέη Προέδρου @el
preferred label: Uachtarán Gníomhach @ga
alternative label: p.o. Przewodnicząca @pl
preferred label: President faisant fonction @fr
preferred label: Úřadující předseda @cs
definition: An acting president is acting as president in case of absence of the president.
preferred label: L. e. p. Parlamento pirmininkas @lt
preferred label: Presidente em exercício @pt
preferred label: Aġent President @mt
preferred label: Ασκών χρέη Προέδρου @el
preferred label: Tillförordnad talman @sv
broader: Председател
alternative label: Președintă interimară @ro
deprecated: false
preferred label: Președinte interimar @ro
preferred label: Presidendi kohusetäitja @et
alternative label: Présidente f.f. @fr
preferred label: Privremeni predsjednik @hr
alternative label: Amtierende Präsidentin @de
alternative label: Úřadující předsedkyně @cs
alternative label: Privremena predsjednica @hr
preferred label: Amtierender Präsident @de
preferred label: Megbízott elnök @hu
preferred label: Vt. puhemies @fi
type: Role
in scheme: EP taxonomy on roles.
preferred label: Waarnemend Voorzitter @nl
preferred label: Изпълняващ длъжността председател @bg
preferred label: Presidente ad interim @it
preferred label: Úradujúci predseda @sk
created: 2023-10-31
preferred label: Presidente en funciones @es
alternative label: Úradujúca predsedníčka @sk
alternative label: Vršilka dolžnosti predsednika @sl

Председател
type: Role
alternative label: Predsjednica @hr
alternative label: Presidenta @es
alternative label: Predsedníčka @sk
alternative label: Przewodnicząca @pl
preferred label: Formand @da
preferred label: President
preferred label: Przewodniczący @pl
alternative label: Präsidentin @de
alternative label: Présidente @fr
alternative label: Puhemies @fi
preferred label: Elnök @hu
created: 2023-10-31
preferred label: Πρόεδρος @el
preferred label: Puheenjohtaja @fi
deprecated: false
top concept of: EP taxonomy on roles.
preferred label: Predsjednik @hr
alternative label: Priekšsēdētāja @lv
preferred label: Presidente @it
alternative label: Pirmininkė @lt
preferred label: Predseda @sk
preferred label: Priekšsēdētājs @lv
definition: A president is a person who presides over a meeting, assembly or a group.
preferred label: Pirmininkas @lt
alternative label: Președintă @ro
preferred label: Präsident @de
in scheme: EP taxonomy on roles.
preferred label: Předseda @cs
preferred label: Uachtarán @ga
type: Concept
preferred label: Président @fr
preferred label: Voorzitter @nl
alternative label: Predsednica @sl
alternative label: Předsedkyně @cs
alternative label: Talman @sv
preferred label: Predsednik @sl
preferred label: Ordförande @sv
preferred label: Președinte @ro

Vice-Chair/Member of the Bureau
type: Concept
alternative label: Stellvertretende Vorsitzende/Mitglied des Vorstands @de
preferred label: Заместник-председател/Член на бюрото @bg
preferred label: Pirmininko pavaduotojas/Biuro narys @lt
alternative label: Potpredsjednica/članica Predsjedništva @hr
preferred label: Podpredsednik/Član predsedst @sl
alternative label: Priekšsēdētāja vietniece/Prezidija locekle @lv
alternative label: Vicepresidenta/Miembro de la Mesa @es
definition: The vice chair of the EP bureau replaces the chair and first vice chair when absent.
preferred label: Vice-Presidente/Membro da Mesa @pt
preferred label: Næstformand/Medlem af bestyrelsen @da
preferred label: Aseesimees/Juhatuse liige @et
preferred label: Varapuheenjohtaja/Työvaliokunnan jäsen @fi
broader: Chairman
alternative label: Podpredsedníčka/Členka predsedníctva @sk
in scheme: EP taxonomy on roles.
preferred label: Leas-Chathaoirleach/Comhalta an bhiúró @ga
preferred label: Vice ordförande/Ledamot av presidiet @sv
preferred label: Vicepreședinte/Membru al Biroului @ro
preferred label: Vicepresidente/Membro dell’ufficio di presidenza @it
preferred label: Ondervoorzitter/Lid van het bureau @nl
alternative label: Vice-présidente/Membre du bureau @fr
preferred label: Vicepresidente/Miembro de la Mesa @es
preferred label: Podpredseda/Člen predsedníctva @sk
preferred label: Αντιπρόεδρος/Μέλος του προεδρείου @el
alternative label: Místopředsedkyně/Členka předsednictva @cs
alternative label: Pirmininko pavaduotoja/Biuro narė @lt
alternative label: Vicepreședintă/Membră a Biroului @ro
preferred label: Vice-président/Membre du bureau @fr
type: Role
alternative label: Podpredsednica/Članica predsedstva @sl
preferred label: Alelnök/Az elnökség tagja @hu
deprecated: false
preferred label: Místopředseda/Člen předsednictva @cs
alternative label: Wiceprzewodnicząca/Członkini prezydium @pl
preferred label: Stellvertretender Vorsitzender/Mitglied des Vorstands @de
preferred label: Potpredsjednik/član Predsjedništva @hr
preferred label: Priekšsēdētāja vietnieks/Prezidija loceklis @lv
preferred label: Wiceprzewodniczący/Członek prezydium @pl
created: 2023-10-31
preferred label: Viċi President/Membru tal-bureau @mt

Speaker
type: Concept
in scheme: EP taxonomy on roles.
broader: Speaker
definition: A person belonging to the European Parliament who speaks.
alternative label: EP runātāja @lv
preferred label: Euroopa Parlamendi kõneleja @et
preferred label: Orador del PE @es
preferred label: Řečník EP @cs
preferred label: EP-előadó @hu
preferred label: Prelegent PE @pl
alternative label: Govornica u EP-u @hr
preferred label: Cainteoir PE @ga
alternative label: Ομιλήτρια του ΕΚ @el
alternative label: EP-Sprecherin @de
alternative label: Oradora del EP @es
preferred label: EP runātājs @lv
preferred label: EP pranešėjas @lt
preferred label: Europaparlamentets talare @sv
alternative label: Oradora do PE @pt
preferred label: Kelliem tal-PE @mt
preferred label: Euroopan parlamentin puhuja @fi
preferred label: Govornik u EP-u @hr
alternative label: Vorbitoare în PE @ro
preferred label: Оратор от ЕП @bg
alternative label: EP pranešėja @lt
preferred label: Orateur du PE @fr
preferred label: EP-Taler @da
preferred label: EP-Sprecher @de
preferred label: Ομιλητής του ΕΚ @el
preferred label: Govornik Evropskega parlamenta @sl
alternative label: Rečníčka v EP @sk
preferred label: Vorbitor în PE @ro
alternative label: Řečnice EP @cs
preferred label: Rečník v EP @sk
deprecated: false
created: 2024-07-01
preferred label: EP-spreker @nl
alternative label: Govornica Evropskega parlamenta @sl
alternative label: Oratrice du PE @fr
preferred label: Oratore del PE @it
preferred label: Orador do PE @pt

Speaker
type: Concept
preferred label: Puhuja @fi
created: 2023-10-31
alternative label: Govornica @hr
preferred label: Vorbitor @ro
preferred label: Orateur @fr
preferred label: Talare @sv
alternative label: Ομιλήτρια @el
alternative label: Oratrice @fr
preferred label: Oратор @bg
alternative label: Locutora @pt
preferred label: Rečník @sk
alternative label: Runātāja @lv
alternative label: Pranešėja @lt
preferred label: Kelliem @mt
preferred label: Felszólaló @hu
alternative label: Vorbitoare @ro
preferred label: Cainteoir @ga
preferred label: Runātājs @lv
preferred label: Redner @de
preferred label: Taler @da
preferred label: Locutor @pt
alternative label: Oradora @es
preferred label: Řečník @cs
alternative label: Rečníčka @sk
definition: A person who speaks.
alternative label: Řečnice @cs
top concept of: EP taxonomy on roles.
preferred label: Pranešėjas @lt
preferred label: Mówca @pl
preferred label: Kõneleja @et
preferred label: Spreker @nl
preferred label: Orador @es
type: ParticipationRole
preferred label: Govornik @sl
preferred label: Oratore @it
alternative label: Rednerin @de
preferred label: Ομιλητής @el
in scheme: EP taxonomy on roles.
deprecated: false

Responsible institution
type: Concept
preferred label: Instytucja odpowiedzialna @pl
preferred label: L-istituzzjoni responsabbli @mt
alternative label: Institution chef de file @fr
preferred label: Institution responsable @fr
preferred label: Υπεύθυνος φορέας @el
preferred label: Отговорна институция @bg
deprecated: false
preferred label: An institiúid fhreagrach @ga
preferred label: Odgovorna institucija @hr
preferred label: Ansvarlig institution @da
preferred label: Zuständiges Organ @de
preferred label: Odpovědný orgán @cs
preferred label: Atsakinga institucija @lt
preferred label: Instituția responsabilă @ro
in scheme: EP taxonomy on roles.
preferred label: Vastutav asutus @et
preferred label: Ansvarig institution @sv
preferred label: Istituzione responsabile @it
preferred label: Zodpovedná inštitúcia @sk
definition: Institution responsible for a given activity within the inter-institutional procedure.
preferred label: Instituição responsável @pt
preferred label: Institución responsable @es
created: 2023-10-31
preferred label: Felelős intézmény @hu
top concept of: EP taxonomy on roles.
preferred label: Verantwoordelijke instelling @nl
preferred label: Atbildīgā institūcija @lv

President of the Court of Auditors
type: Concept
preferred label: Revisionsrettens formand @da
preferred label: Tilintarkastustuomioistuimen presidentti @fi
preferred label: A Számvevőszék elnöke @hu
preferred label: Πρόεδρος του Ελεγκτικού Συνεδρίου @el
preferred label: Presidente do Tribunal de Contas @pt
preferred label: Präsident des Rechnungshofs @de
alternative label: Audito Rūmų pirmininkė @lt
preferred label: Président de la Cour des comptes @fr
preferred label: Revīzijas palātas priekšsēdētājs @lv
alternative label: Présidente de la Cour des comptes @fr
preferred label: Predsednik Računskega sodišča @sl
preferred label: Il-President tal-Qorti tal-Awdituri @mt
preferred label: Predsjednik Revizorskog suda @hr
in scheme: EP taxonomy on roles.
preferred label: Presidente della Corte dei conti @it
alternative label: Predsedníčka Dvora audítorov @sk
alternative label: Revīzijas palātas priekšsēdētāja @lv
deprecated: false
preferred label: Председател на Сметната палата @bg
preferred label: Predseda Dvora audítorov @sk
preferred label: Președintele Curții de Conturi @ro
preferred label: Voorzitter van de Rekenkamer @nl
alternative label: Předsedkyně Účetního dvora @cs
preferred label: Euroopa Kontrollikoja president @et
preferred label: Prezes Trybunału Obrachunkowego @pl
alternative label: Presidenta del Tribunal de Cuentas @es
preferred label: Audito Rūmų pirmininkas @lt
preferred label: Revisionsrättens ordförande @sv
alternative label: Președintă a Curții de Conturi @ro
alternative label: Predsjednica Revizorskog suda @hr
preferred label: Uachtarán na Cúirte Iniúchóirí @ga
preferred label: Presidente del Tribunal de Cuentas @es
preferred label: Předseda Účetního dvora @cs
definition: President of the European Court of Auditors.
alternative label: Predsednica Računskega sodišča @sl
broader: Председател
created: 2023-10-31
alternative label: Präsidentin des Rechnungshofs @de

Parliamentary committee vice-chair
type: CapacityRole
preferred label: Místopředseda parlamentního výboru @cs
deprecated: false
preferred label: podpredsednik parlamentarnega odbora @sl
created: 2025-03-31
broader: Chairman
preferred label: Vicepresidente della commissione parlamentare @it
preferred label: Stellvertretender Vorsitzender des Parlamentsausschusses @de
preferred label: Vicepreședinte al comisiei parlamentare @ro
in scheme: EP taxonomy on roles.
preferred label: A parlamenti bizottság alelnöke @hu
preferred label: Vice ordförande för parlamentsutskottet @sv
definition: The committee vice-chair replaces the committee chair when absent.
preferred label: Leas-Chathaoirleach an choiste pharlaimintigh @ga
preferred label: Parlamentin valiokunnan varapuheenjohtaja @fi
preferred label: Заместник-председател на парламентарната комисия @bg
preferred label: Viċi President tal-Kumitat Parlamentari @mt
preferred label: Næstformand for Europa-Parlamentets udvalg @da
preferred label: Parlamento komiteto pirmininko pavaduotojas @lt
preferred label: Ondervoorzitter parlementaire commissie @nl
preferred label: Αντιπρόεδρος της κοινοβουλευτικής επιτροπής @el
preferred label: Parlamenta komitejas priekšsēdētāja vietnieks @lv
preferred label: Podpredseda parlamentného výboru @sk
preferred label: Vice-président de la commission parlementaire @fr
preferred label: Potpredsjednik parlamentarnog odbora @hr
preferred label: Wiceprzewodniczący komisji parlamentarnej @pl
preferred label: Parlamendikomisjoni aseesimees @et
preferred label: Vice-presidente da comissão parlamentar @pt
preferred label: Vicepresidente de la Comisión Parlamentaria @es
type: Concept

Secretary to the Bureau
type: Role
preferred label: Työvaliokunnan sihteeri @fi
alternative label: Secretaria de la Mesa @es
deprecated: false
preferred label: Bestyrelsessekretær @da
alternative label: Tajnica Predsjedništva @hr
preferred label: Секретар на бюрото @bg
preferred label: Biroja sekretārs @lv
alternative label: Secretária da Mesa @pt
preferred label: Γραμματέας του Προεδρείου @el
preferred label: Tajemník předsednictva @cs
preferred label: Styrelsesekreterare @sv
alternative label: Biroja sekretāre @lv
preferred label: Tajnik Predsjedništva @hr
in scheme: EP taxonomy on roles.
preferred label: Secretar al Biroului @ro
alternative label: Biuro sekretorė @lt
preferred label: Juhatuse sekretär @et
preferred label: Sekretar predsedstva @sl
preferred label: Sekretär des Vorstands @de
preferred label: Secretaris van het bureau @nl
alternative label: Tajemnice předsednictva @cs
alternative label: Tajomníčka predsedníctva @sk
preferred label: Segretario dell’Uff. di presidenza @it
preferred label: Rúnaí don Bhiúró @ga
alternative label: Segretaria dell’Uff. di presidenza @it
alternative label: Sekretarka predsedstva @sl
preferred label: Biuro sekretorius @lt
definition: Secretary of the Bureau is appointed to maintain records and deals with administrative tasks for the Bureau of the European Parliament.
preferred label: Az elnökség titkára @hu
preferred label: Sekretarz prezydium @pl
preferred label: Segretarju tal-Bureau @mt
preferred label: Tajomník predsedníctva @sk
type: Concept
preferred label: Secrétaire du bureau @fr
preferred label: Secretário da Mesa @pt
alternative label: Secretară a Biroului @ro
alternative label: Sekretärin des Vorstands @de
preferred label: Secretario de la Mesa @es
created: 2023-10-31
top concept of: EP taxonomy on roles.

Secretary-General
type: Concept
definition: Head of a general organisation.
alternative label: Secretaria General @es
preferred label: Glavni tajnik @hr
preferred label: Ģenerālsekretārs @lv
preferred label: Secretario General @es
in scheme: EP taxonomy on roles.
preferred label: Segretarju Ġenerali @mt
deprecated: false
preferred label: An tArdrúnaí @ga
preferred label: Secretar general @ro
preferred label: Peasekretär @et
preferred label: Generalinis sekretorius @lt
preferred label: Secretário-geral @pt
alternative label: Segretaria generale @it
alternative label: Generalsekretärin @de
alternative label: Secrétaire générale @fr
preferred label: Segretario generale @it
alternative label: Secretária-geral @pt
preferred label: Генералният секретар @bg
preferred label: Generalsekretär @de
alternative label: Γενική γραμματέας @el
preferred label: Pääsihteeri @fi
preferred label: Secretaris-generaal @nl
preferred label: Generálny tajomník @sk
preferred label: Generalsekreteraren @sv
alternative label: Generální tajemnice @cs
alternative label: Sekretarz generalna @pl
alternative label: Glavna tajnica @hr
preferred label: Főtitkár @hu
created: 2023-10-31
preferred label: Generalni sekretar @sl
alternative label: Ģenerālsekretāre @lv
alternative label: Generálna tajomníčka @sk
alternative label: Generalinė sekretorė @lt
preferred label: Sekretarz Generalny @pl
top concept of: EP taxonomy on roles.
preferred label: Generalsekretæren @da
preferred label: Generální tajemník @cs
preferred label: Γενικός Γραμματέας @el
alternative label: Generalna sekretarka @sl
alternative label: Secretară generală @ro
preferred label: Secrétaire général @fr

Member of the Commission
type: Concept
alternative label: European Commissioner
definition: Member of the European Commission.
alternative label: Membră a Comisiei @ro
alternative label: Komisar @sl
preferred label: Komission jäsen @fi
preferred label: Membro da Comissão @pt
alternative label: Komisár @sk
alternative label: Komisarka @sl
preferred label: Komisijos narys @lt
alternative label: Volinik @et
preferred label: Medlem af Kommissionen @da
alternative label: Commissario @it
alternative label: Komisijas locekle @lv
broader: Member
alternative label: Komisijos narė @lt
alternative label: Comisaria @es
preferred label: Komisjoni liige @et
alternative label: Comissária @pt
alternative label: Kommissar @de
alternative label: Členka Komise @cs
preferred label: Член на Комисията @bg
preferred label: Člen Komisie @sk
preferred label: Član Komisije @sl
alternative label: Commissioner
preferred label: Membru al Comisiei @ro
alternative label: An Coimisinéir @ga
alternative label: Članica Komisije @sl
created: 2023-10-31
alternative label: Komisārs @lv
alternative label: Comissário @pt
preferred label: Comhalta den Choimisiún @ga
alternative label: Commissaire européen @fr
preferred label: Lid van de Commissie @nl
narrow match: COM MEMB
deprecated: false
preferred label: Μέλος της Επιτροπής @el
alternative label: Comisario @es
alternative label: Commissaria @it
preferred label: Membro della Commissione @it
preferred label: Mitglied der Kommission @de
alternative label: Kommissær @da
preferred label: Komisijas loceklis @lv
alternative label: Επίτροπος @el
preferred label: Membre de la Commission @fr
alternative label: Komisarz @pl
preferred label: Ledamot av kommissionen @sv
preferred label: A Bizottság tagja @hu
alternative label: Commissaris @nl
alternative label: Povjerenica @hr
in scheme: EP taxonomy on roles.
alternative label: Komisárka @sk
alternative label: Il-Kummissarju @mt
alternative label: Kommissarin @de
alternative label: Biztos @hu
preferred label: Miembro de la Comisión @es
alternative label: Komisāre @lv
alternative label: Commissaire @fr
alternative label: Członkini Komisji @pl
preferred label: Il-Membru tal-Kummissjoni @mt
alternative label: Kомисар @bg
alternative label: Komisař @cs
preferred label: Člen Komise @cs
alternative label: Kommissionär @sv
alternative label: Členka Komisie @sk
alternative label: Komisařka @cs
alternative label: Povjerenik @hr
preferred label: Członek Komisji @pl
alternative label: Komissaari @fi
alternative label: Comisar @ro

Vice-Chairman
type: Concept
preferred label: Podpredsednik @sl
preferred label: Vice-président @fr
preferred label: Wiceprzewodniczący @pl
alternative label: Potpredsjednica @hr
definition: A vice-chairman replaces the chair when absent.
preferred label: Vicevoorzitter @nl
alternative label: Pirmininko pavaduotoja @lt
preferred label: Potpredsjednik @hr
preferred label: Заместник-председател @bg
alternative label: Podpredsednica @sl
preferred label: Alelnök @hu
alternative label: Vicepresidenta @es
alternative label: Ondervoorzitter @nl
preferred label: Priekšsēdētāja vietnieks @lv
broader: Chairman
preferred label: Aseesimees @et
preferred label: Vice-presidente @pt
alternative label: Wiceprzewodnicząca @pl
alternative label: Podpredsedníčka @sk
in scheme: EP taxonomy on roles.
deprecated: false
alternative label: Vice-présidente @fr
preferred label: Místopředseda @cs
preferred label: Vicepreședinte @ro
preferred label: Pirmininko pavaduotojas @lt
preferred label: Podpredseda @sk
preferred label: Αντιπρόεδρος @el
alternative label: Vice-Chair
preferred label: Vicepresidente @it
created: 2023-10-31
alternative label: Priekšsēdētāja vietniece @lv
preferred label: Næstformand @da
preferred label: Vice ordförande @sv
alternative label: Místopředsedkyně @cs
alternative label: Stellvertretende Vorsitzende @de
preferred label: Varapuheenjohtaja @fi
preferred label: Leas-Chathaoirleach @ga
type: Role
preferred label: Viċi President @mt
preferred label: Stellvertretender Vorsitzender @de
alternative label: Vicepreședintă @ro

Ambassador
type: Concept
alternative label: Embajadora @es
preferred label: Πρέσβυς @el
alternative label: Velvyslankyně @cs
preferred label: Nagykövet @hu
alternative label: Veleposlanica @hr
top concept of: EP taxonomy on roles.
preferred label: Embajador @es
alternative label: Ambasadoare @ro
preferred label: Ambassadør @da
alternative label: Botschafterin @de
preferred label: Velvyslanec @cs
preferred label: Veleposlànīk @hr
alternative label: Ambasciatrice @it
alternative label: Ambassadrice @fr
preferred label: Veleposlanik @sl
preferred label: Suurlähettiläs @fi
created: 2023-10-31
preferred label: Ambaxxatur @mt
preferred label: Ambasadóir @ga
preferred label: посланик @bg
preferred label: Embaixador @pt
preferred label: Ambasador @pl
definition: Official working in a foreign country representing his or her own country.
preferred label: Ambassadör @sv
preferred label: Botschafter @de
preferred label: Veľvyslanec @sk
preferred label: Vēstnieks @lv
preferred label: Suursaadik @et
alternative label: Ambasadorka @pl
alternative label: Ambasadorė @lt
alternative label: Vēstniece @lv
in scheme: EP taxonomy on roles.
preferred label: Ambassadeur @fr
preferred label: Ambasadorius @lt
alternative label: Embaixadora @pt
alternative label: Veľvyslankyňa @sk
preferred label: Ambasciatore @it
deprecated: false

EP Vice-President responsible for STOA
type: Role
preferred label: Vice-Presidente do Parlamento Europeu responsável pelo STOA @pt
preferred label: Místopředseda EP odpovědný za STOA @cs
preferred label: Vice-président du PE chargé du comité STOA @fr
alternative label: Wiceprzewodnicząca PE odpowiedzialna za STOA @pl
alternative label: Par STOA atbildīgā EP priekšsēdētāja vietniece @lv
alternative label: Potpredsjednica EP-a nadležna za STOA-u @hr
preferred label: Potpredsjednik EP-a nadležan za STOA-u @hr
alternative label: Podpredsednica EP, pristojna za STOA @sl
alternative label: Podpredsedníčka EP zodpovedná za STOA @sk
alternative label: Místopředsedkyně EP odpovědná za STOA @cs
preferred label: Podpredseda EP zodpovedný za STOA @sk
preferred label: Vicepreședintele PE responsabil pentru STOA @ro
preferred label: Par STOA atbildīgais EP priekšsēdētāja vietnieks @lv
preferred label: Parlamento Pirmininko pavaduotojas, atsakingas už STOA @lt
alternative label: Parlamento pirmininko pavaduotoja, atsakinga už STOA @lt
preferred label: Vice talman med ansvar för Stoa @sv
alternative label: Vicepresidenta del Parlamento Europeo responsable de STOA @es
definition: European Parliament vice-president responsible for STOA.
deprecated: false
preferred label: Заместник-председател на ЕП, отговарящ за STOA @bg
preferred label: Vicepresidente del PE con responsabilità per lo STOA @it
preferred label: Europa-Parlamentets næstformand med ansvar for STOA @da
type: Concept
broader: Председател
alternative label: Vizepräsidentin des EP mit Zuständigkeit für die STOA @de
preferred label: STOAsta vastaava EP:n varapuhemies @fi
preferred label: voor STOA verantwoordelijke ondervoorzitter van het EP @nl
preferred label: Viċi President tal-PE responsabbli għall-Bord STOA @mt
preferred label: Podpredsednik EP, pristojen za STOA @sl
alternative label: Vice-présidente du PE chargée du comité STOA @fr
preferred label: STOA-ért felelős alelnöke @hu
preferred label: Αντιπρόεδρος του ΕΚ αρμόδιος για τη STOA @el
preferred label: STOA eest vastutav EP asepresident @et
created: 2023-10-31
alternative label: Vicepreședinta PE responsabilă pentru STOA @ro
in scheme: EP taxonomy on roles.
preferred label: Vicepresidente del Parlamento Europeo responsable de STOA @es
preferred label: Vizepräsident des EP mit Zuständigkeit für die STOA @de
preferred label: Wiceprzewodniczący PE odpowiedzialny za STOA @pl

President of the European Council
type: Concept
preferred label: Az Európai Tanács elnöke @hu
alternative label: Présidente du Conseil européen @fr
alternative label: Eiropadomes priekšsēdētāja @lv
preferred label: Euroopa Ülemkogu eesistuja @et
alternative label: Przewodnicząca Rady Europejskiej @pl
in scheme: EP taxonomy on roles.
created: 2023-10-31
preferred label: Präsident des Europäischen Rates @de
preferred label: Președintele Consiliului European @ro
preferred label: Predseda Európskej rady @sk
definition: Person who moderates debates, makes rulings on procedure, etc.
alternative label: Președintă a Consiliului European @ro
preferred label: Europos Vadovų Tarybos pirmininkas @lt
broader: Председател
preferred label: Predsjednik Europskoga vijeća @hr
preferred label: Président du Conseil européen @fr
preferred label: Uachtarán na Comhairle Eorpaí @ga
alternative label: Predsjednica Europskoga vijeća @hr
preferred label: Predsednik Evropskega sveta @sl
preferred label: Formand for Det Europæiske Råd @da
alternative label: Předsedkyně Evropské rady @cs
alternative label: Europos Vadovų Tarybos pirmininkė @lt
preferred label: Presidente do Conselho Europeu @pt
preferred label: Eiropadomes priekšsēdētājs @lv
preferred label: Presidente del Consejo Europeo @es
preferred label: Voorzitter van de Europese Raad @nl
alternative label: Predsednica Evropskega Sveta @sl
preferred label: Europeiska rådets ordförande @sv
preferred label: Πρόεδρος του Ευρωπαϊκού Συμβουλίου @el
preferred label: Eurooppa-neuvoston puhemies @fi
deprecated: false
preferred label: Председател на Европейския съвет @bg
preferred label: Předseda Evropské rady @cs
preferred label: Kunsill Ewropew @mt
alternative label: Predsedníčka Európskej rady @sk
alternative label: Präsidentin des Europäischen Rates @de
preferred label: Presidente del Consiglio europeo @it
alternative label: Presidenta del Consejo Europeo @es
preferred label: Przewodniczący Rady Europejskiej @pl

Joint responsible Parliamentary Committees
type: Concept
preferred label: Μικτές αρμόδιες κοινοβουλευτικές επιτροπές @el
preferred label: Kumitati Parlamentari responsabbli konġunti @mt
preferred label: Bendrai atsakingi Parlamento komitetai @lt
preferred label: Společné příslušné parlamentní výbory @cs
preferred label: Commissioni parlamentari responsabili congiunte @it
preferred label: Comissões parlamentares conjuntas competentes quanto à matéria de fundo @pt
preferred label: Comisii parlamentare competente în comun @ro
preferred label: Gezamenlijk bevoegde parlementaire commissies @nl
preferred label: Coistí Parlaiminteacha comhfhreagrachta @ga
broader: Parliamentary committee responsible
deprecated: false
preferred label: Parlamentsutskott med gemensamt ansvar @sv
preferred label: Közösen eljáró illetékes parlamenti bizottságok @hu
preferred label: Asiasta yhdessä vastaavat valiokunnat @fi
preferred label: Wspólnie właściwe komisje parlamentarne @pl
preferred label: Kopīgi atbildīgās Parlamenta komitejas @lv
preferred label: Gemeinsam zuständige parlamentarische Ausschüsse @de
preferred label: Parlamentariske udvalg med fælles ansvar @da
in scheme: EP taxonomy on roles.
preferred label: Commissions parlementaires jointes au fond @fr
preferred label: Spoločné parlamentné výbory @sk
preferred label: Съвместни компетентни парламентарни комисии @bg
preferred label: Zajednički nadležni parlamentarni odbori @hr
created: 2023-10-31
definition: Documents of a legislative nature are referred by the Parliament to the lead committee, also called committee responsible, for consideration. When matter falls on responsibility of several committees, they act jointly.
preferred label: Comisiones parlamentarias competentes conjuntamente para el fondo @es
preferred label: Ühiselt vastutavad parlamendikomisjonid @et
preferred label: Skupni pristojni parlamentarni odbori @sl

Parliamentary committee responsible
type: Concept
preferred label: Nadležni parlamentarni odbor @hr
preferred label: Comisie parlamentară competentă @ro
preferred label: Parlamento atsakingas komitetas @lt
preferred label: Parlamentets korresponderende udvalg @da
preferred label: Federführender Ausschuss des Parlaments @de
preferred label: Αρμόδια επί της ουσίας κοινοβουλευτική επιτροπή @el
preferred label: Ten principale bevoegde parlementaire commissie @nl
in scheme: EP taxonomy on roles.
preferred label: Parlamentin asiasta vastaava valiokunta @fi
preferred label: Comissão parlamentar competente quanto à matéria de fundo @pt
preferred label: Comisión parlamentaria competente para el fondo @es
top concept of: EP taxonomy on roles.
preferred label: Commissione parlamentare competente per il merito @it
preferred label: Pristojni parlamentarni odbor @sl
created: 2023-10-31
definition: Documents of a legislative nature are referred by the Parliament to the lead committee, also called committee responsible, for consideration.
preferred label: Illetékes parlamenti bizottság @hu
preferred label: Parlamendi vastutav komisjon @et
preferred label: Commission parlementaire compétente au fond @fr
type: ParticipationRole
preferred label: Gestorský parlamentný výbor @sk
preferred label: Компетентна парламентарна комисия @bg
deprecated: false
preferred label: Przedmiotowo właściwa komisja parlamentarna @pl
preferred label: Příslušný parlamentní výbor @cs
preferred label: Parlamenta atbildīgā komiteja @lv
preferred label: Coiste parlaiminteach freagrach @ga
preferred label: Kumitat parlamentari responsabbli @mt
preferred label: Parlamentets ansvariga utskott @sv

Rapporteur for the opinion
type: Concept
alternative label: Raportoare pentru aviz @ro
alternative label: Spravodajkyňa výboru požiadaného o stanovisko @sk
alternative label: Atzinuma sagatavotāja @lv
preferred label: Izvjestitelj o mišljenju @hr
preferred label: Vélemény előadója @hu
alternative label: Relatora de parecer @pt
preferred label: Relatore per parere @it
preferred label: Föredragande @sv
preferred label: Rapporteur għal opinjoni @mt
preferred label: Rapporteur voor advies @nl
preferred label: Arvamuse koostaja @et
in scheme: EP taxonomy on roles.
alternative label: Relatrice per parere @it
alternative label: Izvjestiteljica o mišljenju @hr
preferred label: Pripravljavec mnenja @sl
preferred label: Nuomonės referentas @lt
preferred label: Verfasser der Stellungnahme @de
preferred label: Lausunnon valmistelija @fi
preferred label: Ponente de opinión @es
preferred label: Dréachtóir @ga
alternative label: Navrhovatelka stanoviska @cs
preferred label: Raportor pentru aviz @ro
alternative label: Sprawozdawczyni komisji opiniodawczej @pl
alternative label: Verfasserin der Stellungnahme @de
preferred label: Rapporteur pour avis @fr
preferred label: Sprawozdawca komisji opiniodawczej @pl
broader: Rapporteur
preferred label: Relator de parecer @pt
alternative label: Rapporteure pour avis @fr
alternative label: Nuomonės referentė @lt
preferred label: Spravodajca výboru požiadaného o stanovisko @sk
preferred label: Navrhovatel stanoviska @cs
type: CapacityRole
created: 2023-10-31
definition: A person who prepares a report for opinion.
alternative label: Συντάκτρια @el
alternative label: Pripravljavka mnenja @sl
preferred label: Συντάκτης @el
type: ParticipationRole
preferred label: Ordfører for udtalelse @da
preferred label: Докладващ за становище @bg
preferred label: Atzinuma sagatavotājs @lv
deprecated: false

Substitute member
type: Concept
alternative label: Zamjenica @hr
preferred label: Locekļa aizvietotājs @lv
alternative label: Membre suppléante @fr
alternative label: Membru supleant @ro
preferred label: Заместник-член @bg
alternative label: Nadomestna članica @sl
alternative label: Aizstājēja @lv
alternative label: Comhalta ionadaíoch @ga
preferred label: Αναπληρωματικό μέλος @el
type: Role
alternative label: Заместник @bg
preferred label: Náhradník @cs
alternative label: Substitute
alternative label: Pavaduojantis narys @lt
preferred label: Suppleant @sv
deprecated: false
created: 2023-10-31
preferred label: Membro suplente @pt
alternative label: Locekļa aizvietotāja @lv
preferred label: Stellvertreter @de
broader: Member
alternative label: Náhradnice @cs
alternative label: Pavaduojanti narė @lt
preferred label: Póttag @hu
definition: Substitute member alternates with another member.
preferred label: Nadomestni član @sl
alternative label: Zamjenica člana @hr
alternative label: Membro sostituto @it
alternative label: Zastępstwo @pl
preferred label: Pakaitinis narys @lt
preferred label: Suplente @es
alternative label: Sostitut @mt
alternative label: Náhradníčka @sk
alternative label: Stellvertreterin @de
in scheme: EP taxonomy on roles.
preferred label: Membro supplente @it
preferred label: Zastępca członka @pl
alternative label: Pakaitinė narė @lt
preferred label: Supleant @ro
alternative label: Namestnica @sl
alternative label: Namestnik @sl
alternative label: Stedfortræder @da
alternative label: Αναπληρώτρια @el
preferred label: Membru supplenti @mt
preferred label: Membre suppléant @fr
preferred label: Comhalta malartach @ga
preferred label: Zamjenik člana @hr
preferred label: Plaatsvervanger @nl
alternative label: Aizstājējs @lv
alternative label: Zamjenik @hr
preferred label: Varajäsen @fi
alternative label: Αναπληρωτής @el
preferred label: Asendusliige @et

Member of the enlarged Bureau
type: Concept
preferred label: Mitglied des Erweiterten Vorstands @de
preferred label: Membre du Bureau Elargi @fr
preferred label: A kibővített Elnökség tagja @hu
preferred label: Laiendatud juhatuse liige @et
preferred label: Medlem af det udvidede præsidium @da
preferred label: Član proširenog predsjedništva @hr
preferred label: Lid van het bureau in uitgebreide samenstelling @nl
preferred label: Ledamot av det utvidgade presidiet @sv
preferred label: Člen rozšířeného předsednictva @cs
preferred label: Członek prezydium w poszerzonym składzie @pl
deprecated: false
preferred label: Miembro de la Mesa ampliada @es
preferred label: Paplašinātā prezidija loceklis @lv
preferred label: Membro da Mesa Alargada @pt
created: 2023-10-31
preferred label: Laajennetun puhemiehistön jäsen @fi
in scheme: EP taxonomy on roles.
broader: Member
preferred label: Membru al Biroului extins @ro
definition: Member of the enlarged Bureau of the European Parliament, person appointed to include representatives of candidate states.
preferred label: Membro dell’Ufficio di presidenza ampliato @it
preferred label: Μέλος του διευρυμένου προεδρείου @el
preferred label: Член на Бюрото в разширен състав @bg
preferred label: Član razširjenega predsedstva @sl
preferred label: Membru tal-Bureau estiż @mt
preferred label: Comhalta den Bhiúró Méadaithe @ga
preferred label: Člen rozšíreného predsedníctva @sk
preferred label: Išplėstos sudėties biuro narys @lt

Parliamentary committee for opinion on delegation of legislative powers and conferral of implementing powers
type: Concept
preferred label: Commission parlementaire pour avis sur la délégation de pouvoirs législatifs et l'attribution de compétences d'exécution @fr
preferred label: Parlamentarna komisja opiniodawcza ds. przekazania uprawnień ustawodawczych i przekazania uprawnień wykonawczych @pl
preferred label: Comissão parlamentar de parecer sobre a delegação de poderes legislativos e a atribuição de competências de execução @pt
preferred label: Commissione parlamentare per il parere sulla delega di poteri legislativi e il conferimento di competenze di esecuzione @it
preferred label: Parlamentný výbor pre stanovisko k delegovaniu legislatívnych právomocí a preneseniu vykonávacích právomocí @sk
preferred label: Comisia parlamentară pentru aviz privind delegarea competențelor legislative și delegarea competențelor de executare @ro
preferred label: Parlamentní výbor pro stanovisko k delegování legislativních pravomocí a svěření prováděcích pravomocí @cs
preferred label: Κοινοβουλευτική επιτροπή για γνωμοδότηση σχετικά με την ανάθεση νομοθετικών αρμοδιοτήτων και την ανάθεση εκτελεστικών αρμοδιοτήτων @el
preferred label: Parlamentarisk udvalg til udtalelse om delegation af lovgivningsbeføjelser og tildeling af gennemførelsesbeføjelser @da
definition: Parliamentary committee giving an opinion on delegation of legislative powers and conferral of implementing powers in a procedure.
preferred label: Парламентарна комисия за становище относно делегирането на законодателни правомощия и предоставянето на изпълнителни правомощия @bg
created: 2025-06-30
preferred label: Parlamenta komiteja atzinuma sniegšanai par likumdošanas pilnvaru deleģēšanu un īstenošanas pilnvaru piešķiršanu @lv
preferred label: Seadusandlike volituste delegeerimist ja rakendamisvolituste andmist käsitlev parlamendikomisjon @et
preferred label: A jogalkotási hatáskörök átruházásáról és a végrehajtási hatáskörök átruházásáról szóló véleményt kidolgozó parlamenti bizottság @hu
in scheme: EP taxonomy on roles.
preferred label: Parlementaire commissie voor advies over delegatie van wetgevingsbevoegdheden en toekenning van uitvoeringsbevoegdheden @nl
preferred label: Comisión parlamentaria de opinión sobre la delegación de competencias legislativas y la atribución de competencias de ejecución @es
preferred label: Lainsäädäntövallan siirtoa ja täytäntöönpanovallan siirtoa käsittelevä parlamentin valiokunta @fi
deprecated: false
preferred label: Kumitat Parlamentari għal opinjoni dwar id-delega ta' setgħat leġiżlattivi u l-għoti ta' setgħat ta' implimentazzjoni @mt
broader: Parliamentary committee for opinion
preferred label: Parlamento nuomonės dėl teisėkūros įgaliojimų delegavimo ir įgyvendinimo įgaliojimų suteikimo komitetas @lt
preferred label: Parlamentsutskott för yttrande om delegering av lagstiftningsbefogenheter och tilldelning av genomförandebefogenheter @sv
preferred label: Parlamentarni odbor za mišljenje o delegiranju zakonodavnih ovlasti i dodjeli provedbenih ovlasti @hr
preferred label: Parlamentarischer Ausschuss zur Stellungnahme zur Übertragung von Gesetzgebungsbefugnissen und zur Übertragung von Durchführungsbefugnissen @de
preferred label: Parlamentarni odbor za mnenje o prenosu zakonodajnih pooblastil in prenosu izvedbenih pooblastil @sl
preferred label: An coiste parlaiminteach um thuairim maidir le cumhachtaí reachtacha a tharmligean agus cumhachtaí cur chun feidhme a thabhairt @ga

Parliamentary committee for opinion
type: ParticipationRole
preferred label: Parlamento nuomonę teikiantis komitetas @lt
preferred label: Parlamentarni odbor za mnenje @sl
preferred label: Véleménynyilvánításra felkért parlamenti bizottság @hu
preferred label: Подпомагаща парламентарна комисия @bg
preferred label: Parlamentin lausunnon antava valiokunta @fi
preferred label: Kumitat parlamentari li jintalab jagħti opinjoni @mt
preferred label: Parlamentets rådgivende udvalg @da
preferred label: Commission parlementaire pour avis @fr
deprecated: false
preferred label: Γνωμοδοτική κοινοβουλευτική επιτροπή @el
preferred label: Parlamentarna komisja opiniodawcza @pl
preferred label: Comissão parlamentar encarregada de emitir parecer @pt
preferred label: Medeadviserende parlementaire commissie @nl
preferred label: Parlamendi nõuandev komisjon @et
preferred label: Parlamentets rådgivande utskott @sv
preferred label: Parlamentný výbor požiadaný o stanovisko @sk
preferred label: Parlamentní výbor, od něhož se žádá stanovisko @cs
type: Concept
preferred label: Comisie parlamentară sesizată pentru aviz @ro
definition: Opinion giving parliamentary committee.
created: 2023-10-31
preferred label: Parlamentarni odbor za mišljenje @hr
top concept of: EP taxonomy on roles.
preferred label: An coiste parlaiminteach ar iarradh tuairim air @ga
preferred label: Parlamenta komiteja atzinuma sagatavošanai @lv
preferred label: Commissione parlamentare competente per parere @it
in scheme: EP taxonomy on roles.
preferred label: Comisión parlamentaria competente para emitir opinión @es
preferred label: Mitberatender Ausschuss des Parlaments @de

President of the Council
type: Concept
preferred label: Neuvoston puheenjohtaja @fi
alternative label: Předsedkyně Rady @cs
preferred label: Rådets ordförande @sv
created: 2023-10-31
preferred label: Tarybos pirmininkas @lt
alternative label: Președinta Consiliului @ro
preferred label: Nõukogu eesistuja @et
preferred label: Predseda Rady @sk
preferred label: Padomes priekšsēdētājs @lv
preferred label: Przewodniczący Rady @pl
preferred label: Председател на Съвета @bg
broader: Председател
preferred label: Präsident des Rates der Europäischen Union @de
alternative label: Predsedníčka Rady @sk
preferred label: Presidente del Consiglio @it
preferred label: Uachtarán na Comhairle @ga
preferred label: Președintele Consiliului @ro
alternative label: Presidenta del Consejo @es
preferred label: Πρόεδρος του Συμβουλίου @el
preferred label: Presidente del Consejo @es
preferred label: Presidente do Conselho @pt
preferred label: Predsednik Sveta @sl
alternative label: Présidente du Conseil @fr
alternative label: Präsidentin des Rates der Europäischen Union @de
alternative label: Predsjednica Vijeća @hr
in scheme: EP taxonomy on roles.
definition: President of the Council of the European Union.
alternative label: Padomes priekšsēdētāja @lv
alternative label: Predsednica Sveta @sl
preferred label: A Tanács elnöke @hu
alternative label: Tarybos pirmininkė @lt
preferred label: Voorzitter van de Raad @nl
alternative label: Przewodnicząca Rady @pl
preferred label: Président du Conseil @fr
preferred label: Predsjednik Vijeća @hr
preferred label: Rådsformand @da
deprecated: false
preferred label: Il-President tal-Kunsill @mt
preferred label: Předseda Rady @cs

Rapporteur for opinion – Chair on behalf of a committee
type: Concept
preferred label: Zpravodaj – předseda výboru @cs
preferred label: A vélemény előadója – A bizottság nevében eljáró elnök @hu
preferred label: Relatore per parere — presidente a nome di una commissione @it
preferred label: Sprawozdawca komisji opiniodawczej – przewodniczący w imieniu komisji @pl
preferred label: Ponente de opinión — Presidente en nombre de una comisión @es
preferred label: Докладчик по становище — председател от името на комисия @bg
in scheme: EP taxonomy on roles.
preferred label: Izvjestitelj za mišljenje – predsjednik u ime odbora @hr
broader: Rapporteur
top concept of: enrich
preferred label: Rapporteur pour avis — président au nom d’une commission @fr
definition: A person who submits an opinion in the name of being the chair of the committee.
preferred label: Rapporteur voor advies — voorzitter namens een commissie @nl
preferred label: Spravodajca výboru požiadaného o stanovisko – predsedajúci v mene výboru @sk
preferred label: Atzinuma sagatavotājs — priekšsēdētājs komitejas vārdā @lv
preferred label: Ordfører for udtalelse — formand på vegne af et udvalg @da
preferred label: Valmistelija – puheenjohtaja valiokunnan puolesta @fi
preferred label: Raportor pentru aviz – președinte în numele unei comisii @ro
preferred label: Rapóirtéir don tuairim — Cathaoirleach thar ceann coiste @ga
deprecated: false
preferred label: Verfasser der Stellungnahme – Vorsitzender im Namen eines Ausschusses @de
preferred label: Arvamuse koostaja – esimees parlamendikomisjoni nimel @et
preferred label: Relator de parecer — presidente em nome de uma comissão @pt
created: 2025-01-31
preferred label: Συντάκτης γνωμοδότησης — Πρόεδρος εξ ονόματος επιτροπής @el
preferred label: Föredragande av yttrande – ordförande på ett utskotts vägnar @sv
preferred label: Nuomonės referentas – komiteto pirmininkas @lt
broad match: RAPP OPIN
preferred label: Rapporteur għal opinjoni — President f’isem kumitat @mt
preferred label: Pripravljavec mnenja – predsednik v imenu odbora @sl
in scheme: enrich

Minister
type: Concept
preferred label: Ministro @es
alternative label: Ministryně @cs
top concept of: EP taxonomy on roles.
alternative label: Ministerin @de
preferred label: Aire @ga
preferred label: Statsråd @sv
alternative label: Ministrica @hr
preferred label: Υπουργός @el
preferred label: Ministrs @lv
preferred label: Ministru @mt
deprecated: false
alternative label: Ministra @es
created: 2023-10-31
preferred label: Ministre @fr
definition: Member of the government who is in charge of a particular department or policy area.
preferred label: Ministras @lt
preferred label: Miniszter @hu
preferred label: Ministar @hr
alternative label: Ministrė @lt
preferred label: Ministeri @fi
in scheme: EP taxonomy on roles.
preferred label: Ministr @cs
alternative label: Ministerka @sk
preferred label: Министър @bg

Treasurer/Vice-Chair/Member of the Bureau
type: Concept
alternative label: Tesoriera/Vicepresidente/Membro dell’ufficio di presidenza @it
preferred label: Cisteoir/Leas-Chathaoirleach/Comhalta an Bhiúró @ga
alternative label: Teżoriera/Viċi President/Membru tal-Bureau @mt
preferred label: Iždininkas/Pirmininko pavaduotojas/Biuro narys @lt
preferred label: Skarbnik/ Wiceprzewodniczący/Członek prezydium @pl
alternative label: Iždininkė/Pirmininko pavaduotoja/Biuro narė @lt
alternative label: Schatzmeisterin/Stellvertretende Vorsitzende/Mitglied des Vorstands @de
preferred label: Ταμίας/Αντιπρόεδρος/Μέλος του Προεδρείου @el
preferred label: Kasieris/Priekšsēdētāja vietnieks/Prezidija loceklis @lv
alternative label: Pokladníčka/Podpredsedníčka/Členka predsedníctva @sk
alternative label: Pokladnice/Místopředsedkyně/Členka předsednictva @cs
preferred label: Trezorier/Vicepreședinte/Membru al Biroului @ro
alternative label: Trezorieră/Vicepreședintă/Membră a Biroului @ro
alternative label: Zakladničarka/Podpredsednica/Članica predsedstva @sl
alternative label: Kasiere/Priekšsēdētāja vietniece/Prezidija locekle @lv
preferred label: Teżorier/Viċi President/Membru tal-bureau @mt
definition: This role has been used by political groups in the European Parliament for a person holding these two roles.
alternative label: Skarbniczka/Wiceprzewodnicząca /Członkini prezydium @pl
in scheme: EP taxonomy on roles.
preferred label: Kincstárnok/Alelnök/Az elnökség tagja @hu
preferred label: Ковчежник/Заместник-председател/Член на Бюрото @bg
preferred label: Trésorier/Vice-président/Membre du bureau @fr
broader: Chairman
type: Role
preferred label: Tesorero/Vicepresidente/Miembro de la Mesa @es
preferred label: Schatzmeister/Stellvertretender Vorsitzender/Mitglied des Vorstands @de
preferred label: Pokladník/Místopředseda/Člen předsednictva @cs
alternative label: Trésorière/Vice-présidente/Membre du bureau @fr
deprecated: false
preferred label: Varahoidja/Aseesimees/ Juhatuse liige @et
preferred label: Zakladnik/Podpredsednik/Član predsedstva @sl
alternative label: Tesorera/Vicepresidenta/Miembro de la Mesa @es
preferred label: Tesoriere/Vicepresidente/Membro dell’ufficio di presidenza @it
alternative label: Tesoureira/Vice-presidente/Membro da Mesa @pt
preferred label: Tesoureiro/Vice-presidente/Membro da Mesa @pt
preferred label: Kasserer/Næstformand/Medlem af bestyrelsen @da
preferred label: Kassör/Vice ordförande/Ledamot av presidiet @sv
preferred label: Taloudenhoitaja/ Varapuheenjohtaja/Työvaliokunnan jäsen @fi
created: 2023-10-31
preferred label: Rizničar/potpredsjednik/član Predsjedništva @hr
preferred label: Penningmeester/ Ondervoorzitter/Lid van het bureau @nl
broader: Treasurer
preferred label: Pokladník/Podpredseda/Člen predsedníctva @sk
alternative label: Rizničarka/potpredsjednica/članica Predsjedništva @hr

Treasurer
type: Role
deprecated: false
preferred label: Pokladník @cs
preferred label: Kasieris @lv
preferred label: Rizničar @hr
preferred label: Kincstárnok @hu
preferred label: Kasserer @da
alternative label: Trésorière @fr
in scheme: EP taxonomy on roles.
alternative label: Tesoureira @pt
preferred label: Schatzmeister @de
preferred label: Skarbnik @pl
preferred label: Zakladnik @sl
preferred label: Teżorier @mt
top concept of: EP taxonomy on roles.
preferred label: Tesoriere @it
alternative label: Schatzmeisterin @de
preferred label: Trésorier @fr
preferred label: Cisteoir @ga
alternative label: Iždininkė @lt
preferred label: Tesoureiro @pt
preferred label: Iždininkas @lt
preferred label: Trezorier @ro
preferred label: Tesorero @es
preferred label: Ταμίας @el
preferred label: Penningmeester @nl
alternative label: Pokladníčka @sk
alternative label: Rizničarka @hr
alternative label: Zakladnica @sl
created: 2023-10-31
alternative label: Pokladnice @cs
alternative label: Skarbniczka @pl
preferred label: Taloudenhoitaja @fi
preferred label: Ковчежник @bg
alternative label: Teżoriera @mt
alternative label: Tesorera @es
preferred label: Varahoidja @et
preferred label: Kassör @sv
alternative label: Kasiere @lv
definition: A treasurer manages the finances of an entity.
type: Concept

Vice-President of the European Commission
type: Concept
deprecated: false
alternative label: Vice-présidente de la Commission européenne @fr
alternative label: Wiceprzewodnicząca Komisji Europejskiej @pl
preferred label: Vicepreședinte al Comisiei Europene @ro
preferred label: Potpredsjednik Europske komisije @hr
alternative label: Eiropas Komisijas priekšsēdētāja vietniece @lv
preferred label: Podpredsednik Evropske komisije @sl
preferred label: Wiceprzewodniczący Komisji Europejskiej @pl
definition: Vice-presidents of the European Commission act for the president when absent.
alternative label: Europos Komisijos pirmininko pavaduotoja @lt
alternative label: Vicepresidenta de la Comisión Europea @es
preferred label: Vice-presidente da Comissão Europeia @pt
preferred label: Az Európai Bizottság alelnöke @hu
created: 2023-10-31
preferred label: Europeiska kommissionens vice ordförande @sv
broader: Председател
preferred label: Euroopa Komisjoni asepresident @et
preferred label: Заместник-председател на Европейската комисия @bg
preferred label: Podpredseda Európskej komisie @sk
preferred label: Vicepresidente de la Comisión Europea @es
preferred label: Leas-Uachtarán an Choimisiúin Eorpaigh @ga
alternative label: Vicepreședintă a Comisiei Europene @ro
preferred label: Il-Viċi President tal-Kummissjoni Ewropea @mt
in scheme: EP taxonomy on roles.
alternative label: Vizepräsidentin der Europäischen Kommission @de
preferred label: Místopředseda Evropské komise @cs
alternative label: Potpredsjednica Europske komisije @hr
preferred label: Europos Komisijos pirmininko pavaduotojas @lt
preferred label: Eiropas Komisijas priekšsēdētāja vietnieks @lv
preferred label: Vicevoorzitter van de Europese Commissie @nl
alternative label: Podpredsednica Evropske komisije @sl
preferred label: Euroopan komission varapuheenjohtaja @fi
alternative label: Podpredsedníčka Európskej komisie @sk
alternative label: Místopředsedkyně Evropské komise @cs
preferred label: Αντιπρόεδρος της Ευρωπαϊκής Επιτροπής @el
preferred label: Vizepräsident der Europäischen Kommission @de
preferred label: Vice-président de la Commission européenne @fr
preferred label: Vicepresidente della Commissione europea @it
preferred label: Europa-Kommissionens næstformand @da

President of the European Central Bank
type: Concept
in scheme: EP taxonomy on roles.
broader: Председател
preferred label: Uachtarán an Bhainc Ceannais Eorpaigh @ga
preferred label: Prezident Európskej centrálnej banky @sk
preferred label: President tal-Bank Ċentrali Ewropew @mt
preferred label: Председател на Европейската централна банка @bg
preferred label: Prezident Evropské centrální banky @cs
preferred label: Președintele Băncii Centrale Europene @ro
deprecated: false
preferred label: Euroopa Keskpanga president @et
preferred label: Predsjednik Europske središnje banke @hr
preferred label: Europeiska centralbankens ordförande @sv
preferred label: Euroopan keskuspankin pääjohtaja @fi
preferred label: Az Európai Központi Bank elnöke @hu
preferred label: Presidente della Banca centrale europea @it
preferred label: Πρόεδρος της Ευρωπαϊκής Κεντρικής Τράπεζας @el
preferred label: Formand for Den Europæiske Centralbank @da
preferred label: Presidente do Banco Central Europeu @pt
preferred label: Predsednik Evropske centralne banke @sl
preferred label: Europos Centrinio Banko pirmininkas @lt
definition: President of the European Central Bank.
created: 2024-07-01
preferred label: President van de Europese Centrale Bank @nl
preferred label: Präsident der Europäischen Zentralbank @de
preferred label: Président de la Banque centrale européenne @fr
preferred label: Eiropas Centrālās bankas priekšsēdētājs @lv
preferred label: Presidente del Banco Central Europeo @es
preferred label: Prezes Europejskiego Banku Centralnego @pl

Parliamentary committee for opinion on legal basis
type: ParticipationRole
preferred label: Parlamento nuomonės dėl teisinio pagrindo komitetas @lt
definition: Parliamentary committee giving an opinion on the legal basis in a procedure.
preferred label: Parlamentarni odbor za mnenje o pravni podlagi @sl
preferred label: Κοινοβουλευτική επιτροπή για γνωμοδότηση σχετικά με τη νομική βάση @el
created: 2025-06-30
preferred label: Comisión parlamentaria de opinión sobre la base jurídica @es
preferred label: Parlementaire commissie voor advies over rechtsgrondslag @nl
preferred label: Parlamenta komiteja atzinuma sniegšanai par juridisko pamatu @lv
preferred label: Commission parlementaire pour avis sur base juridique @fr
preferred label: A jogalappal kapcsolatos véleményezésre létrehozott parlamenti bizottság @hu
preferred label: Parlamendikomisjon arvamuse saamiseks õigusliku aluse kohta @et
type: Concept
preferred label: Kumitat Parlamentari għal opinjoni dwar il-bażi legali @mt
preferred label: Oikeusperustaa käsittelevä parlamentin lausuntovaliokunta @fi
preferred label: Comisia parlamentară pentru aviz privind temeiul juridic @ro
preferred label: Парламентарна комисия за становище относно правното основание @bg
preferred label: Parlamentarischer Ausschuss zur Stellungnahme auf der Rechtsgrundlage @de
preferred label: Comissão parlamentar para parecer sobre a base jurídica @pt
preferred label: Parlamentsudvalg til udtalelse om retsgrundlaget @da
preferred label: Parlamentsutskott för yttrande över den rättsliga grunden @sv
in scheme: EP taxonomy on roles.
broader: Parliamentary committee for opinion
preferred label: Parlamentarna komisja opiniodawcza ds. podstawy prawnej @pl
deprecated: false
preferred label: An Coiste Parlaiminteach um Thuairimí ar an mBunús Dlí @ga
preferred label: Commissione parlamentare per parere sulla base giuridica @it
preferred label: Parlamentní výbor pro stanovisko k právnímu základu @cs
preferred label: Parlamentarni odbor za mišljenje na pravnoj osnovi @hr
preferred label: Parlamentný výbor pre stanovisko k právnemu základu @sk

President of the Court of Justice
type: Concept
preferred label: Ordföranden för domstolen @sv
preferred label: Președintele Curții de Justiție @ro
preferred label: Il-President tal-Qorti tal-Ġustizzja @mt
alternative label: Tiesas priekšsēdētāja @lv
preferred label: Predsjednik Suda @hr
preferred label: A Bíróság elnöke @hu
preferred label: Председател на Съда @bg
preferred label: President van het Hof van Justitie @nl
alternative label: Predsjednica Suda @hr
deprecated: false
alternative label: Předsedkyně Soudního dvora @cs
alternative label: Präsidentin des Gerichtshofs @de
preferred label: Euroopa Kohtu president @et
alternative label: Presidenta del Tribunal de Justicia @es
alternative label: Présidente de la Cour de justice @fr
preferred label: Uachtarán na Cúirte Breithiúnais @ga
preferred label: Presidente della Corte di giustizia @it
alternative label: Teisingumo Teismo pirmininkė @lt
preferred label: Presidente del Tribunal de Justicia @es
preferred label: Prezes Trybunału Sprawiedliwości @pl
preferred label: Predsednik Sodišča @sl
preferred label: Präsident des Gerichtshofs @de
preferred label: Presidente do Tribunal de Justiça @pt
preferred label: Předseda Soudního dvora @cs
preferred label: Predseda Súdneho dvora @sk
preferred label: Teisingumos Teismo pirmininkas @lt
definition: President of the European Court of Justice.
preferred label: Tiesas priekšsēdētājs @lv
alternative label: Președinta Curții de Justiție @ro
alternative label: Predsedníčka Súdneho dvora @sk
preferred label: Unionin tuomioistuimen presidentti @fi
broader: Председател
preferred label: Président de la Cour de justice @fr
alternative label: Predsednica Sodišča @sl
in scheme: EP taxonomy on roles.
preferred label: Πρόεδρος του Δικαστηρίου @el
preferred label: Domstolens præsident @da
created: 2023-10-31

Deputy Chair
type: Role
in scheme: EP taxonomy on roles.
preferred label: Næstformand @da
deprecated: false
preferred label: Presidente delegado @pt
preferred label: Zamjenik predsjednika @hr
preferred label: Leas-Chathaoirleach @ga
alternative label: Presidente delegada @es
alternative label: Stellvertretende Vorsitzende @de
alternative label: Priekšsēdētāja vietniece @lv
broader: Chairman
type: Concept
preferred label: Делегиран председател @bg
definition: Deputy chair is a person elected to act as chair in the absence of the appointed chair.
preferred label: Apulaispuheenjohtaja @fi
alternative label: Présidente déléguée @fr
preferred label: Priekšsēdētāja vietnieks @lv
preferred label: Zastępca przewodniczącego @pl
alternative label: Președintă delegată @ro
alternative label: Zamjenica predsjednika @hr
alternative label: Pirmininko pavaduotoja @lt
preferred label: Vicepresidente @it
alternative label: Zastupujúca predsedníčka @sk
preferred label: Ondervoorzitter @nl
preferred label: Αναπληρωτής Πρόεδρος @el
preferred label: Président délégué @fr
preferred label: Místopředseda @cs
preferred label: Președinte delegat @ro
preferred label: Deputat President @mt
preferred label: Ställföreträdande ordförande @sv
alternative label: Αναπληρώτρια Πρόεδρος @el
preferred label: Namestnik predsednika @sl
alternative label: Namestnica predsednika @sl
preferred label: Zastupujúci predseda @sk
alternative label: Místopředsedkyně @cs
preferred label: Aseesimees @et
created: 2023-10-31
preferred label: Pirmininko pavaduotojas @lt
preferred label: Elnökhelyettes @hu
preferred label: Stellvertretender Vorsitzender @de

Author of opinion
type: Concept
preferred label: Författare till yttrande @sv
alternative label: Autorka stanoviska @cs
preferred label: Autor mišljenja @hr
preferred label: Autor opinii @pl
alternative label: Autorin der Stellungnahme @de
alternative label: Auteure de l’avis @fr
preferred label: Autore del parere @it
alternative label: Συντάκτρια γνώμης @el
preferred label: Arvamuse autor @et
alternative label: Nuomonės autorė @lt
preferred label: Nuomonės autorius @lt
alternative label: Autorica mišljenja @hr
preferred label: Autor do parecer @pt
preferred label: Autor stanoviska @cs
in scheme: EP taxonomy on roles.
preferred label: Συντάκτης γνώμης @el
preferred label: Awtur tal-opinjoni @mt
alternative label: Autoare aviz @ro
alternative label: Avtorica mnenja @sl
preferred label: Autor del dictamen @es
preferred label: Véleményező @hu
preferred label: Lausunnon antaja @fi
preferred label: Auteur de l’avis @fr
preferred label: Autor aviz @ro
alternative label: Autora do parecer @pt
definition: Entity creating an opinion.
preferred label: Auteur van het advies @nl
alternative label: Autrice de l’avis @fr
preferred label: Autor der Stellungnahme @de
alternative label: Autrice del parere @it
broader: Author
preferred label: Údar na tuairime @ga
alternative label: Atzinuma autore @lv
alternative label: Autora del dictamen @es
preferred label: Avtor mnenja @sl
preferred label: Forfatter af udtalelse @da
alternative label: Autorka opinii @pl
deprecated: false
preferred label: Atzinuma autors @lv
preferred label: Автор на становището @bg
created: 2023-10-31

Author
type: ParticipationRole
definition: A person or an entity creating a document.
preferred label: Awtur @mt
alternative label: Autorica @hr
preferred label: Författare @sv
preferred label: Autorius @lt
preferred label: Údar @ga
alternative label: Autorė @lt
preferred label: Auteur @fr
alternative label: Auteure @fr
preferred label: Laatija @fi
alternative label: Verfasserin @de
preferred label: Verfasser @de
preferred label: Autore @it
preferred label: Συγγραφέας @el
alternative label: Avtorica @sl
created: 2023-10-31
alternative label: Autrice @fr
alternative label: Συντάκτης @el
type: Concept
preferred label: Autors @lv
preferred label: Avtor @sl
preferred label: Автор @bg
in scheme: EP taxonomy on roles.
alternative label: Autoare @ro
top concept of: EP taxonomy on roles.
alternative label: Autora @pt
preferred label: Forfatter @da
alternative label: Autorka @pl
preferred label: Autor @pl
deprecated: false
preferred label: Szerző @hu

Parliamentary committee for opinion on human rights matters
type: ParticipationRole
broader: Parliamentary committee for opinion
preferred label: Commissione parlamentare per il parere sulle questioni relative ai diritti umani @it
preferred label: Parlamento nuomonės žmogaus teisių klausimais komitetas @lt
preferred label: Parlamentarisk udvalg til udtalelse om menneskerettighedsspørgsmål @da
deprecated: false
preferred label: Parlamentin ihmisoikeusasioita käsittelevä lausuntovaliokunta @fi
in scheme: EP taxonomy on roles.
preferred label: Parlamentarni odbor za mišljenje o pitanjima ljudskih prava @hr
preferred label: Парламентарна комисия за становище по въпросите на правата на човека @bg
preferred label: Inimõiguste küsimustega tegelev parlamendikomisjon @et
preferred label: Parlamentný výbor pre stanovisko k otázkam ľudských práv @sk
preferred label: Comisia parlamentară pentru aviz privind drepturile omului @ro
preferred label: Parlamentarni odbor za mnenje o zadevah v zvezi s človekovimi pravicami @sl
preferred label: Comissão parlamentar de parecer sobre questões de direitos humanos @pt
definition: Parliamentary committee giving an opinion on human rights matters in a procedure.
preferred label: Parlamentarna komisja opiniodawcza ds. praw człowieka @pl
preferred label: Parlamenta komiteja atzinumam par cilvēktiesību jautājumiem @lv
preferred label: Comisión parlamentaria de opinión sobre cuestiones de derechos humanos @es
preferred label: Parlamentarischer Ausschuss für die Stellungnahme zu Menschenrechtsfragen @de
preferred label: Parlementaire commissie voor advies over mensenrechtenkwesties @nl
preferred label: Parlamentsutskott för yttrande i människorättsfrågor @sv
type: Concept
preferred label: Κοινοβουλευτική επιτροπή για θέματα ανθρωπίνων δικαιωμάτων @el
preferred label: An coiste parlaiminteach don tuairim maidir le hábhair a bhaineann le cearta an duine @ga
preferred label: Kumitat Parlamentari għal opinjoni dwar kwistjonijiet tad-drittijiet tal-bniedem @mt
preferred label: Parlamentní výbor pro stanovisko k otázkám lidských práv @cs
preferred label: Emberi jogi kérdésekben véleményt nyilvánító parlamenti bizottság @hu
created: 2025-06-30
preferred label: Commission parlementaire pour avis sur les questions relatives aux droits de l'homme @fr

Member participating in an official delegation
type: Concept
created: 2025-05-31
preferred label: Członek uczestniczący w oficjalnej delegacji @pl
preferred label: Comhalta atá rannpháirteach i dtoscaireacht oifigiúil @ga
preferred label: Membre participant à une délégation officielle @fr
preferred label: Membru li jipparteċipa f’delegazzjoni uffiċjali @mt
preferred label: Membro che partecipa a una delegazione ufficiale @it
preferred label: Hivatalos küldöttségben részt vevő képviselő @hu
preferred label: Μέλος που συμμετέχει σε επίσημη αντιπροσωπεία @el
definition: Member participating in an official delegation.
deprecated: false
preferred label: Mitglied, das an einer offiziellen Delegation teilnimmt @de
broader: Member
preferred label: Ametlikus delegatsioonis osalev liige @et
preferred label: Membro que participa numa delegação oficial @pt
preferred label: Oficialioje delegacijoje dalyvaujantis narys @lt
preferred label: Viralliseen valtuuskuntaan osallistuva jäsen @fi
preferred label: Membru care participă la o delegație oficială @ro
preferred label: Član koji sudjeluje u službenom izaslanstvu @hr
in scheme: EP taxonomy on roles.
preferred label: Член на ЕП, участващ в официална делегация @bg
preferred label: Lid dat deelneemt aan een officiële delegatie @nl
preferred label: Deputāts, kas piedalās oficiālā delegācijā @lv
preferred label: Medlem, der deltager i en officiel delegation @da
preferred label: Člen účastnící se oficiální delegace @cs
preferred label: Ledamot som deltar i en officiell delegation @sv
preferred label: Poslanec zúčastňujúci sa na oficiálnej delegácii @sk
preferred label: Miembro que participa en una delegación oficial @es
preferred label: Član, ki sodeluje v uradni delegaciji @sl
type: CapacityRole

Parliamentary delegation vice-chair
type: CapacityRole
broader: Chairman
preferred label: Vicepreședintele delegației parlamentare @ro
preferred label: A parlamenti küldöttség alelnöke @hu
preferred label: Místopředseda parlamentní delegace @cs
definition: The delegation vice-chair replaces the delegation chair when absent.
preferred label: podpredsednik parlamentarne delegacije @sl
preferred label: Vice-président de la délégation parlementaire @fr
preferred label: Parlamenta delegācijas priekšsēdētāja vietnieks @lv
preferred label: Potpredsjednik parlamentarnog izaslanstva @hr
preferred label: Αντιπρόεδρος της κοινοβουλευτικής αντιπροσωπείας @el
preferred label: Leas-Chathaoirleach toscaireachta parlaimintí @ga
preferred label: Vicepresidente de la delegación parlamentaria @es
preferred label: Vice-presidente da delegação parlamentar @pt
in scheme: EP taxonomy on roles.
preferred label: Parlamentin valtuuskunnan varapuheenjohtaja @fi
preferred label: Vice ordförande för parlamentsdelegationen @sv
preferred label: Podpredseda parlamentnej delegácie @sk
preferred label: Parlamento delegacijos pirmininko pavaduotojas @lt
deprecated: false
preferred label: Ondervoorzitter parlementaire delegatie @nl
preferred label: Wiceprzewodniczący delegacji parlamentarnej @pl
preferred label: Næstformand for den parlamentariske delegation @da
preferred label: Vicepresidente della delegazione parlamentare @it
preferred label: Viċi President tad-delegazzjoni parlamentari @mt
created: 2025-03-31
preferred label: Заместник-председател на парламентарната делегация @bg
preferred label: Parlamendi delegatsiooni aseesimees @et
preferred label: Stellvertretender Vorsitzender der parlamentarischen Delegation @de
type: Concept

Addressee for formal act
type: Concept
preferred label: Õigusakti adressaat @et
preferred label: Adresát pro formální akt @cs
in scheme: EP taxonomy on roles.
preferred label: Adresāts (oficiālai rīcībai) @lv
preferred label: Адресат на официалния акт @bg
preferred label: A formához kötött jogi aktus címzettje @hu
definition: Entity to whom a formal act is addressed.
preferred label: Seolaí do ghníomh foirmiúil @ga
preferred label: Destinatario di atto ufficiale @it
preferred label: Modtager af formel retsakt @da
preferred label: Destinataire pour acte formel @fr
preferred label: Primatelj službenog akta @hr
preferred label: Adressat des Rechtsakts @de
preferred label: Ontvanger voor aanneming @nl
preferred label: Destinatarju tal-att formali @mt
preferred label: Kenelle säädös on osoitettu @fi
preferred label: Adresát formálneho aktu @sk
alternative label: Naslovnica uradnega akta @sl
broader: Addressee
preferred label: Destinatário do ato formal @pt
deprecated: false
preferred label: Destinatar pentru act oficial @ro
preferred label: Adressat för rättsakt @sv
alternative label: Adressatin des Rechtsakts @de
preferred label: Przesłany w celu przyjęcia aktu @pl
preferred label: Destinatario para acto formal @es
preferred label: Αποδέκτης τυπικής πράξης @el
preferred label: Naslovnik uradnega akta @sl
preferred label: Oficialaus akto adresatas @lt
created: 2023-10-31

Addressee
type: Concept
preferred label: Ontvanger @nl
alternative label: Adressatin @de
created: 2023-10-31
preferred label: Seolaí @ga
preferred label: Kenelle osoitettu @fi
in scheme: EP taxonomy on roles.
preferred label: Címzett @hu
preferred label: Destinataire @fr
preferred label: Naslovnik @sl
deprecated: false
preferred label: Modtager @da
preferred label: Adresāts @lv
preferred label: Adresat @hr
preferred label: Destinatar @ro
preferred label: Adressaat @et
preferred label: Adressat @sv
preferred label: Adresát @cs
preferred label: Destinatário @pt
type: ParticipationRole
preferred label: Adresatas @lt
top concept of: EP taxonomy on roles.
definition: Entity to whom something is addressed.
preferred label: Destinatario @es
preferred label: Адресат @bg
preferred label: Αποδέκτης @el
alternative label: Naslovnica @sl
preferred label: Destinatarju @mt

Parliamentary delegation chair
type: Concept
preferred label: Przewodniczący delegacji parlamentarnej @pl
broader: Chairman
preferred label: President tad-delegazzjoni parlamentari @mt
preferred label: Formand for den parlamentariske delegation @da
preferred label: Vorsitz der parlamentarischen Delegation @de
preferred label: Parlamento delegacijos pirmininkas @lt
preferred label: Predsjednik parlamentarnog izaslanstva @hr
preferred label: Președintele delegației parlamentare @ro
type: CapacityRole
preferred label: Presidente da delegação parlamentar @pt
preferred label: Président de la délégation parlementaire @fr
preferred label: Presidente della delegazione parlamentare @it
in scheme: EP taxonomy on roles.
preferred label: A parlamenti küldöttség elnöke @hu
preferred label: Presidente de la delegación parlamentaria @es
preferred label: Πρόεδρος κοινοβουλευτικής αντιπροσωπείας @el
preferred label: Voorzitter parlementaire delegatie @nl
created: 2025-03-31
deprecated: false
preferred label: Předseda parlamentní delegace @cs
preferred label: Председател на парламентарната делегация @bg
preferred label: Parlamendi delegatsiooni juht @et
preferred label: Parlamenta delegācijas priekšsēdētājs @lv
preferred label: Predseda parlamentnej delegácie @sk
preferred label: Predsednik parlamentarne delegacije @sl
definition: The chair of a parliamentary delegation is the person who presides over a parliamentary delegation.
preferred label: Parlamentin valtuuskunnan puheenjohtaja @fi
preferred label: Cathaoirleach na toscaireachta parlaimintí @ga
preferred label: Ordförande för parlamentsdelegationen @sv

Deputy Treasurer
type: Role
preferred label: Plaatsvervangend penningmeester @nl
alternative label: Kasiera vietniece @lv
alternative label: Iždininko pavaduotoja @lt
preferred label: Stedfortrædende kasserer @da
preferred label: Zastępca skarbnika @pl
preferred label: Leas-Chisteoir @ga
alternative label: Stellvertretende Schatzmeisterin @de
alternative label: Αναπληρώτρια Ταμία @el
alternative label: Namestnica zakladnik @sl
preferred label: Trezorier adjunct @ro
preferred label: Заместник-ковчежник @bg
preferred label: Apulaistaloudenhoitaja @fi
preferred label: Kincstárnokhelyettes @hu
preferred label: Asevarahoidja @et
created: 2023-10-31
preferred label: Tesoriere aggiunto @it
preferred label: Zástupce pokladníka @cs
alternative label: Deputat Teżoriera @mt
in scheme: EP taxonomy on roles.
alternative label: Zástupkyňa pokladníka @sk
broader: Treasurer
deprecated: false
preferred label: Kasiera vietnieks @lv
preferred label: Deputat Teżorier @mt
preferred label: Zamjenik rizničara @hr
definition: A deputy treasurer manages the finances of a group in the absence of the appointed treasurer.
type: Concept
preferred label: Biträdande kassör @sv
preferred label: Zástupca pokladníka @sk
preferred label: Namestnik zakladnika @sl
alternative label: Trésorière adjointe @fr
alternative label: Tesoureira adjunta @pt
preferred label: Tesoureiro adjunto @pt
preferred label: Tesorero adjunto @es
preferred label: Αναπληρωτής Ταμίας @el
alternative label: Zástupkyně pokladníka @cs
alternative label: Zamjenica rizničara @hr
preferred label: Trésorier adjoint @fr
alternative label: Tesorera adjunta @es
preferred label: Iždininko pavaduotojas @lt
preferred label: Stellvertretender Schatzmeister @de

President of the European Commission
type: Concept
preferred label: Uachtarán an Choimisiúin Eorpaigh @ga
alternative label: Președintele Comisiei @ro
alternative label: Présidente de la Commission @fr
alternative label: Presidenta de la Comisión Europea @es
preferred label: Predseda Európskej komisie @sk
alternative label: Președinta Comisiei @ro
alternative label: President of the Commission
alternative label: Predsednica Komisije @sl
preferred label: Voorzitter van de Europese Commissie @nl
alternative label: Předseda Komise @cs
alternative label: Komisijas priekšsēdētāja @lv
preferred label: Euroopa Komisjoni president @et
alternative label: Předsedkyně Komise @cs
preferred label: Predsednik Evropske komisije @sl
preferred label: Πρόεδρος της Ευρωπαϊκής Επιτροπής @el
alternative label: Presidenta de la Comisión @es
alternative label: Präsident der Kommission @de
alternative label: Presidente della Commissione @it
alternative label: Președintă a Comisiei Europene @ro
alternative label: Predsjednica Komisije @hr
alternative label: Předsedkyně Evropské komise @cs
preferred label: Presidente della Commissione europea @it
preferred label: Președintele Comisiei Europene @ro
preferred label: Председател на Европейската комисия @bg
preferred label: Europeiska kommissionens ordförande @sv
broader: Председател
alternative label: Il-President tal-Kummissjoni @mt
definition: President of the European Commission.
preferred label: Il-President tal-Kummissjoni Ewropea @mt
alternative label: Komission puheenjohtaja @fi
alternative label: Predsednica Evropske komisije @sl
preferred label: Präsident der Europäischen Kommission @de
preferred label: Europa-Kommissionens formand @da
alternative label: Uachtarán an Choimisiúin @ga
alternative label: Präsidentin der Europäischen Kommission @de
preferred label: Předseda Evropské komise @cs
alternative label: Komisijas priekšsēdētājs @lv
alternative label: Presidente da Comissão @pt
preferred label: Presidente de la Comisión Europea @es
preferred label: Président de la Commission européenne @fr
alternative label: Komisijos pirmininkas @lt
alternative label: Председател на Комисията @bg
preferred label: Predsjednik Europske komisije @hr
alternative label: Presidente de la Comisión @es
alternative label: Präsidentin der Kommission @de
alternative label: Predsednik Komisije @sl
alternative label: Kommissionens ordförande @sv
deprecated: false
alternative label: Przewodnicząca Komisji Europejskiej @pl
preferred label: Euroopan komission puheenjohtaja @fi
preferred label: Presidente da Comissão Europeia @pt
alternative label: Présidente de la Commission européenne @fr
alternative label: Przewodniczący Komisji @pl
preferred label: Przewodniczący Komisji Europejskiej @pl
created: 2023-10-31
alternative label: Πρόεδρος της Επιτροπής @el
preferred label: Az Európai Bizottság elnöke @hu
preferred label: Europos Komisijos pirmininkas @lt
alternative label: Komisijos pirmininkė @lt
alternative label: Formand for Kommissionen @da
alternative label: Predseda Komisie @sk
alternative label: Voorzitter van de Commissie @nl
preferred label: Eiropas Komisijas priekšsēdētājs @lv
alternative label: Eiropas Komisijas priekšsēdētāja @lv
alternative label: Europos Komisijos pirmininkė @lt
alternative label: Predsedníčka Európskej komisie @sk
alternative label: Predsjednica Europske komisije @hr
alternative label: Président de la Commission @fr
alternative label: Predsjednik Komisije @hr
alternative label: Predsedníčka Komisie @sk
alternative label: A Bizottság elnöke @hu
alternative label: Komisjoni president @et
alternative label: Przewodnicząca Komisji @pl
in scheme: EP taxonomy on roles.

Vice-President
type: Concept
preferred label: Podpredseda @sk
alternative label: Vizepräsidentin @de
alternative label: Wiceprzewodnicząca @pl
preferred label: Vicevoorzitter @nl
alternative label: Vice talman @sv
alternative label: Vice-présidente @fr
alternative label: Vicepresidenta @es
alternative label: Podpredsednica @sl
preferred label: Viċi President @mt
alternative label: Podpredsedníčka @sk
preferred label: Wiceprzewodniczący @pl
alternative label: Pirmininko pavaduotoja @lt
preferred label: Vice-presidente @pt
preferred label: Priekšsēdētāja vietnieks @lv
alternative label: Potpredsjednica @hr
preferred label: Vice ordförande @sv
preferred label: Vizepräsident @de
preferred label: Næstformand @da
definition: A vice-president is someone who replaces the president when absent.
preferred label: Potpredsjednik @hr
preferred label: Заместник-председател @bg
deprecated: false
alternative label: Ondervoorzitter @nl
preferred label: Leas-Uachtarán @ga
preferred label: Pirmininko pavaduotojas @lt
in scheme: EP taxonomy on roles.
preferred label: Varapuheenjohtaja @fi
preferred label: Podpredsednik @sl
preferred label: Vice-président @fr
preferred label: Asepresident @et
alternative label: Priekšsēdētāja vietniece @lv
alternative label: Vicepreședintă @ro
preferred label: Αντιπρόεδρος @el
created: 2023-10-31
alternative label: Místopředsedkyně @cs
type: CapacityRole
alternative label: Varapuhemies @fi
preferred label: Vicepreședinte @ro
preferred label: Alelnök @hu
broader: Председател
type: Role
preferred label: Místopředseda @cs
preferred label: Vicepresidente @es

First Vice-President
type: Concept
preferred label: Förste vice ordförande @sv
deprecated: false
preferred label: Primeiro vice-presidente @pt
alternative label: Prvá podpredsedníčka @sk
alternative label: Erste Vizepräsidentin @de
alternative label: Première vice-présidente @fr
alternative label: První místopředsedkyně @cs
preferred label: Prvi podpredsednik @sl
preferred label: Πρώτος αντιπρόεδρος @el
alternative label: Primeira vice-presidente @pt
alternative label: Prim-vicepreședintă @ro
preferred label: Primo vicepresidente @it
alternative label: Prva potpredsjednica @hr
preferred label: L-Ewwel Viċi President @mt
definition: A first vice-president takes on the main role in the absence of a president.
preferred label: Erster Vizepräsident @de
preferred label: Esimene asepresident @et
alternative label: Pirmoji pirmininko pavaduotoja @lt
preferred label: Pierwszy wiceprzewodniczący @pl
in scheme: EP taxonomy on roles.
alternative label: Priekšsēdētāja pirmā vietniece @lv
alternative label: Prima vicepresidente @it
preferred label: Premier vice-président @fr
alternative label: Vicepresidenta primera @es
preferred label: Prvi potpredsjednik @hr
preferred label: První místopředseda @cs
preferred label: Prim-vicepreședinte @ro
preferred label: Priekšsēdētāja pirmais vietnieks @lv
alternative label: Prva podpredsednica @sl
preferred label: Pirmasis pirmininko pavaduotojas @lt
preferred label: Ensimmäinen varapuheenjohtaja @fi
created: 2023-10-31
preferred label: Vicepresidente primero @es
preferred label: Prvý podpredseda @sk
alternative label: Πρώτη αντιπρόεδρος @el
preferred label: Eerste vicevoorzitter @nl
preferred label: Első alelnök @hu
alternative label: Pierwsza wiceprzewodnicząca @pl
preferred label: Første næstformand @da
preferred label: An chéad Leas-Uachtarán @ga
preferred label: Първи заместник-председател @bg
broader: Председател

Parliamentary delegation member
type: Concept
definition: Member of a parliamentary delegation.
alternative label: Parlamenti küldöttség résztvevője @hu
preferred label: Mitglied der parlamentarischen Delegation @de
alternative label: Sudionik u parlamentarnom izaslanstvu @hr
alternative label: Udeleženec parlamentarne delegacije @sl
alternative label: Účastník parlamentnej delegácie @sk
alternative label: Participant à la délégation parlementaire @fr
alternative label: Participante da delegação parlamentar @pt
alternative label: Parliamentary delegation participant
alternative label: Parlamentin valtuuskunnan osallistuja @fi
preferred label: Parlamentinės delegacijos narys @lt
in scheme: EP taxonomy on roles.
preferred label: Membre de la délégation parlementaire @fr
alternative label: Deltagare i den parlamentariska delegationen @sv
preferred label: Ledamot av den parlamentariska delegationen @sv
alternative label: Rannpháirtí toscaireachta parlaimintí @ga
broader: Member
preferred label: Član parlamentarnog izaslanstva @hr
alternative label: Teilnehmer der parlamentarischen Delegation @de
preferred label: Medlem af den parlamentariske delegation @da
alternative label: Participante en la delegación parlamentaria @es
alternative label: Parteċipant tad-delegazzjoni parlamentari @mt
preferred label: Parlamenta delegācijas loceklis @lv
preferred label: membru al delegației parlamentare @ro
alternative label: Parlamento delegacijos narys @lt
preferred label: A parlamenti küldöttség tagja @hu
alternative label: Συμμετέχων κοινοβουλευτικής αντιπροσωπείας @el
preferred label: Člen parlamentní delegace @cs
alternative label: Deltager i den parlamentariske delegation @da
preferred label: Μέλος κοινοβουλευτικής αντιπροσωπείας @el
preferred label: Comhalta de thoscaireacht pharlaiminteach @ga
preferred label: Parlamendi delegatsiooni liige @et
preferred label: Parlamentin valtuuskunnan jäsen @fi
alternative label: Partecipante alla delegazione parlamentare @it
preferred label: Член на парламентарната делегация @bg
alternative label: Parlamenta delegācijas dalībnieks @lv
preferred label: Członek delegacji parlamentarnej @pl
alternative label: Участник в парламентарната делегация @bg
preferred label: Člen parlamentnej delegácie @sk
preferred label: član parlamentarne delegacije @sl
alternative label: Uczestnik delegacji parlamentarnej @pl
created: 2025-03-31
preferred label: Membro da delegação parlamentar @pt
alternative label: Deelnemer aan de parlementaire delegatie @nl
preferred label: Membro della delegazione parlamentare @it
deprecated: false
preferred label: Membru tad-delegazzjoni parlamentari @mt
preferred label: Lid parlementaire delegatie @nl
alternative label: participant la delegația parlamentară @ro
preferred label: Miembro de la delegación parlamentaria @es
alternative label: Účastník parlamentní delegace @cs

President of the European Parliament
type: Role
preferred label: Predsednik Evropskega parlamenta @sl
preferred label: Euroopa Parlamendi president @et
preferred label: Председател на Европейския парламент @bg
preferred label: Președintele Parlamentului European @ro
created: 2023-10-31
preferred label: Voorzitter van het Europees Parlement @nl
alternative label: Przewodnicząca Parlamentu Europejskiego @pl
deprecated: false
type: Concept
broader: Председател
preferred label: Président du Parlement européen @fr
alternative label: Europos Parlamento pirmininkė @lt
alternative label: President tal-Parlament Ewropew @mt
alternative label: Presidenta del Parlamento Europeo @es
preferred label: Europos Parlamento pirmininkas @lt
alternative label: Predsednica Evropskega parlamenta @sl
preferred label: Az Európai Parlament elnöke @hu
preferred label: Formand for Europa-Parlamentet @da
preferred label: Eiropas Parlamenta priekšsēdētājs @lv
preferred label: Europaparlamentets talman @sv
preferred label: Predseda Európskeho parlamentu @sk
preferred label: Predsjednik Europskog parlamenta @hr
alternative label: Präsidentin des Europäischen Parlaments @de
alternative label: Eiropas Parlamenta priekšsēdētāja @lv
alternative label: Președinte al Parlamentului European @ro
alternative label: Présidente du Parlement européen @fr
preferred label: Präsident des Europäischen Parlaments @de
definition: The President of the European Parliament presides over the debates and activities of the European Parliament and represents the Parliament within the EU and internationally.
alternative label: Predsedníčka Európskeho parlamentu @sk
preferred label: Presidente del Parlamento Europeo @es
alternative label: Președintă a Parlamentului European @ro
in scheme: EP taxonomy on roles.
preferred label: Presidente do Parlamento Europeu @pt
preferred label: Presidente del Parlamento europeo @it
alternative label: Predsjednica Europskog parlamenta @hr
preferred label: Przewodniczący Parlamentu Europejskiego @pl
preferred label: Il-President tal-Parlament Ewropew @mt
preferred label: Πρόεδρος του Ευρωπαϊκού Κοινοβουλίου @el
preferred label: Předseda Evropského parlamentu @cs
preferred label: Uachtarán Pharlaimint na hEorpa @ga
alternative label: Předsedkyně Evropského parlamentu @cs
preferred label: Euroopan parlamentin puhemies @fi

President of the Committee of the Regions
type: Concept
preferred label: Voorzitter van het Comité van de Regio's @nl
preferred label: Il-President tal-Kumitat tar-Reġjuni @mt
preferred label: A Régiók Bizottsága elnöke @hu
preferred label: Uachtarán Choiste na Réigiún @ga
preferred label: Председател на Комитета на регионите @bg
broader: Председател
preferred label: Président du Comité des régions @fr
preferred label: Presidente do Comité das Regiões @pt
preferred label: Predsjednik Odbora regija @hr
in scheme: EP taxonomy on roles.
alternative label: Președintă a Comitetului Regiunilor @ro
preferred label: Predseda Výboru regiónov @sk
alternative label: Předsedkyně Výboru regionů @cs
preferred label: Președintele Comitetului Regiunilor @ro
preferred label: Regionų komiteto pirmininkas @lt
alternative label: Regionų komiteto pirmininkė @lt
alternative label: Präsidentin des Ausschusses der Regionen @de
created: 2023-10-31
definition: President of the committee of the regions.
alternative label: Predsedníčka Výboru regiónov @sk
alternative label: Reģionu komitejas priekšsēdētāja @lv
preferred label: Przewodniczący Komitetu Regionów @pl
alternative label: Przewodnicząca Komitetu Regionów @pl
preferred label: Predsednik Odbora regij @sl
preferred label: Regioonide Komitee president @et
alternative label: Présidente du Comité des régions @fr
alternative label: Predsjednica Odbora regija @hr
preferred label: Presidente del Comitato delle regioni @it
preferred label: Πρόεδρος της Επιτροπής των Περιφερειών @el
preferred label: Předseda Výboru regionů @cs
preferred label: Alueiden komitean puheenjohtaja @fi
preferred label: Presidente del Comité de las Regiones @es
preferred label: Formand for Regionsudvalget @da
preferred label: Präsident des Ausschusses der Regionen @de
preferred label: Reģionu komitejas priekšsēdētājs @lv
alternative label: Presidenta del Comité de las Regiones @es
alternative label: Predsednica Odbora regij @sl
preferred label: Regionkommitténs ordförande @sv
deprecated: false

Shadow rapporteur for opinion
type: Concept
preferred label: Raportor alternativ pentru aviz @ro
preferred label: Schaduwrapporteur voor advies @nl
preferred label: Докладчик в сянка по становище @bg
preferred label: Ēnu referents atzinumam @lv
preferred label: Skyggeordfører for udtalelsen @da
preferred label: A vélemény árnyékelőadója @hu
definition: A shadow rapporteur is a MEP who monitors the legislative process and finds compromise with the work of the rapporteur on behalf of a political group to elaborate an opinion.
preferred label: Šešėlinis nuomonės referentas @lt
preferred label: Izvjestitelj u sjeni za mišljenje @hr
deprecated: false
preferred label: Rapporteur fictif pour avis @fr
preferred label: Shadow rapporteur għal opinjoni @mt
preferred label: Tieňový spravodajca výboru požiadaného o stanovisko @sk
broader: Shadow rapporteur
preferred label: Variraportöör arvamuse koostamiseks @et
type: CapacityRole
preferred label: Schattenberichterstatter für die Stellungnahme @de
preferred label: Relatore ombra per parere @it
preferred label: Σκιώδης εισηγητής γνωμοδότησης @el
preferred label: Scáthrapóirtéir don tuairim @ga
preferred label: Relator-sombra de parecer @pt
broad match: RAPP SHADOW
in scheme: EP taxonomy on roles.
preferred label: Skuggföredragande för yttrande @sv
preferred label: Kontrsprawozdawca komisji opiniodawczej @pl
preferred label: Varjoesittelijä @fi
preferred label: Stínová zpravodajka @cs
created: 2025-03-31
broader: Rapporteur
preferred label: Pripravljavec mnenja v senci @sl
preferred label: Ponente alternativo de opinión @es

Shadow rapporteur
type: Concept
alternative label: Kontrsprawozdawczyni @pl
preferred label: Relator-sombra @pt
preferred label: Raportor din umbră @ro
alternative label: Šešėlinė pranešėja @lt
preferred label: Skyggeordfører @da
preferred label: Schaduwrapporteur @nl
alternative label: Poročevalka v senci @sl
alternative label: Ēnu referente @lv
preferred label: Scáth-rapóirtéir @ga
preferred label: Schattenberichterstatter @de
alternative label: Schattenberichterstatterin @de
deprecated: false
in scheme: EP taxonomy on roles.
alternative label: Raportoare din umbră @ro
alternative label: Stínová Zpravodajka @cs
created: 2023-10-31
preferred label: Variraportöör @et
preferred label: Ēnu referents @lv
alternative label: Σκιώδης εισηγήτρια @el
preferred label: Relatore ombra @it
preferred label: Stínový zpravodaj @cs
preferred label: Σκιώδης εισηγητής @el
preferred label: Kontrsprawozdawca @pl
preferred label: Tieňový spravodajca @sk
alternative label: Relatora-sombra @pt
preferred label: šešėlinis pranešėjas @lt
alternative label: Izvjestiteljica u sjeni @hr
preferred label: Skuggföredragande @sv
preferred label: Varjoesittelijä @fi
preferred label: Poročevalec v senci @sl
alternative label: Rapporteure fictive @fr
definition: A shadow rapporteur is a MEP who monitors the legislative process and finds compromise with the work of the rapporteur on behalf of a political group.
preferred label: Izvjestitelj u sjeni @hr
preferred label: Árnyékelőadó @hu
broader: Rapporteur
preferred label: Rapporteur secondaire @fr
alternative label: Tieňová spravodajkyňa @sk
type: ParticipationRole
preferred label: Ponente alternativo @es
preferred label: Докладчик в сянка @bg
alternative label: Relatrice ombra @it

Member of the Bureau
type: Concept
broader: Member
alternative label: Članica Predsjedništva @hr
alternative label: Členka předsednictva @cs
preferred label: Medlem af bestyrelsen @da
alternative label: Membră a Biroului @ro
preferred label: Član predsedstva @sl
alternative label: Členka predsedníctva @sk
preferred label: Membru tal-bureau @mt
preferred label: Membro da Mesa @pt
preferred label: Członek prezydium @pl
preferred label: Člen predsedníctva @sk
deprecated: false
preferred label: Az elnökség tagja @hu
preferred label: Juhatuse liige @et
preferred label: Član Predsjedništva @hr
alternative label: Biuro narė @lt
preferred label: Mitglied des Vorstands @de
preferred label: Prezidija loceklis @lv
created: 2023-10-31
preferred label: Biuro narys @lt
preferred label: Membru al Biroului @ro
type: Role
preferred label: Член на бюрото @bg
alternative label: Członkini prezydium @pl
preferred label: Člen předsednictva @cs
alternative label: Članica predsedstva @sl
preferred label: Miembro de la Mesa @es
preferred label: Ledamot av presidiet @sv
alternative label: Prezidija locekle @lv
preferred label: Lid van het bureau @nl
preferred label: Membre du bureau @fr
preferred label: Työvaliokunnan jäsen @fi
preferred label: Μέλος του προεδρείου @el
definition: Member of the Bureau of the European Parliament.
preferred label: Membro dell’ufficio di presidenza @it
preferred label: Comhalta an bhiúró @ga
in scheme: EP taxonomy on roles.

High Representative of the Union
type: Concept
alternative label: Ύπατη Εκπρόσωπος της Ένωσης @el
preferred label: Az Unió főképviselője @hu
created: 2023-10-31
alternative label: Hohe Vertreterin der Union @de
preferred label: Liidu kõrge esindaja @et
preferred label: Înaltul Reprezentant al Uniunii @ro
alternative label: Vysoká predstaviteľka @sk
preferred label: Unionens höga representant @sv
preferred label: Unionin korkea edustaja @fi
alternative label: Alta Representante da União @pt
preferred label: Visoki predstavnik Unije @hr
in scheme: EP taxonomy on roles.
preferred label: Ύπατος Εκπρόσωπος της Ένωσης @el
preferred label: Hoher Vertreter der Union @de
preferred label: Savienības augstais pārstāvis @lv
definition: The High Representative is charged with coordinating and carrying out the EU's foreign and security policy.
preferred label: Върховен представител на Съюза @bg
preferred label: Vysoký představitel Unie @cs
preferred label: Sąjungos vyriausiasis įgaliotinis @lt
preferred label: Wysoki przedstawiciel Unii @pl
alternative label: Haute représentante de l’Union @fr
preferred label: Hoge vertegenwoordiger van de Unie @nl
preferred label: Alto rappresentante dell’Unione @it
alternative label: Alta representante de la Unión @es
alternative label: Savienības augstā pārstāve @lv
alternative label: Sąjungos vyriausioji įgaliotinė @lt
deprecated: false
alternative label: Înalta Reprezentantă a Uniunii @ro
preferred label: Ardionadaí an Aontais @ga
alternative label: Wysoka przedstawiciel Unii @pl
preferred label: Haut représentant de l’Union @fr
preferred label: Ir-Rappreżentant Għoli tal-Unjoni @mt
broader: Representative
alternative label: Vysoká představitelka Unie @cs
preferred label: Alto Representante da União @pt
preferred label: Alto representante de la Unión @es
alternative label: Visoka predstavnica Unije @hr
preferred label: Unionens højtstående repræsentant @da
preferred label: Vysoký predstaviteľ @sk
alternative label: Alta rappresentante dell’Unione @it

Representative
type: Concept
preferred label: Αντιπρόσωπος @el
preferred label: Pārstāvis @lv
alternative label: Zástupkyně @cs
alternative label: Atstovė @lt
preferred label: Vertreter @de
preferred label: Представител @bg
alternative label: Predstavnica @hr
preferred label: Rappreżentant @mt
in scheme: EP taxonomy on roles.
preferred label: Rappresentante @it
preferred label: Zástupce @cs
alternative label: Vertreterin @de
preferred label: Képviselő @hu
preferred label: Przedstawiciel @pl
preferred label: Reprezentant @ro
preferred label: Företrädare @sv
preferred label: Ionadaí @ga
preferred label: Représentant @fr
preferred label: Esindaja @et
alternative label: Pārstāve @lv
preferred label: Predstaviteľ @sk
definition: Someone who speaks or does something officially for another person or group of people.
deprecated: false
preferred label: Representante @es
alternative label: Przedstawicielka @pl
preferred label: Predstavnik @hr
created: 2023-10-31
preferred label: Vertegenwoordiger @nl
preferred label: Repræsentant @da
preferred label: Atstovas @lt
preferred label: Edustaja @fi
alternative label: Représentante @fr
alternative label: Predstaviteľka @sk
top concept of: EP taxonomy on roles.
alternative label: Reprezentantă @ro

Associated parliamentary committee for opinion
type: ParticipationRole
in scheme: EP taxonomy on roles.
preferred label: Comisión parlamentaria asociada para recabar su opinión @es
broader: Parliamentary committee for opinion
preferred label: Přidružený parlamentní výbor pro stanovisko @cs
preferred label: Assoziierter parlamentarischer Ausschuss zur Stellungnahme @de
preferred label: Véleménynyilvánításra felkért parlamenti társbizottság @hu
preferred label: Commission parlementaire associée pour avis @fr
definition: Associated opinion giving committee. A such opinion has to be taken on board by the lead committee without a vote.
preferred label: Асоциирана парламентарна комисия, даваща становище @bg
deprecated: true
preferred label: Povezani parlamentarni odbor za mišljenje @hr
preferred label: Comisie parlamentară asociată pentru aviz @ro
preferred label: Arvamusega seotud kaasatud parlamendikomisjon @et
preferred label: Commissione parlamentare associata per parere @it
preferred label: Associerat parlamentsutskott för yttrande @sv
preferred label: Povezani parlamentarni odbor za mnenje @sl
preferred label: Associeret parlamentsudvalg til udtalelse @da
created: 2023-10-31
preferred label: Comissão parlamentar consultiva associada @pt
preferred label: Zaangażowana opiniodawcza komisja parlamentarna @pl
preferred label: Lausunnon antava parlamentin valiokunta @fi
preferred label: Pagal susijusių komitetų procedūrą nuomonę teikiantis Parlamento komitetas @lt
preferred label: Geassocieerde parlementaire commissie voor advies @nl
type: Concept
preferred label: Asociētā parlamenta komiteja atzinuma sagatavošanai @lv
preferred label: Pridružený parlamentný výbor pre stanovisko @sk
preferred label: Coiste parlaiminte comhlachaithe le haghaidh tuairime @ga
preferred label: Il-kumitat parlamentari assoċjat għal opinjoni @mt
preferred label: Συνδεδεμένη κοινοβουλευτική επιτροπή για γνωμοδότηση @el

Representatives of the Governments of the Member States
type: Concept
preferred label: Représentants des gouvernements des États membres @fr
preferred label: Vertreter und Vertreterinnen der Regierungen der Mitgliedstaaten @de
preferred label: Representantes dos Governos dos Estados-Membros @pt
definition: National officials from the governments of member states that ensure that the interests and policies of their state are effectively pursued by the European Union.
alternative label: Predstavnice vlad držav članic @sl
preferred label: Rappresentanti dei governi degli Stati membri @it
preferred label: Valstybių narių vyriausybių atstovai @lt
preferred label: Jäsenvaltioiden hallitusten edustajat @fi
preferred label: Przedstawiciele rządów państw członkowskich @pl
preferred label: Eκπρόσωποι των κυβερνήσεων των κρατών μελών @el
preferred label: Ionadaithe Rialtais na mBallstát @ga
preferred label: Liikmesriikide valitsuste esindajad @et
created: 2023-10-31
preferred label: Представителите на правителствата на държавите членки @bg
preferred label: Zástupci vlád členských států @cs
preferred label: Predstavniki vlad držav članic @sl
in scheme: EP taxonomy on roles.
deprecated: false
preferred label: Predstavnici vlada država članica @hr
preferred label: Företrädarna för medlemsstaternas regeringar @sv
preferred label: Vertegenwoordigers van de regeringen der lidstaten @nl
preferred label: Tagállamok kormányainak képviselői @hu
preferred label: Zástupcovia vlád členských štátov @sk
preferred label: Dalībvalstu valdību pārstāvji @lv
preferred label: Reprezentanților guvernelor statelor membre @ro
preferred label: Repræsentanterne for medlemsstaternes regeringer @da
preferred label: Representantes de los Gobiernos de los Estados miembros @es
broader: Representative
preferred label: Ir-Rappreżentanti tal-Gvernijiet tal-Istati Membri @mt

Second Vice-President
type: Role
preferred label: Andre vice talman @sv
alternative label: Druhá místopředsedkyně @cs
alternative label: Segunda vice-presidente @pt
preferred label: Deuxième Vice-Président @fr
preferred label: Secondo vicepresidente @it
deprecated: false
alternative label: A doua vicepreședintă @ro
alternative label: Antroji pirmininko pavaduotoja @lt
preferred label: Otrais priekšsedetaja vietnieks @lv
preferred label: Zweiter Vizepräsident @de
alternative label: Zweite Vizepräsidentin @de
definition: A second vice-president takes on the main role of a president in the absence of the president and the first vice-president.
preferred label: Drugi podpredsednik @sl
preferred label: Antrasis vicepirmininkas @lt
preferred label: Segundo vice-presidente @pt
alternative label: Deuxième Vice-présidente @fr
alternative label: Druga potpredsjednica @hr
broader: Председател
preferred label: Anden næstformand @da
preferred label: Tweede ondervoorzitter @nl
preferred label: It-Tieni Viċi-President @mt
type: Concept
preferred label: Druhý místopředseda @cs
preferred label: Al doilea vicepreședinte @ro
preferred label: Drugi Wiceprzewodniczacy @pl
alternative label: Antroji vicepirmininkė @lt
preferred label: Segundo Vicepresidente @es
preferred label: Teine asepresident @et
preferred label: Druhý viceprezident @sk
alternative label: Seconda vicepresidente @it
alternative label: Druhá podpredsedníčka @sk
alternative label: Druga podpredsednica @sl
alternative label: Segunda Vicepresidenta @es
created: 2023-10-31
alternative label: Δεύτερη αντιπρόεδρος @el
preferred label: Δεύτερος αντιπρόεδρος @el
preferred label: második alelnök @hu
preferred label: Втори заместник-председател @bg
in scheme: EP taxonomy on roles.
preferred label: Drugi potpredsjednik @hr
alternative label: Druga wiceprzewodnicząca @pl
preferred label: Toinen varapuheenjohtaja @fi
preferred label: Dara Leas-Uachtarán @ga

First Vice-Chair/Member of the Bureau
type: Concept
alternative label: První místopředsedkyně/Členka předsednictva @cs
preferred label: Primeiro Vice-Presidente/Membro da Mesa @pt
preferred label: Πρώτος αντιπρόεδρος/Μέλος του Προεδρείου @el
preferred label: Prvý podpredseda/Člen predsedníctva @sk
preferred label: Prvi podpredsednik/Član predsedstva @sl
preferred label: Eerste ondervoorzitter/Lid van het bureau @nl
alternative label: Primeira Vice-Presidente/Membro da Mesa @pt
alternative label: Prima vicepresidente/Membro dell’ufficio di presidenza @it
alternative label: Erste Stellvertretende Vorsitzende/Mitglied des Vorstands @de
preferred label: Ensimmäinen varapuheenjohtaja/Työvaliokunnan jäsen @fi
preferred label: Pirmais priekšsēdētāja vietnieks/Prezidija loceklis @lv
preferred label: Premier vice-président/Membre du bureau @fr
preferred label: L-Ewwel Viċi President/Membru tal-Bureau @mt
preferred label: Første næstformand/Medlem af bestyrelsen @da
preferred label: Pierwszy wiceprzewodniczący/Członek prezydium @pl
deprecated: false
alternative label: Première vice-présidente/Membre du bureau @fr
preferred label: Vicepresidente primero/Miembro de la Mesa @es
preferred label: An Chéad Leas-Chathaoirleach/Comhalta an Bhiúró @ga
created: 2023-10-31
definition: The first vice chair of the EP bureau replaces the chair when absent.
broader: Chairman
preferred label: Pirmasis pirmininko pavaduotojas/Biuro narys @lt
preferred label: První místopředseda/Člen předsednictva @cs
preferred label: Erster Stellvertretender Vorsitzender/Mitglied des Vorstands @de
preferred label: Първи заместник-председател/Член на Бюрото @bg
preferred label: Prim-vicepreședinte/Membru al Biroului @ro
preferred label: Primo vicepresidente/Membro dell’ufficio di presidenza @it
alternative label: Prva potpredsjednica/članica Predsjedništva @hr
type: Role
alternative label: Pierwsza wiceprzewodnicząca/Członkini prezydium @pl
preferred label: Prvi potpredsjednik/član Predsjedništva @hr
in scheme: EP taxonomy on roles.
alternative label: Πρώτη αντιπρόεδρος/Μέλος του Προεδρείου @el
alternative label: Pirmoji pirmininko pavaduotoja/Biuro narė @lt
alternative label: Prvá podpredsedníčka/Členka predsedníctva @sk
preferred label: Förste vice ordförande/Ledamot av presidiet @sv
alternative label: Prva podpredsednica/Članica predsedstva @sl
alternative label: Pirmā priekšsēdētāja vietniece/Prezidija locekle @lv
preferred label: Első alelnök/Az elnökség tagja @hu
alternative label: Vicepresidenta primera/ Miembro de la Mesa @es
preferred label: Esimene aseesimees / Juhatuse liige @et
alternative label: Prim-vicepreședintă/Membră a Biroului @ro

Co-treasurer
type: Concept
preferred label: Kassör @sv
definition: A co-treasurer assists the treasurer in managing the finances of an entity.
preferred label: Vienas iš iždininkų @lt
preferred label: Cotrésorier @fr
preferred label: Comh-Chisteoir @ga
alternative label: Co-Tesoureira @pt
alternative label: Spolupokladnice @cs
alternative label: Pomočnica zakladnika @sl
preferred label: Társkincstárnok @hu
preferred label: Współskarbnik @pl
preferred label: Cotesoriere @it
alternative label: Ko-Schatzmeisterin @de
preferred label: Pomočnik zakladnika @sl
in scheme: EP taxonomy on roles.
preferred label: Medkasserer @da
preferred label: Kaasvarahoidja @et
preferred label: Ko-Schatzmeister @de
preferred label: Co-Tesoureiro @pt
preferred label: Cotesorero @es
alternative label: Viena iš iždininkų @lt
type: Role
preferred label: Cotrezorier @ro
preferred label: Ko-Teżorier @mt
alternative label: Ko-Teżoriera @mt
alternative label: Spolupokladníčka @sk
alternative label: Cotrésorière @fr
preferred label: Συν-ταμίας @el
alternative label: Cotesorera @es
alternative label: Surizničarka @hr
alternative label: Współskarbniczka @pl
broader: Treasurer
preferred label: Surizničar @hr
preferred label: Finanšu līdzrīkotājs @lv
deprecated: false
preferred label: Taloudenhoitaja @fi
alternative label: Finanšu līdzrīkotāja @lv
preferred label: Co-penningmeester @nl
preferred label: Съковчежник @bg
created: 2023-10-31
preferred label: Spolupokladník @sk

Parliamentary committee for opinion on recasting technique
type: ParticipationRole
preferred label: Parlamentný výbor pre stanovisko k technike prepracovania @sk
preferred label: Parlamentní výbor pro stanovisko k metodě přepracování @cs
deprecated: false
preferred label: Commission parlementaire pour avis sur la technique de refonte @fr
in scheme: EP taxonomy on roles.
preferred label: Κοινοβουλευτική επιτροπή για γνωμοδότηση σχετικά με την τεχνική αναδιατύπωσης @el
preferred label: Parlamentarna komisja opiniodawcza ds. techniki przekształcania @pl
created: 2025-06-30
broader: Parliamentary committee for opinion
preferred label: Uuesti sõnastamise tehnikat käsitlev parlamendikomisjon @et
preferred label: Az átdolgozási technikáról véleményt nyilvánító parlamenti bizottság @hu
preferred label: Parlamenta komiteja atzinuma sniegšanai par pārstrādāšanas metodi @lv
preferred label: Comisia parlamentară pentru aviz privind tehnica de reformare @ro
preferred label: Commissione parlamentare per parere sulla tecnica di rifusione @it
preferred label: Parlamentin valiokunta lausuntoa varten uudelleenlaatimistekniikasta @fi
preferred label: Parlamentarni odbor za mišljenje o tehnici preinake @hr
preferred label: Parlamentsudvalg til udtalelse om omarbejdningsteknik @da
preferred label: Parlamentsutskott för yttrande om omarbetningsteknik @sv
preferred label: Comissão parlamentar para parecer sobre a técnica de reformulação @pt
preferred label: Парламентарна комисия по становище относно техниката за преработване @bg
preferred label: Comisión parlamentaria de opinión sobre la técnica de refundición @es
preferred label: An Coiste Parlaiminteach um an Tuairim maidir le Teicníc um Athmhúnlú @ga
preferred label: Parlementaire commissie voor advies over herschikkingstechniek @nl
preferred label: Parlamentarischer Ausschuss für die Stellungnahme zur Neufassungstechnik @de
preferred label: Parlamentarni odbor za mnenje o tehniki prenovitve @sl
definition: Parliamentary committee giving an opinion on the recasting technique in a procedure.
preferred label: Kumitat Parlamentari għal opinjoni dwar it-teknika ta' riformulazzjoni @mt
type: Concept
preferred label: Parlamento nuomonės dėl išdėstymo nauja redakcija metodo komitetas @lt

Shadow rapporteur for report
type: Concept
preferred label: Relatore ombra per la relazione @it
preferred label: Scáthrapóirtéir don tuarascáil @ga
preferred label: Kontrsprawozdawca komisji opiniodawczej @pl
preferred label: Tieňový spravodajca pre správu @sk
preferred label: Izvjestitelj u sjeni za izvješće @hr
in scheme: EP taxonomy on roles.
preferred label: Schattenberichterstatter für den Bericht @de
preferred label: Skyggeordfører for betænkning @da
preferred label: Докладчик в сянка по доклада @bg
preferred label: Stínový zpravodaj pro zprávu @cs
created: 2025-03-31
preferred label: Σκιώδης εισηγητής της έκθεσης @el
type: CapacityRole
preferred label: Shadow rapporteur għal rapport @mt
preferred label: Varjoesittelijä (mietintö) @fi
definition: A shadow rapporteur is a MEP who monitors the legislative process and finds compromise with the work of the rapporteur on behalf of a political group to elaborate a report.
preferred label: Ponente alternativo para el informe @es
deprecated: false
preferred label: Raportor alternativ pentru raport @ro
preferred label: Rapporteur fictif pour rapport @fr
preferred label: Skuggföredragande för betänkandet @sv
preferred label: Poročevalec v senci za poročilo @sl
preferred label: Pranešimo šešėlinis pranešėjas @lt
preferred label: A jelentés árnyékelőadója @hu
preferred label: Ēnu referents ziņojumam @lv
preferred label: Raporti variraportöör @et
broader: Shadow rapporteur
preferred label: Schaduwrapporteur voor het verslag @nl
broad match: RAPP SHADOW
preferred label: Relator-sombra para o relatório @pt
broader: Rapporteur

Substitute observer
type: Concept
preferred label: Breathnadóir ionadaíoch @ga
in scheme: EP taxonomy on roles.
preferred label: Plaatsvervangend waarnemer @nl
deprecated: false
preferred label: Observatörssuppleant @sv
created: 2023-10-31
preferred label: Osservatur sostitut @mt
alternative label: Náhradná pozorovateľka @sk
preferred label: Pozorovatel-náhradník @cs
alternative label: Αναπληρώτρια παρατηρήτρια @el
preferred label: Observateur suppléant @fr
alternative label: Novērotāja aizstājēja @lv
preferred label: Náhradný pozorovateľ @sk
preferred label: Osservatore sostituto @it
alternative label: Observadora suplente @es
preferred label: Tarkkailijan varahenkilö @fi
preferred label: Observador suplente @es
preferred label: Stedfortrædende observatør @da
preferred label: Stellvertretender Beobachter @de
definition: A substitute observer is an observer who alternates with the regular observer in the European Parliament.
type: Role
alternative label: Namestnica opazovalca @sl
preferred label: Pavaduojantis stebėtojas @lt
preferred label: Zamjenik promatrača @hr
broader: Observer
preferred label: Αναπληρωτής παρατηρητής @el
alternative label: Obserwatorka pomocnicza @pl
preferred label: Obserwator pomocniczy @pl
alternative label: Pozorovatelka-náhradnice @cs
preferred label: Novērotāja aizstājējs @lv
alternative label: Observatrice suppléante @fr
preferred label: Helyettes megfigyelő @hu
alternative label: Pavaduojanti stebėtoja @lt
alternative label: Zamjenica promatrača @hr
alternative label: Stellvertretende Beobachterin @de
preferred label: Namestnik opazovalca @sl
preferred label: Observator supleant @ro
preferred label: Vaatleja asendaja @et
preferred label: Заместник-наблюдател @bg

Observer
type: Role
alternative label: Novērotāja @lv
preferred label: Tarkkailija @fi
in scheme: EP taxonomy on roles.
preferred label: Pozorovatel @cs
definition: This title is used in the European Parliament where pending the entry into force of the accession treaty, an observer of the candidate country participates in the work of the European Parliament and is entitled to speak in the committees and in the political groups.
preferred label: Observador @es
preferred label: Pozorovateľ @sk
alternative label: Opazovalka @sl
alternative label: Beobachterin @de
deprecated: false
alternative label: Observadora @es
alternative label: Pozorovateľka @sk
preferred label: Opazovalec @sl
top concept of: EP taxonomy on roles.
preferred label: Observateur @fr
preferred label: Stebėtojas @lt
preferred label: Osservatore @it
preferred label: Promatrač @hr
preferred label: Observator @ro
preferred label: Megfigyelő @hu
preferred label: Novērotājs @lv
preferred label: Observatør @da
alternative label: Παρατηρήτρια @el
preferred label: Observatör @sv
alternative label: Obserwatorka @pl
preferred label: Beobachter @de
alternative label: Pozorovatelka @cs
alternative label: Osservatriċi @mt
preferred label: Παρατηρητής @el
preferred label: Breathnadóir @ga
preferred label: Наблюдател @bg
preferred label: Obserwator @pl
preferred label: Waarnemer @nl
preferred label: Vaatleja @et
type: Concept
alternative label: Promatračica @hr
alternative label: Stebėtoja @lt
preferred label: Osservatur @mt
created: 2023-10-31
alternative label: Observatrice @fr

Vice-President of the European Parliament
type: Concept
in scheme: EP taxonomy on roles.
alternative label: Podpredsednica Evropskega parlamenta @sl
alternative label: Europos Parlamento pirmininko pavaduotoja @lt
created: 2023-10-31
preferred label: Vicepreședinte al Parlamentului European @ro
alternative label: Místopředsedkyně Evropského parlamentu @cs
preferred label: Vice-Président du Parlement européen @fr
preferred label: Vizepräsident des Europäischen Parlaments @de
preferred label: Leas-Uachtarán de Pharlaimint na hEorpa @ga
preferred label: Wiceprzewodniczący Parlamentu Europejskiego @pl
preferred label: Potpredsjednik Europskog parlamenta @hr
preferred label: Podpredseda Európskeho parlamentu @sk
preferred label: Az Európai Parlament alelnöke @hu
preferred label: Euroopa Parlamendi asepresident @et
alternative label: Przewodnicząca Parlamentu Europejskiego @pl
alternative label: Eiropas Parlamenta priekšsēdētāja vietniece @lv
preferred label: Ondervoorzitter van het Europees Parlement @nl
preferred label: Vicepresidente del Parlamento europeo @it
alternative label: Vizepräsidentin des Europäischen Parlaments @de
deprecated: false
preferred label: Αντιπρόεδρος του Ευρωπαϊκού Κοινοβουλίου @el
alternative label: Vice-Présidente du Parlement européen @fr
definition: Vice-presidents of the European Parliament chair debates when the president is not in the chamber.
preferred label: Místopředseda Evropského parlamentu @cs
alternative label: Podpredsedníčka Európskeho parlamentu @sk
type: Role
preferred label: Europaparlamentets vice talman @sv
alternative label: Potpredsjednica Europskog parlamenta @hr
broader: Председател
alternative label: Vicepreședintă a Parlamentului European @ro
preferred label: Europos Parlamento pirmininko pavaduotojas @lt
preferred label: Næstformand i Europa-Parlamentet @da
preferred label: Podpredsednik Evropskega parlamenta @sl
preferred label: Заместник-председател на Европейския парламент @bg
alternative label: Vicepresidenta del Parlamento Europeo @es
preferred label: Vice-Presidente do Parlamento Europeu @pt
preferred label: Euroopan parlamentin varapuhemies @fi
preferred label: Vicepresidente del Parlamento Europeo @es
preferred label: Viċi President tal-Parlament Ewropew @mt
preferred label: Eiropas Parlamenta priekšsēdētāja vietnieks @lv

Parliamentary committee for budgetary assessement
type: Concept
preferred label: Parlamentarischer Ausschuss für Haushaltsbewertung @de
created: 2025-06-30
broader: Parliamentary committee for opinion
preferred label: Parlamentsutskott för budgetbedömning @sv
in scheme: EP taxonomy on roles.
preferred label: Parlamentin talousarvion arviointivaliokunta @fi
preferred label: Parlamentarni odbor za proračunsku procjenu @hr
preferred label: Parlamentní výbor pro rozpočtové hodnocení @cs
preferred label: Parlamentarni odbor za proračunsko oceno @sl
preferred label: Commission parlementaire d'évaluation budgétaire @fr
preferred label: A költségvetési értékeléssel foglalkozó parlamenti bizottság @hu
preferred label: Budžeta novērtēšanas parlamentārā komiteja @lv
preferred label: Commissione parlamentare per la valutazione del bilancio @it
preferred label: An Coiste Parlaiminteach um Measúnú Buiséadach @ga
deprecated: false
preferred label: Comisión Parlamentaria de Evaluación Presupuestaria @es
preferred label: Parlamentný výbor pre rozpočtové hodnotenie @sk
type: ParticipationRole
preferred label: Парламентарна комисия за бюджетна оценка @bg
preferred label: Comisia parlamentară pentru evaluare bugetară @ro
preferred label: Κοινοβουλευτική επιτροπή για την αξιολόγηση του προϋπολογισμού @el
definition: Budgetary assessment committee gives an opinion about the budgetary measures of a procedure.
preferred label: Parlementaire commissie Begrotingsbeoordeling @nl
preferred label: Eelarve hindamise parlamendikomisjon @et
preferred label: Parlamentarisk udvalg for budgetvurdering @da
preferred label: Kumitat parlamentari għall-evalwazzjoni tal-baġit @mt
preferred label: Parlamento biudžeto vertinimo komitetas @lt
preferred label: Parlamentarna Komisja ds. Oceny Budżetowej @pl
preferred label: Comissão Parlamentar de Avaliação Orçamental @pt

Author of report
type: Concept
preferred label: Kertomuksen laatija @fi
preferred label: Raporti autor @et
preferred label: Συντάκτης έκθεσης @el
alternative label: Autora do relatório @pt
preferred label: Författare till rapport @sv
alternative label: Συντάκτρια έκθεσης @el
alternative label: Auteure du rapport @fr
alternative label: Autorka správy @sk
alternative label: Autrice della relazione @it
preferred label: Autor do relatório @pt
preferred label: Údar na tuarscála @ga
preferred label: Autor del informe @es
alternative label: Pranešimo autorė @lt
preferred label: Autor raport @ro
preferred label: Autor izvješća @hr
alternative label: Autorka sprawozdania @pl
preferred label: Autore della relazione @it
preferred label: Auteur van het verslag @nl
alternative label: Autoare raport @ro
in scheme: EP taxonomy on roles.
preferred label: Ziņojuma autors @lv
preferred label: Verfasser des Berichts @de
alternative label: Autrice du rapport @fr
preferred label: Auteur du rapport @fr
preferred label: Pranešimo autorius @lt
alternative label: Avtorica poročila @sl
alternative label: Verfasserin des Berichts @de
preferred label: Avtor poročila @sl
preferred label: Autor zprávy @cs
alternative label: Autorica izvješća @hr
alternative label: Autora del informe @es
preferred label: Autor správy @sk
deprecated: false
broader: Author
alternative label: Autorka zprávy @cs
preferred label: Forfatter af rapport @da
definition: Entity creating a report.
preferred label: Awtur tar-rapport @mt
preferred label: Автор на доклада @bg
alternative label: Ziņojuma autore @lv
created: 2023-10-31
preferred label: Autor sprawozdania @pl
preferred label: Jelentéstevő @hu

Co-Chair
type: Role
preferred label: Ko-Vorsitzender @de
alternative label: Spolupředsedkyně @cs
preferred label: Spolupredseda @sk
preferred label: Co-Presidente @pt
alternative label: Viena iš pirmininkų @lt
created: 2023-10-31
alternative label: Līdzpriekšsēdētāja @lv
preferred label: Līdzpriekšsēdētājs @lv
alternative label: Copresidenta @es
preferred label: Coprésident @fr
preferred label: Copreședinte @ro
preferred label: Comh-Chathaoirleach @ga
preferred label: Vienas iš pirmininkų @lt
in scheme: EP taxonomy on roles.
preferred label: Társelnök @hu
broader: Chairman
alternative label: Spolupredsedníčka @sk
preferred label: Medformand @da
preferred label: Supredsjednik @hr
preferred label: Copresidente @es
preferred label: Medevoorzitter @nl
alternative label: Supredsjednica @hr
preferred label: Spolupředseda @cs
alternative label: Coprésidente @fr
preferred label: Συμπρόεδρος @el
alternative label: Copreședintă @ro
preferred label: Sopredsednik @sl
deprecated: false
alternative label: Współprzewodnicząca @pl
alternative label: Sopredsednica @sl
preferred label: Współprzewodniczący @pl
definition: A co-chair assists the chair as needed in conducting meetings and facilitating the work of a group.
preferred label: Kaasesimees @et
alternative label: Ko-Vorsitzende @de
type: Concept
preferred label: Kopresident @mt
preferred label: Yhteispuheenjohtaja @fi
preferred label: Medordförande @sv
preferred label: Съпредседател @bg

Ally
type: Concept
preferred label: Poseł stowarzyszony @pl
preferred label: Beslægtet @da
preferred label: Liitännäisjäsen @fi
preferred label: Apparentato @it
alternative label: Prijaučianti narė @lt
alternative label: Alleata @mt
deprecated: false
alternative label: Nahestehende @de
alternative label: Posłanka stowarzyszona @pl
alternative label: Saveznica @hr
preferred label: Prijaučiantis narys @lt
preferred label: Liitlane @et
alternative label: Spojenkyně @cs
preferred label: Afim @pt
preferred label: Társult tag @hu
alternative label: Spojenkyňa @sk
preferred label: Geestverwant @nl
preferred label: Spojenec @cs
preferred label: Apparenté @fr
preferred label: Sabiedrotais @lv
preferred label: Nahestehender @de
top concept of: EP taxonomy on roles.
alternative label: Zaveznica @sl
preferred label: Comhpháirtí @ga
alternative label: Sabiedrotā @lv
preferred label: Besläktade @sv
created: 2023-10-31
definition: An ally is used for members associated with a group for some common cause.
preferred label: Alleat @mt
in scheme: EP taxonomy on roles.
alternative label: Προσκείμενη @el
preferred label: Zaveznik @sl
preferred label: Προσκείμενος @el
preferred label: Afiliat @ro
type: Role
alternative label: Apparentata @it
alternative label: Apparentée @fr
preferred label: Saveznik @hr
alternative label: Afiliată @ro
preferred label: Асоцииран @bg
preferred label: Afín @es

Member participating in interinstitutional negotiations
type: CapacityRole
preferred label: Intézményközi tárgyalásokon részt vevő tag @hu
preferred label: Medlem, der deltager i interinstitutionelle forhandlinger @da
definition: Member taking part in an interinstitutional negotiation.
alternative label: Rannpháirtí i gcaibidlíocht idirinstitiúideach @ga
alternative label: Participante numa negociação interinstitucional @pt
type: Concept
alternative label: Sudionik u međuinstitucijskim pregovorima @hr
alternative label: Participant à une négociation interinstitutionnelle @fr
in scheme: EP taxonomy on roles.
preferred label: Ledamot som deltar i interinstitutionella förhandlingar @sv
alternative label: Institutsioonidevahelistel läbirääkimistel osaleja @et
preferred label: Członek uczestniczący w negocjacjach międzyinstytucjonalnych @pl
preferred label: Institutsioonidevahelistel läbirääkimistel osalev liige @et
preferred label: Membru li jipparteċipa f'negozjati interistituzzjonali @mt
alternative label: Parteċipant f’negozjati interistituzzjonali @mt
alternative label: Deelnemer aan interinstitutionele onderhandelingen @nl
preferred label: Loceklis, kas piedalās iestāžu sarunās @lv
preferred label: Toimielinten välisiin neuvotteluihin osallistuva jäsen @fi
broader: Member
alternative label: Teilnehmer an interinstitutionellen Verhandlungen @de
preferred label: Membre participant aux négociations interinstitutionnelles @fr
preferred label: Μέλος που συμμετέχει σε διοργανικές διαπραγματεύσεις @el
preferred label: Comhalta atá rannpháirteach i gcaibidlíochtaí idirinstitiúideacha @ga
preferred label: Lid dat deelneemt aan interinstitutionele onderhandelingen @nl
alternative label: Účastník interinstitucionálního jednání @cs
alternative label: Partecipante a un negoziato interistituzionale @it
preferred label: Membro che partecipa ai negoziati interistituzionali @it
preferred label: Člen účastnící se interinstitucionálních jednání @cs
preferred label: Mitglied, das an interinstitutionellen Verhandlungen teilnimmt @de
created: 2025-03-31
alternative label: Účastník medziinštitucionálnych rokovaní @sk
alternative label: Tarpinstitucinių derybų dalyvis @lt
alternative label: Toimielinten välisten neuvottelujen osanottaja @fi
preferred label: Člen zúčastňujúci sa na medziinštitucionálnych rokovaniach @sk
alternative label: Participant in an interinstitutional negotiation
alternative label: Participant la o negociere interinstituțională @ro
preferred label: Membru care participă la negocieri interinstituționale @ro
preferred label: Tarpinstitucinėse derybose dalyvaujantis narys @lt
preferred label: Член на ЕП, участващ в междуинституционални преговори @bg
alternative label: Uczestnik negocjacji międzyinstytucjonalnych @pl
deprecated: false
preferred label: Poslanec, ki sodeluje v medinstitucionalnih pogajanjih @sl
preferred label: Membro que participa em negociações interinstitucionais @pt
alternative label: Iestāžu sarunu dalībnieks @lv
preferred label: Član koji sudjeluje u međuinstitucijskim pregovorima @hr
alternative label: Deltagare i interinstitutionella förhandlingar @sv
alternative label: Участник в междуинституционални преговори @bg
alternative label: Deltager i en interinstitutionel forhandling @da
alternative label: Συμμετοχή σε διοργανική διαπραγμάτευση @el
alternative label: Udeleženec medinstitucionalnih pogajanj @sl
alternative label: Participante en una negociación interinstitucional @es
preferred label: Miembro participante en negociaciones interinstitucionales @es
alternative label: Intézményközi tárgyalások résztvevője @hu

Candidate
type: Concept
created: 2023-10-31
preferred label: Kandidát @cs
preferred label: Kandydat @pl
top concept of: EP taxonomy on roles.
preferred label: Candidat @fr
preferred label: Υποψήφιος @el
preferred label: Bewerber @de
definition: Candidate for a membership.
preferred label: Кандидат @bg
preferred label: Tagjelölt @hu
preferred label: Kandidat @da
preferred label: Kandidaat @et
preferred label: Kandidāts @lv
in scheme: EP taxonomy on roles.
preferred label: Candidato @es
preferred label: Iarrthóir @ga
preferred label: Kandidatas @lt
deprecated: false
preferred label: Ehdokas @fi

Chair of the Bureau
type: Concept
preferred label: Predseda predsedníctva @sk
alternative label: Presidenta de la Mesa @es
preferred label: President tal-Bureau @mt
preferred label: Biroja priekšsēdētājs @lv
alternative label: Biroja priekšsēdētāja @lv
preferred label: Työvaliokunnan puheenjohtaja @fi
created: 2023-10-31
alternative label: Przewodnicząca prezydium @pl
preferred label: Cathaoirleach an Bhiúró @ga
alternative label: Predsednica predsedstva @sl
preferred label: Biuro pirmininkas @lt
alternative label: Predsedníčka predsedníctva @sk
preferred label: Presidente da Mesa @pt
preferred label: Председател на бюрото @bg
broader: Chairman
alternative label: Președintă a Biroului @ro
preferred label: Presidente de la Mesa @es
preferred label: Formand for bestyrelsen @da
preferred label: Président du bureau @fr
type: Role
alternative label: Vorsitzende des Vorstands @de
preferred label: Az elnökség elnöke @hu
preferred label: Przewodniczący prezydium @pl
alternative label: Predsjednica Predsjedništva @hr
preferred label: Presidente dell'ufficio di presidenza @it
preferred label: Předseda předsednictva @cs
preferred label: Predsednik predsedstva @sl
preferred label: Πρόεδρος του Προεδρείου @el
alternative label: Présidente du bureau @fr
deprecated: false
definition: The Chair of the Bureau is a person who presides the bureau, entity laying down rules for the European Parliament.
alternative label: Předsedkyně předsednictva @cs
preferred label: Voorzitter van het bureau @nl
preferred label: Predsjednik Predsjedništva @hr
preferred label: Vorsitzender des Vorstands @de
preferred label: Styrelseordförande @sv
preferred label: Juhatuse esimees @et
alternative label: Biuro pirmininkė @lt
preferred label: Președinte al Biroului @ro
in scheme: EP taxonomy on roles.

Diplomatic representative
type: Concept
alternative label: Rappresentanti diplomatiche @it
preferred label: Дипломатически представител @bg
preferred label: Diplomaattinen edustaja @fi
in scheme: EP taxonomy on roles.
alternative label: Przedstawicielka dyplomatyczna @pl
alternative label: Representantes diplomáticos @es
preferred label: Representante diplomático @pt
alternative label: Reprezentanți diplomatici @ro
alternative label: Représentantes diplomatiques @fr
preferred label: Diplomatinis atstovas @lt
alternative label: Diplomatickí zástupcovia @sk
deprecated: false
alternative label: Diplomatski predstavniki @sl
alternative label: Représentante diplomatique @fr
alternative label: Διπλωματικές αντιπρόσωποι @el
preferred label: Diplomatisk företrädare @sv
preferred label: Rappreżentant diplomatiku @mt
preferred label: Diplomatski predstavnik @sl
definition: Someone who officially represents a country in another country.
preferred label: Diplomatisk repræsentant @da
preferred label: Diplomātiskais pārstāvis @lv
alternative label: Diplomatické zástupkyně @cs
alternative label: Diplomatska predstavnica @sl
alternative label: Ionadaithe taidhleoireachta @ga
alternative label: Diplomātiskā pārstāve @lv
preferred label: Diplomatiek vertegenwoordiger @nl
preferred label: Rappresentante diplomatico @it
alternative label: Diplomatski predstavnici @hr
alternative label: Representante diplomática @es
alternative label: Διπλωματική αντιπρόσωπος @el
alternative label: Diplomatiek vertegenwoordigers @nl
alternative label: Rappresentanti diplomatici @it
broader: Representative
created: 2023-10-31
alternative label: Przedstawiciele służby dyplomatycznej @pl
alternative label: Diplomatinė atstovė @lt
alternative label: Diplomatičtí zástupci @cs
alternative label: Diplomaattiset edustajat @fi
alternative label: Diplomatická zástupkyňa @sk
alternative label: Diplomatiska företrädare @sv
alternative label: Diplomatske predstavnice @sl
preferred label: Diplomatický zástupce @cs
alternative label: Reprezentanţă diplomatică @ro
preferred label: Diplomatický zástupca @sk
alternative label: Rappreżentanti diplomatiċi @mt
alternative label: Diplomātiskie pārstāvji @lv
preferred label: Reprezentant diplomatic @ro
preferred label: Diplomatischer Vertreter @de
alternative label: Diplomatische Vertreter @de
alternative label: Diplomatiske repræsentanter @da
preferred label: Diplomáciai képviselő @hu
alternative label: Representantes diplomáticas @pt
preferred label: Przedstawiciel dyplomatyczny @pl
alternative label: Diplomatic representatives
preferred label: Représentant diplomatique @fr
alternative label: Rappresentante diplomatica @it
alternative label: Diplomatická zástupkyně @cs
alternative label: Diplomaatilised esindajad @et
alternative label: Diplomatiniai atstovai @lt
alternative label: Diplomáciai képviselők @hu
preferred label: Diplomaatiline esindaja @et
alternative label: Дипломатически представители @bg
alternative label: Diplomatische Vertreterin @de
alternative label: Représentants diplomatiques @fr
preferred label: Ionadaí taidhleoireachta @ga
alternative label: Διπλωματικοί αντιπρόσωποι @el
preferred label: Διπλωματικός αντιπρόσωπος @el

Co-President
type: Concept
alternative label: Copresidenta @es
preferred label: Ko-Vorsitzender @de
definition: A co-president assists the president as needed in conducting meetings and facilitating the work of an assembly, for example of a joint parliamentary assembly.
preferred label: Comh-Uachtarán @ga
preferred label: Współprzewodniczący @pl
preferred label: Līdzpriekšsēdētājs @lv
preferred label: Co-Presidente @pt
preferred label: Spolupredseda @sk
in scheme: EP taxonomy on roles.
preferred label: Coprésident @fr
alternative label: Copreședintă @ro
preferred label: Kaasesimees @et
alternative label: Viena iš pirmininkų @lt
broader: Председател
preferred label: Társelnök @hu
type: Role
preferred label: Съпредседател @bg
preferred label: Medordförande @sv
preferred label: Spolupředseda @cs
preferred label: Medformand @da
preferred label: Copresidente @es
alternative label: Līdzpriekšsēdētāja @lv
alternative label: Supredsjednica @hr
preferred label: Yhteispuheenjohtaja @fi
preferred label: Supredsjednik @hr
preferred label: Sopredsednik @sl
alternative label: Spolupredsedníčka @sk
preferred label: Συμπρόεδρος @el
preferred label: Copreședinte @ro
alternative label: Sopredsednica @sl
alternative label: Współprzewodnicząca @pl
preferred label: Kopresident @mt
created: 2023-10-31
alternative label: Coprésidente @fr
preferred label: Vienas iš pirmininkų @lt
alternative label: Ko-Vorsitzende @de
deprecated: false
preferred label: Medevoorzitter @nl
alternative label: Spolupředsedkyně @cs

Signatory
type: Concept
preferred label: Υπογράφων @el
preferred label: Aláíró fél @hu
alternative label: Firmataria @it
definition: A person who signs a document.
alternative label: Parakstītāja @lv
preferred label: Pasirašęs @lt
alternative label: Podpisnica @sl
alternative label: Firmatarja @mt
preferred label: Parakstītājs @lv
preferred label: Allekirjoittaja @fi
preferred label: Podpisnik @sl
alternative label: Υπογράφουσα @el
preferred label: Semnatar @ro
preferred label: Signataire @fr
preferred label: Unterzeichner @de
preferred label: Ondertekenaar @nl
alternative label: Signatária @pt
in scheme: EP taxonomy on roles.
preferred label: Podpisovateľ @sk
deprecated: false
preferred label: Sínitheoir @ga
preferred label: Signatario @es
alternative label: Potpisnica @hr
preferred label: Упълномощените @bg
alternative label: Pasirašiusi @lt
alternative label: Pasirašantis asmuo @lt
preferred label: Potpisnik @hr
preferred label: Esindaja @et
preferred label: Osoba podpisująca @pl
top concept of: EP taxonomy on roles.
alternative label: Semnatară @ro
preferred label: Podepsaná osoba @cs
alternative label: Signataria @es
preferred label: Befullmäktigad @sv
preferred label: Signatário @pt
alternative label: Podpisovateľka @sk
preferred label: Firmatarju @mt
created: 2023-10-31
preferred label: Firmatario @it
preferred label: Befuldmægtigede @da
alternative label: Unterzeichnerin @de

President of the European Economic and Social Committee
type: Concept
preferred label: Az Európai Gazdasági és Szociális Bizottság elnöke @hu
preferred label: Europos ekonomikos ir socialinių reikalų komiteto pirmininkas @lt
definition: President of the economic and social committee.
preferred label: Председател на Европейския икономически и социален комитет @bg
preferred label: Euroopan talous- ja sosiaalikomitean puheenjohtaja @fi
preferred label: Presidente del Comité Económico y Social Europeo @es
alternative label: Predsjednica Europskog gospodarskog i socijalnog odbora @hr
alternative label: Președinta Comitetului Economic și social European @ro
alternative label: Predsedníčka Európskeho hospodárskeho a sociálneho výboru @sk
preferred label: Predsjednik Europskog gospodarskog i socijalnog odbora @hr
preferred label: Formand for Det Europæiske Økonomiske og Sociale Udvalg @da
broader: Председател
alternative label: Przewodnicząca Europejskiego Komitetu Ekonomiczno-Społecznego @pl
preferred label: Presidente do Comité Económico e Social Europeu @pt
preferred label: Predseda Európskeho hospodárskeho a sociálneho výboru @sk
preferred label: Voorzitter van het Europees Economisch en Sociaal Comité @nl
preferred label: Předseda Evropského hospodářského a sociálního výboru @cs
preferred label: Predsednik Evropskega ekonomsko-socialnega odbora @sl
preferred label: Presidente del Comitato economico e sociale europeo @it
alternative label: Predsednica Evropskega ekonomsko-socialnega odbora @sl
preferred label: Uachtarán Choiste Eacnamaíoch agus Sóisialta na hEorpa @ga
preferred label: Europeiska ekonomiska och sociala kommitténs ordförande @sv
alternative label: Europos ekonomikos ir socialinių reikalų komiteto pirmininkė @lt
preferred label: Președintele Comitetului Economic și Social European @ro
preferred label: Präsident des Wirtschafts- und Sozialausschusses @de
in scheme: EP taxonomy on roles.
alternative label: Presidenta del Comité Económico y Social Europeo @es
preferred label: Euroopa Majandus- ja Sotsiaalkomitee president @et
preferred label: Przewodniczący Europejskiego Komitetu Ekonomiczno-Społecznego @pl
alternative label: Présidente du Comité économique et social européen @fr
preferred label: Président du Comité économique et social européen @fr
alternative label: Eiropas Ekonomikas un sociālo lietu komitejas priekšsēdētāja @lv
alternative label: Předsedkyně Evropského hospodářského a sociálního výboru @cs
preferred label: Eiropas Ekonomikas un sociālo lietu komitejas priekšsēdētājs @lv
deprecated: false
preferred label: Πρόεδρος της Ευρωπαϊκής Οικονομικής και Κοινωνικής Επιτροπής @el
preferred label: President tal-Kumitat Ekonomiku u Soċjali Ewropew @mt
alternative label: Präsidentin des Wirtschafts- und Sozialausschusses @de
created: 2023-10-31

Rapporteur – Chair on behalf of a committee
type: Concept
preferred label: Raportöör – esimees parlamendikomisjoni nimel @et
preferred label: Föredragande – ordförande på ett utskotts vägnar @sv
deprecated: false
preferred label: Raportor – președinte în numele unei comisii @ro
preferred label: Rapporteur — President f’isem kumitat @mt
preferred label: Ordfører — formand på vegne af et udvalg @da
preferred label: Relatore — presidente a nome di una commissione @it
preferred label: Izvjestitelj – predsjednik u ime odbora @hr
preferred label: Pranešėjas – komiteto pirmininkas @lt
preferred label: Sprawozdawca – przewodniczący w imieniu komisji @pl
preferred label: Zpravodaj – předseda jménem výboru @cs
preferred label: Relator — presidente em nome de uma comissão @pt
preferred label: Rapporteur — voorzitter namens een commissie @nl
preferred label: Berichterstatter – Vorsitzender im Namen eines Ausschusses @de
preferred label: Rapóirtéir — Cathaoirleach thar ceann coiste @ga
definition: A person who reports in the name of being the chair of the committee.
preferred label: Poročevalec – predsednik v imenu odbora @sl
preferred label: Spravodajca – predsedajúci v mene výboru @sk
type: ParticipationRole
broad match: RAPP
preferred label: Ponente — Presidente en nombre de una comisión @es
preferred label: Rapporteur — président au nom d’une commission @fr
preferred label: Εισηγητής — πρόεδρος εξ ονόματος επιτροπής @el
preferred label: Докладчик — председател от името на комисия @bg
broader: Rapporteur
preferred label: Referents — priekšsēdētājs komitejas vārdā @lv
in scheme: EP taxonomy on roles.
created: 2025-01-31
preferred label: Esittelijä – puheenjohtaja valiokunnan puolesta @fi
preferred label: Előadó – A bizottság elnöke @hu

Kvestorius
type: Role
alternative label: Kvæstor i Europa-Parlamente @da
alternative label: Quästorin @de
alternative label: Kvestor v Evropskem parlamentu @sl
preferred label: Kvæstor @da
alternative label: Euroopa Parlamendi kvestor @et
alternative label: Kvestorica, Europski parlament @hr
in scheme: EP taxonomy on roles.
alternative label: Questora @pt
alternative label: Quaestor, Európai Parlament @hu
alternative label: Kvestor vid Europaparlamentet @sv
alternative label: Questora do Parlamento Europeu @pt
alternative label: Questor do Parlamento Europeu @pt
alternative label: Questore al Parlamento europeo @it
alternative label: Kwestor Parlamentu Europejskiego @pl
alternative label: Kvestorka Európskeho parlamentu @sk
alternative label: Kvestor Evropského parlamentu @cs
preferred label: Kvestors @lv
preferred label: Quaestor
alternative label: Quästor des Europäischen Parlaments @de
top concept of: EP taxonomy on roles.
alternative label: Kvestorica @hr
definition: Quaestor is a person responsible for administrative and financial matters directly concerning Members.
alternative label: Quästorin des Europäischen Parlaments @de
alternative label: Cuestora del Parlamento Europeo @es
type: Concept
preferred label: Questore @it
alternative label: Kvestor Európskeho parlamentu @sk
preferred label: Chestor @ro
alternative label: Kvestorica v Evropskem parlamentu @sl
alternative label: Kvestorka Evropského parlamentu @cs
preferred label: Κοσμήτορας @el
alternative label: Kwestor @pl
preferred label: Caestóir @ga
alternative label: Chestor în Parlamentul Europe @ro
alternative label: Cuestor del Parlamento Europeo @es
alternative label: Kvestor, Europski parlament @hr
alternative label: Europos Parlamento kvestorius @lt
alternative label: Europos Parlamento kvestorė @lt
alternative label: Quaestor van het Europees Parlement @nl
alternative label: Caestóir, Parlaimint na hEorpa @ga
preferred label: Questeur @fr
alternative label: Quaestor, European Parliament
alternative label: Kvestorka @cs
alternative label: Квестор в Европейския парламент @bg
alternative label: Questrice au Parlement européen @fr
preferred label: Kvestor @sl
preferred label: Questor @pt
alternative label: Kwestur, Parlament Ewropew @mt
alternative label: Eiropas Parlamenta kvestors @lv
alternative label: Questeur au Parlement européen @fr
alternative label: Κοσμήτορας του Ευρωπαϊκού Κοινοβουλίου @el
preferred label: Квестор @bg
type: CapacityRole
alternative label: Kvestorė @lt
preferred label: Kvestori @fi
alternative label: Cuestora @es
preferred label: Quästor @de
preferred label: Kwestur @mt
alternative label: Questrice @fr
deprecated: false
created: 2023-10-31
preferred label: Cuestor @es
alternative label: Euroopan parlamentin kvestori @fi

Permanent representatives
type: Concept
preferred label: Representantes permanentes @pt
alternative label: Stalne predstavnice @sl
preferred label: Alalised esindajad @et
preferred label: Постоянни представители @bg
preferred label: Rappresentanti permanenti @it
preferred label: Reprezentanți permanenți @ro
preferred label: Représentants permanents @fr
preferred label: Stalni predstavniki @sl
preferred label: Pysyvät edustajat @fi
preferred label: Stáli zástupcovia @sk
preferred label: Pastāvīgie pārstāvji @lv
preferred label: Állandó képviselők @hu
preferred label: Ständige Vertreter @de
preferred label: De Faste Repræsentanter @da
preferred label: Permanente vertegenwoordigers @nl
preferred label: Μόνιμοι Αντιπρόσωποι @el
preferred label: Ständiga representanterna @sv
alternative label: COREPER
preferred label: Representantes Permanentes @es
preferred label: Ir-Rappreżentanti permanenti @mt
deprecated: false
preferred label: Stálí zástupci @cs
preferred label: Stali przedstawiciele @pl
broader: Representative
preferred label: Nuolatiniai atstovai @lt
preferred label: Buanionadaithe @ga
in scheme: EP taxonomy on roles.
definition: National officials from member states who act as their country's ambassador to the European Union.
created: 2023-10-31
preferred label: Stalni predstavnici @hr